You are viewing a plain text version of this content. The canonical link for it is here.
Posted to dev@lucene.apache.org by Policeman Jenkins Server <je...@thetaphi.de> on 2016/01/01 19:14:37 UTC
[JENKINS] Lucene-Solr-trunk-Linux (32bit/jdk1.8.0_66) - Build #
15403 - Failure!
Build: http://jenkins.thetaphi.de/job/Lucene-Solr-trunk-Linux/15403/
Java: 32bit/jdk1.8.0_66 -client -XX:+UseParallelGC
3 tests failed.
FAILED: junit.framework.TestSuite.org.apache.solr.cloud.CollectionsAPIDistributedZkTest
Error Message:
6 threads leaked from SUITE scope at org.apache.solr.cloud.CollectionsAPIDistributedZkTest: 1) Thread[id=5456, name=zkCallback-809-thread-2, state=TIMED_WAITING, group=TGRP-CollectionsAPIDistributedZkTest] at sun.misc.Unsafe.park(Native Method) at java.util.concurrent.locks.LockSupport.parkNanos(LockSupport.java:215) at java.util.concurrent.SynchronousQueue$TransferStack.awaitFulfill(SynchronousQueue.java:460) at java.util.concurrent.SynchronousQueue$TransferStack.transfer(SynchronousQueue.java:362) at java.util.concurrent.SynchronousQueue.poll(SynchronousQueue.java:941) at java.util.concurrent.ThreadPoolExecutor.getTask(ThreadPoolExecutor.java:1066) at java.util.concurrent.ThreadPoolExecutor.runWorker(ThreadPoolExecutor.java:1127) at java.util.concurrent.ThreadPoolExecutor$Worker.run(ThreadPoolExecutor.java:617) at java.lang.Thread.run(Thread.java:745) 2) Thread[id=5366, name=TEST-CollectionsAPIDistributedZkTest.test-seed#[DED63AA96EBEC1B7]-EventThread, state=WAITING, group=TGRP-CollectionsAPIDistributedZkTest] at sun.misc.Unsafe.park(Native Method) at java.util.concurrent.locks.LockSupport.park(LockSupport.java:175) at java.util.concurrent.locks.AbstractQueuedSynchronizer$ConditionObject.await(AbstractQueuedSynchronizer.java:2039) at java.util.concurrent.LinkedBlockingQueue.take(LinkedBlockingQueue.java:442) at org.apache.zookeeper.ClientCnxn$EventThread.run(ClientCnxn.java:494) 3) Thread[id=5365, name=TEST-CollectionsAPIDistributedZkTest.test-seed#[DED63AA96EBEC1B7]-SendThread(127.0.0.1:52353), state=TIMED_WAITING, group=TGRP-CollectionsAPIDistributedZkTest] at java.lang.Thread.sleep(Native Method) at org.apache.zookeeper.client.StaticHostProvider.next(StaticHostProvider.java:101) at org.apache.zookeeper.ClientCnxn$SendThread.startConnect(ClientCnxn.java:940) at org.apache.zookeeper.ClientCnxn$SendThread.run(ClientCnxn.java:1003) 4) Thread[id=5459, name=zkCallback-809-thread-3, state=TIMED_WAITING, group=TGRP-CollectionsAPIDistributedZkTest] at sun.misc.Unsafe.park(Native Method) at java.util.concurrent.locks.LockSupport.parkNanos(LockSupport.java:215) at java.util.concurrent.SynchronousQueue$TransferStack.awaitFulfill(SynchronousQueue.java:460) at java.util.concurrent.SynchronousQueue$TransferStack.transfer(SynchronousQueue.java:362) at java.util.concurrent.SynchronousQueue.poll(SynchronousQueue.java:941) at java.util.concurrent.ThreadPoolExecutor.getTask(ThreadPoolExecutor.java:1066) at java.util.concurrent.ThreadPoolExecutor.runWorker(ThreadPoolExecutor.java:1127) at java.util.concurrent.ThreadPoolExecutor$Worker.run(ThreadPoolExecutor.java:617) at java.lang.Thread.run(Thread.java:745) 5) Thread[id=5367, name=zkCallback-809-thread-1, state=TIMED_WAITING, group=TGRP-CollectionsAPIDistributedZkTest] at sun.misc.Unsafe.park(Native Method) at java.util.concurrent.locks.LockSupport.parkNanos(LockSupport.java:215) at java.util.concurrent.SynchronousQueue$TransferStack.awaitFulfill(SynchronousQueue.java:460) at java.util.concurrent.SynchronousQueue$TransferStack.transfer(SynchronousQueue.java:362) at java.util.concurrent.SynchronousQueue.poll(SynchronousQueue.java:941) at java.util.concurrent.ThreadPoolExecutor.getTask(ThreadPoolExecutor.java:1066) at java.util.concurrent.ThreadPoolExecutor.runWorker(ThreadPoolExecutor.java:1127) at java.util.concurrent.ThreadPoolExecutor$Worker.run(ThreadPoolExecutor.java:617) at java.lang.Thread.run(Thread.java:745) 6) Thread[id=5717, name=zkCallback-809-thread-4, state=TIMED_WAITING, group=TGRP-CollectionsAPIDistributedZkTest] at sun.misc.Unsafe.park(Native Method) at java.util.concurrent.locks.LockSupport.parkNanos(LockSupport.java:215) at java.util.concurrent.SynchronousQueue$TransferStack.awaitFulfill(SynchronousQueue.java:460) at java.util.concurrent.SynchronousQueue$TransferStack.transfer(SynchronousQueue.java:362) at java.util.concurrent.SynchronousQueue.poll(SynchronousQueue.java:941) at java.util.concurrent.ThreadPoolExecutor.getTask(ThreadPoolExecutor.java:1066) at java.util.concurrent.ThreadPoolExecutor.runWorker(ThreadPoolExecutor.java:1127) at java.util.concurrent.ThreadPoolExecutor$Worker.run(ThreadPoolExecutor.java:617) at java.lang.Thread.run(Thread.java:745)
Stack Trace:
com.carrotsearch.randomizedtesting.ThreadLeakError: 6 threads leaked from SUITE scope at org.apache.solr.cloud.CollectionsAPIDistributedZkTest:
1) Thread[id=5456, name=zkCallback-809-thread-2, state=TIMED_WAITING, group=TGRP-CollectionsAPIDistributedZkTest]
at sun.misc.Unsafe.park(Native Method)
at java.util.concurrent.locks.LockSupport.parkNanos(LockSupport.java:215)
at java.util.concurrent.SynchronousQueue$TransferStack.awaitFulfill(SynchronousQueue.java:460)
at java.util.concurrent.SynchronousQueue$TransferStack.transfer(SynchronousQueue.java:362)
at java.util.concurrent.SynchronousQueue.poll(SynchronousQueue.java:941)
at java.util.concurrent.ThreadPoolExecutor.getTask(ThreadPoolExecutor.java:1066)
at java.util.concurrent.ThreadPoolExecutor.runWorker(ThreadPoolExecutor.java:1127)
at java.util.concurrent.ThreadPoolExecutor$Worker.run(ThreadPoolExecutor.java:617)
at java.lang.Thread.run(Thread.java:745)
2) Thread[id=5366, name=TEST-CollectionsAPIDistributedZkTest.test-seed#[DED63AA96EBEC1B7]-EventThread, state=WAITING, group=TGRP-CollectionsAPIDistributedZkTest]
at sun.misc.Unsafe.park(Native Method)
at java.util.concurrent.locks.LockSupport.park(LockSupport.java:175)
at java.util.concurrent.locks.AbstractQueuedSynchronizer$ConditionObject.await(AbstractQueuedSynchronizer.java:2039)
at java.util.concurrent.LinkedBlockingQueue.take(LinkedBlockingQueue.java:442)
at org.apache.zookeeper.ClientCnxn$EventThread.run(ClientCnxn.java:494)
3) Thread[id=5365, name=TEST-CollectionsAPIDistributedZkTest.test-seed#[DED63AA96EBEC1B7]-SendThread(127.0.0.1:52353), state=TIMED_WAITING, group=TGRP-CollectionsAPIDistributedZkTest]
at java.lang.Thread.sleep(Native Method)
at org.apache.zookeeper.client.StaticHostProvider.next(StaticHostProvider.java:101)
at org.apache.zookeeper.ClientCnxn$SendThread.startConnect(ClientCnxn.java:940)
at org.apache.zookeeper.ClientCnxn$SendThread.run(ClientCnxn.java:1003)
4) Thread[id=5459, name=zkCallback-809-thread-3, state=TIMED_WAITING, group=TGRP-CollectionsAPIDistributedZkTest]
at sun.misc.Unsafe.park(Native Method)
at java.util.concurrent.locks.LockSupport.parkNanos(LockSupport.java:215)
at java.util.concurrent.SynchronousQueue$TransferStack.awaitFulfill(SynchronousQueue.java:460)
at java.util.concurrent.SynchronousQueue$TransferStack.transfer(SynchronousQueue.java:362)
at java.util.concurrent.SynchronousQueue.poll(SynchronousQueue.java:941)
at java.util.concurrent.ThreadPoolExecutor.getTask(ThreadPoolExecutor.java:1066)
at java.util.concurrent.ThreadPoolExecutor.runWorker(ThreadPoolExecutor.java:1127)
at java.util.concurrent.ThreadPoolExecutor$Worker.run(ThreadPoolExecutor.java:617)
at java.lang.Thread.run(Thread.java:745)
5) Thread[id=5367, name=zkCallback-809-thread-1, state=TIMED_WAITING, group=TGRP-CollectionsAPIDistributedZkTest]
at sun.misc.Unsafe.park(Native Method)
at java.util.concurrent.locks.LockSupport.parkNanos(LockSupport.java:215)
at java.util.concurrent.SynchronousQueue$TransferStack.awaitFulfill(SynchronousQueue.java:460)
at java.util.concurrent.SynchronousQueue$TransferStack.transfer(SynchronousQueue.java:362)
at java.util.concurrent.SynchronousQueue.poll(SynchronousQueue.java:941)
at java.util.concurrent.ThreadPoolExecutor.getTask(ThreadPoolExecutor.java:1066)
at java.util.concurrent.ThreadPoolExecutor.runWorker(ThreadPoolExecutor.java:1127)
at java.util.concurrent.ThreadPoolExecutor$Worker.run(ThreadPoolExecutor.java:617)
at java.lang.Thread.run(Thread.java:745)
6) Thread[id=5717, name=zkCallback-809-thread-4, state=TIMED_WAITING, group=TGRP-CollectionsAPIDistributedZkTest]
at sun.misc.Unsafe.park(Native Method)
at java.util.concurrent.locks.LockSupport.parkNanos(LockSupport.java:215)
at java.util.concurrent.SynchronousQueue$TransferStack.awaitFulfill(SynchronousQueue.java:460)
at java.util.concurrent.SynchronousQueue$TransferStack.transfer(SynchronousQueue.java:362)
at java.util.concurrent.SynchronousQueue.poll(SynchronousQueue.java:941)
at java.util.concurrent.ThreadPoolExecutor.getTask(ThreadPoolExecutor.java:1066)
at java.util.concurrent.ThreadPoolExecutor.runWorker(ThreadPoolExecutor.java:1127)
at java.util.concurrent.ThreadPoolExecutor$Worker.run(ThreadPoolExecutor.java:617)
at java.lang.Thread.run(Thread.java:745)
at __randomizedtesting.SeedInfo.seed([DED63AA96EBEC1B7]:0)
FAILED: junit.framework.TestSuite.org.apache.solr.cloud.CollectionsAPIDistributedZkTest
Error Message:
There are still zombie threads that couldn't be terminated: 1) Thread[id=5456, name=zkCallback-809-thread-2, state=TIMED_WAITING, group=TGRP-CollectionsAPIDistributedZkTest] at sun.misc.Unsafe.park(Native Method) at java.util.concurrent.locks.LockSupport.parkNanos(LockSupport.java:215) at java.util.concurrent.SynchronousQueue$TransferStack.awaitFulfill(SynchronousQueue.java:460) at java.util.concurrent.SynchronousQueue$TransferStack.transfer(SynchronousQueue.java:362) at java.util.concurrent.SynchronousQueue.poll(SynchronousQueue.java:941) at java.util.concurrent.ThreadPoolExecutor.getTask(ThreadPoolExecutor.java:1066) at java.util.concurrent.ThreadPoolExecutor.runWorker(ThreadPoolExecutor.java:1127) at java.util.concurrent.ThreadPoolExecutor$Worker.run(ThreadPoolExecutor.java:617) at java.lang.Thread.run(Thread.java:745) 2) Thread[id=5365, name=TEST-CollectionsAPIDistributedZkTest.test-seed#[DED63AA96EBEC1B7]-SendThread(127.0.0.1:52353), state=TIMED_WAITING, group=TGRP-CollectionsAPIDistributedZkTest] at java.lang.Thread.sleep(Native Method) at org.apache.zookeeper.ClientCnxn$SendThread.run(ClientCnxn.java:994) 3) Thread[id=5459, name=zkCallback-809-thread-3, state=TIMED_WAITING, group=TGRP-CollectionsAPIDistributedZkTest] at sun.misc.Unsafe.park(Native Method) at java.util.concurrent.locks.LockSupport.parkNanos(LockSupport.java:215) at java.util.concurrent.SynchronousQueue$TransferStack.awaitFulfill(SynchronousQueue.java:460) at java.util.concurrent.SynchronousQueue$TransferStack.transfer(SynchronousQueue.java:362) at java.util.concurrent.SynchronousQueue.poll(SynchronousQueue.java:941) at java.util.concurrent.ThreadPoolExecutor.getTask(ThreadPoolExecutor.java:1066) at java.util.concurrent.ThreadPoolExecutor.runWorker(ThreadPoolExecutor.java:1127) at java.util.concurrent.ThreadPoolExecutor$Worker.run(ThreadPoolExecutor.java:617) at java.lang.Thread.run(Thread.java:745) 4) Thread[id=5367, name=zkCallback-809-thread-1, state=TIMED_WAITING, group=TGRP-CollectionsAPIDistributedZkTest] at sun.misc.Unsafe.park(Native Method) at java.util.concurrent.locks.LockSupport.parkNanos(LockSupport.java:215) at java.util.concurrent.SynchronousQueue$TransferStack.awaitFulfill(SynchronousQueue.java:460) at java.util.concurrent.SynchronousQueue$TransferStack.transfer(SynchronousQueue.java:362) at java.util.concurrent.SynchronousQueue.poll(SynchronousQueue.java:941) at java.util.concurrent.ThreadPoolExecutor.getTask(ThreadPoolExecutor.java:1066) at java.util.concurrent.ThreadPoolExecutor.runWorker(ThreadPoolExecutor.java:1127) at java.util.concurrent.ThreadPoolExecutor$Worker.run(ThreadPoolExecutor.java:617) at java.lang.Thread.run(Thread.java:745) 5) Thread[id=5717, name=zkCallback-809-thread-4, state=TIMED_WAITING, group=TGRP-CollectionsAPIDistributedZkTest] at sun.misc.Unsafe.park(Native Method) at java.util.concurrent.locks.LockSupport.parkNanos(LockSupport.java:215) at java.util.concurrent.SynchronousQueue$TransferStack.awaitFulfill(SynchronousQueue.java:460) at java.util.concurrent.SynchronousQueue$TransferStack.transfer(SynchronousQueue.java:362) at java.util.concurrent.SynchronousQueue.poll(SynchronousQueue.java:941) at java.util.concurrent.ThreadPoolExecutor.getTask(ThreadPoolExecutor.java:1066) at java.util.concurrent.ThreadPoolExecutor.runWorker(ThreadPoolExecutor.java:1127) at java.util.concurrent.ThreadPoolExecutor$Worker.run(ThreadPoolExecutor.java:617) at java.lang.Thread.run(Thread.java:745)
Stack Trace:
com.carrotsearch.randomizedtesting.ThreadLeakError: There are still zombie threads that couldn't be terminated:
1) Thread[id=5456, name=zkCallback-809-thread-2, state=TIMED_WAITING, group=TGRP-CollectionsAPIDistributedZkTest]
at sun.misc.Unsafe.park(Native Method)
at java.util.concurrent.locks.LockSupport.parkNanos(LockSupport.java:215)
at java.util.concurrent.SynchronousQueue$TransferStack.awaitFulfill(SynchronousQueue.java:460)
at java.util.concurrent.SynchronousQueue$TransferStack.transfer(SynchronousQueue.java:362)
at java.util.concurrent.SynchronousQueue.poll(SynchronousQueue.java:941)
at java.util.concurrent.ThreadPoolExecutor.getTask(ThreadPoolExecutor.java:1066)
at java.util.concurrent.ThreadPoolExecutor.runWorker(ThreadPoolExecutor.java:1127)
at java.util.concurrent.ThreadPoolExecutor$Worker.run(ThreadPoolExecutor.java:617)
at java.lang.Thread.run(Thread.java:745)
2) Thread[id=5365, name=TEST-CollectionsAPIDistributedZkTest.test-seed#[DED63AA96EBEC1B7]-SendThread(127.0.0.1:52353), state=TIMED_WAITING, group=TGRP-CollectionsAPIDistributedZkTest]
at java.lang.Thread.sleep(Native Method)
at org.apache.zookeeper.ClientCnxn$SendThread.run(ClientCnxn.java:994)
3) Thread[id=5459, name=zkCallback-809-thread-3, state=TIMED_WAITING, group=TGRP-CollectionsAPIDistributedZkTest]
at sun.misc.Unsafe.park(Native Method)
at java.util.concurrent.locks.LockSupport.parkNanos(LockSupport.java:215)
at java.util.concurrent.SynchronousQueue$TransferStack.awaitFulfill(SynchronousQueue.java:460)
at java.util.concurrent.SynchronousQueue$TransferStack.transfer(SynchronousQueue.java:362)
at java.util.concurrent.SynchronousQueue.poll(SynchronousQueue.java:941)
at java.util.concurrent.ThreadPoolExecutor.getTask(ThreadPoolExecutor.java:1066)
at java.util.concurrent.ThreadPoolExecutor.runWorker(ThreadPoolExecutor.java:1127)
at java.util.concurrent.ThreadPoolExecutor$Worker.run(ThreadPoolExecutor.java:617)
at java.lang.Thread.run(Thread.java:745)
4) Thread[id=5367, name=zkCallback-809-thread-1, state=TIMED_WAITING, group=TGRP-CollectionsAPIDistributedZkTest]
at sun.misc.Unsafe.park(Native Method)
at java.util.concurrent.locks.LockSupport.parkNanos(LockSupport.java:215)
at java.util.concurrent.SynchronousQueue$TransferStack.awaitFulfill(SynchronousQueue.java:460)
at java.util.concurrent.SynchronousQueue$TransferStack.transfer(SynchronousQueue.java:362)
at java.util.concurrent.SynchronousQueue.poll(SynchronousQueue.java:941)
at java.util.concurrent.ThreadPoolExecutor.getTask(ThreadPoolExecutor.java:1066)
at java.util.concurrent.ThreadPoolExecutor.runWorker(ThreadPoolExecutor.java:1127)
at java.util.concurrent.ThreadPoolExecutor$Worker.run(ThreadPoolExecutor.java:617)
at java.lang.Thread.run(Thread.java:745)
5) Thread[id=5717, name=zkCallback-809-thread-4, state=TIMED_WAITING, group=TGRP-CollectionsAPIDistributedZkTest]
at sun.misc.Unsafe.park(Native Method)
at java.util.concurrent.locks.LockSupport.parkNanos(LockSupport.java:215)
at java.util.concurrent.SynchronousQueue$TransferStack.awaitFulfill(SynchronousQueue.java:460)
at java.util.concurrent.SynchronousQueue$TransferStack.transfer(SynchronousQueue.java:362)
at java.util.concurrent.SynchronousQueue.poll(SynchronousQueue.java:941)
at java.util.concurrent.ThreadPoolExecutor.getTask(ThreadPoolExecutor.java:1066)
at java.util.concurrent.ThreadPoolExecutor.runWorker(ThreadPoolExecutor.java:1127)
at java.util.concurrent.ThreadPoolExecutor$Worker.run(ThreadPoolExecutor.java:617)
at java.lang.Thread.run(Thread.java:745)
at __randomizedtesting.SeedInfo.seed([DED63AA96EBEC1B7]:0)
FAILED: org.apache.solr.cloud.CollectionsAPIDistributedZkTest.test
Error Message:
Error from server at http://127.0.0.1:35867/acollectionafterbaddelete: non ok status: 500, message:Server Error
Stack Trace:
org.apache.solr.client.solrj.impl.HttpSolrClient$RemoteSolrException: Error from server at http://127.0.0.1:35867/acollectionafterbaddelete: non ok status: 500, message:Server Error
at __randomizedtesting.SeedInfo.seed([DED63AA96EBEC1B7:56820573C042AC4F]:0)
at org.apache.solr.client.solrj.impl.HttpSolrClient.executeMethod(HttpSolrClient.java:509)
at org.apache.solr.client.solrj.impl.HttpSolrClient.request(HttpSolrClient.java:241)
at org.apache.solr.client.solrj.impl.HttpSolrClient.request(HttpSolrClient.java:230)
at org.apache.solr.client.solrj.SolrRequest.process(SolrRequest.java:150)
at org.apache.solr.client.solrj.SolrClient.query(SolrClient.java:943)
at org.apache.solr.client.solrj.SolrClient.query(SolrClient.java:958)
at org.apache.solr.cloud.AbstractFullDistribZkTestBase.waitForNon403or404or503(AbstractFullDistribZkTestBase.java:1754)
at org.apache.solr.cloud.CollectionsAPIDistributedZkTest.testCollectionsAPI(CollectionsAPIDistributedZkTest.java:802)
at org.apache.solr.cloud.CollectionsAPIDistributedZkTest.test(CollectionsAPIDistributedZkTest.java:160)
at sun.reflect.NativeMethodAccessorImpl.invoke0(Native Method)
at sun.reflect.NativeMethodAccessorImpl.invoke(NativeMethodAccessorImpl.java:62)
at sun.reflect.DelegatingMethodAccessorImpl.invoke(DelegatingMethodAccessorImpl.java:43)
at java.lang.reflect.Method.invoke(Method.java:497)
at com.carrotsearch.randomizedtesting.RandomizedRunner.invoke(RandomizedRunner.java:1764)
at com.carrotsearch.randomizedtesting.RandomizedRunner$8.evaluate(RandomizedRunner.java:871)
at com.carrotsearch.randomizedtesting.RandomizedRunner$9.evaluate(RandomizedRunner.java:907)
at com.carrotsearch.randomizedtesting.RandomizedRunner$10.evaluate(RandomizedRunner.java:921)
at org.apache.solr.BaseDistributedSearchTestCase$ShardsRepeatRule$ShardsFixedStatement.callStatement(BaseDistributedSearchTestCase.java:965)
at org.apache.solr.BaseDistributedSearchTestCase$ShardsRepeatRule$ShardsStatement.evaluate(BaseDistributedSearchTestCase.java:940)
at com.carrotsearch.randomizedtesting.rules.SystemPropertiesRestoreRule$1.evaluate(SystemPropertiesRestoreRule.java:57)
at org.apache.lucene.util.TestRuleSetupTeardownChained$1.evaluate(TestRuleSetupTeardownChained.java:50)
at org.apache.lucene.util.AbstractBeforeAfterRule$1.evaluate(AbstractBeforeAfterRule.java:46)
at org.apache.lucene.util.TestRuleThreadAndTestName$1.evaluate(TestRuleThreadAndTestName.java:49)
at org.apache.lucene.util.TestRuleIgnoreAfterMaxFailures$1.evaluate(TestRuleIgnoreAfterMaxFailures.java:65)
at org.apache.lucene.util.TestRuleMarkFailure$1.evaluate(TestRuleMarkFailure.java:48)
at com.carrotsearch.randomizedtesting.rules.StatementAdapter.evaluate(StatementAdapter.java:36)
at com.carrotsearch.randomizedtesting.ThreadLeakControl$StatementRunner.run(ThreadLeakControl.java:367)
at com.carrotsearch.randomizedtesting.ThreadLeakControl.forkTimeoutingTask(ThreadLeakControl.java:809)
at com.carrotsearch.randomizedtesting.ThreadLeakControl$3.evaluate(ThreadLeakControl.java:460)
at com.carrotsearch.randomizedtesting.RandomizedRunner.runSingleTest(RandomizedRunner.java:880)
at com.carrotsearch.randomizedtesting.RandomizedRunner$5.evaluate(RandomizedRunner.java:781)
at com.carrotsearch.randomizedtesting.RandomizedRunner$6.evaluate(RandomizedRunner.java:816)
at com.carrotsearch.randomizedtesting.RandomizedRunner$7.evaluate(RandomizedRunner.java:827)
at com.carrotsearch.randomizedtesting.rules.StatementAdapter.evaluate(StatementAdapter.java:36)
at com.carrotsearch.randomizedtesting.rules.SystemPropertiesRestoreRule$1.evaluate(SystemPropertiesRestoreRule.java:57)
at org.apache.lucene.util.AbstractBeforeAfterRule$1.evaluate(AbstractBeforeAfterRule.java:46)
at com.carrotsearch.randomizedtesting.rules.StatementAdapter.evaluate(StatementAdapter.java:36)
at org.apache.lucene.util.TestRuleStoreClassName$1.evaluate(TestRuleStoreClassName.java:42)
at com.carrotsearch.randomizedtesting.rules.NoShadowingOrOverridesOnMethodsRule$1.evaluate(NoShadowingOrOverridesOnMethodsRule.java:40)
at com.carrotsearch.randomizedtesting.rules.NoShadowingOrOverridesOnMethodsRule$1.evaluate(NoShadowingOrOverridesOnMethodsRule.java:40)
at com.carrotsearch.randomizedtesting.rules.StatementAdapter.evaluate(StatementAdapter.java:36)
at com.carrotsearch.randomizedtesting.rules.StatementAdapter.evaluate(StatementAdapter.java:36)
at com.carrotsearch.randomizedtesting.rules.StatementAdapter.evaluate(StatementAdapter.java:36)
at org.apache.lucene.util.TestRuleAssertionsRequired$1.evaluate(TestRuleAssertionsRequired.java:54)
at org.apache.lucene.util.TestRuleMarkFailure$1.evaluate(TestRuleMarkFailure.java:48)
at org.apache.lucene.util.TestRuleIgnoreAfterMaxFailures$1.evaluate(TestRuleIgnoreAfterMaxFailures.java:65)
at org.apache.lucene.util.TestRuleIgnoreTestSuites$1.evaluate(TestRuleIgnoreTestSuites.java:55)
at com.carrotsearch.randomizedtesting.rules.StatementAdapter.evaluate(StatementAdapter.java:36)
at com.carrotsearch.randomizedtesting.ThreadLeakControl$StatementRunner.run(ThreadLeakControl.java:367)
at java.lang.Thread.run(Thread.java:745)
Build Log:
[...truncated 10380 lines...]
[junit4] Suite: org.apache.solr.cloud.CollectionsAPIDistributedZkTest
[junit4] 2> Creating dataDir: /home/jenkins/workspace/Lucene-Solr-trunk-Linux/solr/build/solr-core/test/J1/temp/solr.cloud.CollectionsAPIDistributedZkTest_DED63AA96EBEC1B7-001/init-core-data-001
[junit4] 2> 740415 INFO (SUITE-CollectionsAPIDistributedZkTest-seed#[DED63AA96EBEC1B7]-worker) [ ] o.a.s.SolrTestCaseJ4 Randomized ssl (false) and clientAuth (true)
[junit4] 2> 740415 INFO (SUITE-CollectionsAPIDistributedZkTest-seed#[DED63AA96EBEC1B7]-worker) [ ] o.a.s.BaseDistributedSearchTestCase Setting hostContext system property: /
[junit4] 2> 740420 INFO (TEST-CollectionsAPIDistributedZkTest.test-seed#[DED63AA96EBEC1B7]) [ ] o.a.s.c.ZkTestServer STARTING ZK TEST SERVER
[junit4] 2> 740420 INFO (Thread-2277) [ ] o.a.s.c.ZkTestServer client port:0.0.0.0/0.0.0.0:0
[junit4] 2> 740420 INFO (Thread-2277) [ ] o.a.s.c.ZkTestServer Starting server
[junit4] 2> 740520 INFO (TEST-CollectionsAPIDistributedZkTest.test-seed#[DED63AA96EBEC1B7]) [ ] o.a.s.c.ZkTestServer start zk server on port:52353
[junit4] 2> 740520 INFO (TEST-CollectionsAPIDistributedZkTest.test-seed#[DED63AA96EBEC1B7]) [ ] o.a.s.c.c.SolrZkClient Using default ZkCredentialsProvider
[junit4] 2> 740521 INFO (TEST-CollectionsAPIDistributedZkTest.test-seed#[DED63AA96EBEC1B7]) [ ] o.a.s.c.c.ConnectionManager Waiting for client to connect to ZooKeeper
[junit4] 2> 740523 INFO (zkCallback-773-thread-1) [ ] o.a.s.c.c.ConnectionManager Watcher org.apache.solr.common.cloud.ConnectionManager@197b6fd name:ZooKeeperConnection Watcher:127.0.0.1:52353 got event WatchedEvent state:SyncConnected type:None path:null path:null type:None
[junit4] 2> 740523 INFO (TEST-CollectionsAPIDistributedZkTest.test-seed#[DED63AA96EBEC1B7]) [ ] o.a.s.c.c.ConnectionManager Client is connected to ZooKeeper
[junit4] 2> 740524 INFO (TEST-CollectionsAPIDistributedZkTest.test-seed#[DED63AA96EBEC1B7]) [ ] o.a.s.c.c.SolrZkClient Using default ZkACLProvider
[junit4] 2> 740524 INFO (TEST-CollectionsAPIDistributedZkTest.test-seed#[DED63AA96EBEC1B7]) [ ] o.a.s.c.c.SolrZkClient makePath: /solr
[junit4] 2> 740527 INFO (TEST-CollectionsAPIDistributedZkTest.test-seed#[DED63AA96EBEC1B7]) [ ] o.a.s.c.c.SolrZkClient Using default ZkCredentialsProvider
[junit4] 2> 740527 INFO (TEST-CollectionsAPIDistributedZkTest.test-seed#[DED63AA96EBEC1B7]) [ ] o.a.s.c.c.ConnectionManager Waiting for client to connect to ZooKeeper
[junit4] 2> 740528 INFO (zkCallback-774-thread-1) [ ] o.a.s.c.c.ConnectionManager Watcher org.apache.solr.common.cloud.ConnectionManager@940641 name:ZooKeeperConnection Watcher:127.0.0.1:52353/solr got event WatchedEvent state:SyncConnected type:None path:null path:null type:None
[junit4] 2> 740528 INFO (TEST-CollectionsAPIDistributedZkTest.test-seed#[DED63AA96EBEC1B7]) [ ] o.a.s.c.c.ConnectionManager Client is connected to ZooKeeper
[junit4] 2> 740529 INFO (TEST-CollectionsAPIDistributedZkTest.test-seed#[DED63AA96EBEC1B7]) [ ] o.a.s.c.c.SolrZkClient Using default ZkACLProvider
[junit4] 2> 740529 INFO (TEST-CollectionsAPIDistributedZkTest.test-seed#[DED63AA96EBEC1B7]) [ ] o.a.s.c.c.SolrZkClient makePath: /collections/collection1
[junit4] 2> 740530 INFO (TEST-CollectionsAPIDistributedZkTest.test-seed#[DED63AA96EBEC1B7]) [ ] o.a.s.c.c.SolrZkClient makePath: /collections/collection1/shards
[junit4] 2> 740531 INFO (TEST-CollectionsAPIDistributedZkTest.test-seed#[DED63AA96EBEC1B7]) [ ] o.a.s.c.c.SolrZkClient makePath: /collections/control_collection
[junit4] 2> 740532 INFO (TEST-CollectionsAPIDistributedZkTest.test-seed#[DED63AA96EBEC1B7]) [ ] o.a.s.c.c.SolrZkClient makePath: /collections/control_collection/shards
[junit4] 2> 740533 INFO (TEST-CollectionsAPIDistributedZkTest.test-seed#[DED63AA96EBEC1B7]) [ ] o.a.s.c.AbstractZkTestCase put /home/jenkins/workspace/Lucene-Solr-trunk-Linux/solr/core/src/test-files/solr/collection1/conf/solrconfig-tlog.xml to /configs/conf1/solrconfig.xml
[junit4] 2> 740533 INFO (TEST-CollectionsAPIDistributedZkTest.test-seed#[DED63AA96EBEC1B7]) [ ] o.a.s.c.c.SolrZkClient makePath: /configs/conf1/solrconfig.xml
[junit4] 2> 740535 INFO (TEST-CollectionsAPIDistributedZkTest.test-seed#[DED63AA96EBEC1B7]) [ ] o.a.s.c.AbstractZkTestCase put /home/jenkins/workspace/Lucene-Solr-trunk-Linux/solr/core/src/test-files/solr/collection1/conf/schema.xml to /configs/conf1/schema.xml
[junit4] 2> 740535 INFO (TEST-CollectionsAPIDistributedZkTest.test-seed#[DED63AA96EBEC1B7]) [ ] o.a.s.c.c.SolrZkClient makePath: /configs/conf1/schema.xml
[junit4] 2> 740537 INFO (TEST-CollectionsAPIDistributedZkTest.test-seed#[DED63AA96EBEC1B7]) [ ] o.a.s.c.AbstractZkTestCase put /home/jenkins/workspace/Lucene-Solr-trunk-Linux/solr/core/src/test-files/solr/collection1/conf/solrconfig.snippet.randomindexconfig.xml to /configs/conf1/solrconfig.snippet.randomindexconfig.xml
[junit4] 2> 740537 INFO (TEST-CollectionsAPIDistributedZkTest.test-seed#[DED63AA96EBEC1B7]) [ ] o.a.s.c.c.SolrZkClient makePath: /configs/conf1/solrconfig.snippet.randomindexconfig.xml
[junit4] 2> 740538 INFO (TEST-CollectionsAPIDistributedZkTest.test-seed#[DED63AA96EBEC1B7]) [ ] o.a.s.c.AbstractZkTestCase put /home/jenkins/workspace/Lucene-Solr-trunk-Linux/solr/core/src/test-files/solr/collection1/conf/stopwords.txt to /configs/conf1/stopwords.txt
[junit4] 2> 740538 INFO (TEST-CollectionsAPIDistributedZkTest.test-seed#[DED63AA96EBEC1B7]) [ ] o.a.s.c.c.SolrZkClient makePath: /configs/conf1/stopwords.txt
[junit4] 2> 740539 INFO (TEST-CollectionsAPIDistributedZkTest.test-seed#[DED63AA96EBEC1B7]) [ ] o.a.s.c.AbstractZkTestCase put /home/jenkins/workspace/Lucene-Solr-trunk-Linux/solr/core/src/test-files/solr/collection1/conf/protwords.txt to /configs/conf1/protwords.txt
[junit4] 2> 740539 INFO (TEST-CollectionsAPIDistributedZkTest.test-seed#[DED63AA96EBEC1B7]) [ ] o.a.s.c.c.SolrZkClient makePath: /configs/conf1/protwords.txt
[junit4] 2> 740540 INFO (TEST-CollectionsAPIDistributedZkTest.test-seed#[DED63AA96EBEC1B7]) [ ] o.a.s.c.AbstractZkTestCase put /home/jenkins/workspace/Lucene-Solr-trunk-Linux/solr/core/src/test-files/solr/collection1/conf/currency.xml to /configs/conf1/currency.xml
[junit4] 2> 740540 INFO (TEST-CollectionsAPIDistributedZkTest.test-seed#[DED63AA96EBEC1B7]) [ ] o.a.s.c.c.SolrZkClient makePath: /configs/conf1/currency.xml
[junit4] 2> 740541 INFO (TEST-CollectionsAPIDistributedZkTest.test-seed#[DED63AA96EBEC1B7]) [ ] o.a.s.c.AbstractZkTestCase put /home/jenkins/workspace/Lucene-Solr-trunk-Linux/solr/core/src/test-files/solr/collection1/conf/enumsConfig.xml to /configs/conf1/enumsConfig.xml
[junit4] 2> 740541 INFO (TEST-CollectionsAPIDistributedZkTest.test-seed#[DED63AA96EBEC1B7]) [ ] o.a.s.c.c.SolrZkClient makePath: /configs/conf1/enumsConfig.xml
[junit4] 2> 740542 INFO (TEST-CollectionsAPIDistributedZkTest.test-seed#[DED63AA96EBEC1B7]) [ ] o.a.s.c.AbstractZkTestCase put /home/jenkins/workspace/Lucene-Solr-trunk-Linux/solr/core/src/test-files/solr/collection1/conf/open-exchange-rates.json to /configs/conf1/open-exchange-rates.json
[junit4] 2> 740542 INFO (TEST-CollectionsAPIDistributedZkTest.test-seed#[DED63AA96EBEC1B7]) [ ] o.a.s.c.c.SolrZkClient makePath: /configs/conf1/open-exchange-rates.json
[junit4] 2> 740543 INFO (TEST-CollectionsAPIDistributedZkTest.test-seed#[DED63AA96EBEC1B7]) [ ] o.a.s.c.AbstractZkTestCase put /home/jenkins/workspace/Lucene-Solr-trunk-Linux/solr/core/src/test-files/solr/collection1/conf/mapping-ISOLatin1Accent.txt to /configs/conf1/mapping-ISOLatin1Accent.txt
[junit4] 2> 740543 INFO (TEST-CollectionsAPIDistributedZkTest.test-seed#[DED63AA96EBEC1B7]) [ ] o.a.s.c.c.SolrZkClient makePath: /configs/conf1/mapping-ISOLatin1Accent.txt
[junit4] 2> 740544 INFO (TEST-CollectionsAPIDistributedZkTest.test-seed#[DED63AA96EBEC1B7]) [ ] o.a.s.c.AbstractZkTestCase put /home/jenkins/workspace/Lucene-Solr-trunk-Linux/solr/core/src/test-files/solr/collection1/conf/old_synonyms.txt to /configs/conf1/old_synonyms.txt
[junit4] 2> 740544 INFO (TEST-CollectionsAPIDistributedZkTest.test-seed#[DED63AA96EBEC1B7]) [ ] o.a.s.c.c.SolrZkClient makePath: /configs/conf1/old_synonyms.txt
[junit4] 2> 740545 INFO (TEST-CollectionsAPIDistributedZkTest.test-seed#[DED63AA96EBEC1B7]) [ ] o.a.s.c.AbstractZkTestCase put /home/jenkins/workspace/Lucene-Solr-trunk-Linux/solr/core/src/test-files/solr/collection1/conf/synonyms.txt to /configs/conf1/synonyms.txt
[junit4] 2> 740545 INFO (TEST-CollectionsAPIDistributedZkTest.test-seed#[DED63AA96EBEC1B7]) [ ] o.a.s.c.c.SolrZkClient makePath: /configs/conf1/synonyms.txt
[junit4] 2> 740618 INFO (TEST-CollectionsAPIDistributedZkTest.test-seed#[DED63AA96EBEC1B7]) [ ] o.a.s.SolrTestCaseJ4 Writing core.properties file to /home/jenkins/workspace/Lucene-Solr-trunk-Linux/solr/build/solr-core/test/J1/temp/solr.cloud.CollectionsAPIDistributedZkTest_DED63AA96EBEC1B7-001/control-001/cores/collection1
[junit4] 2> 740620 INFO (TEST-CollectionsAPIDistributedZkTest.test-seed#[DED63AA96EBEC1B7]) [ ] o.e.j.s.Server jetty-9.3.6.v20151106
[junit4] 2> 740621 INFO (TEST-CollectionsAPIDistributedZkTest.test-seed#[DED63AA96EBEC1B7]) [ ] o.e.j.s.h.ContextHandler Started o.e.j.s.ServletContextHandler@1d667c8{/,null,AVAILABLE}
[junit4] 2> 740626 INFO (TEST-CollectionsAPIDistributedZkTest.test-seed#[DED63AA96EBEC1B7]) [ ] o.e.j.s.ServerConnector Started ServerConnector@1e1096e{HTTP/1.1,[http/1.1]}{127.0.0.1:50894}
[junit4] 2> 740626 INFO (TEST-CollectionsAPIDistributedZkTest.test-seed#[DED63AA96EBEC1B7]) [ ] o.e.j.s.Server Started @741784ms
[junit4] 2> 740626 INFO (TEST-CollectionsAPIDistributedZkTest.test-seed#[DED63AA96EBEC1B7]) [ ] o.a.s.c.s.e.JettySolrRunner Jetty properties: {solr.data.dir=/home/jenkins/workspace/Lucene-Solr-trunk-Linux/solr/build/solr-core/test/J1/temp/solr.cloud.CollectionsAPIDistributedZkTest_DED63AA96EBEC1B7-001/tempDir-001/control/data, hostContext=/, hostPort=50894, coreRootDirectory=/home/jenkins/workspace/Lucene-Solr-trunk-Linux/solr/build/solr-core/test/J1/temp/solr.cloud.CollectionsAPIDistributedZkTest_DED63AA96EBEC1B7-001/control-001/cores}
[junit4] 2> 740627 INFO (TEST-CollectionsAPIDistributedZkTest.test-seed#[DED63AA96EBEC1B7]) [ ] o.a.s.s.SolrDispatchFilter SolrDispatchFilter.init(): sun.misc.Launcher$AppClassLoader@e2f2a
[junit4] 2> 740627 INFO (TEST-CollectionsAPIDistributedZkTest.test-seed#[DED63AA96EBEC1B7]) [ ] o.a.s.c.SolrResourceLoader new SolrResourceLoader for directory: '/home/jenkins/workspace/Lucene-Solr-trunk-Linux/solr/build/solr-core/test/J1/temp/solr.cloud.CollectionsAPIDistributedZkTest_DED63AA96EBEC1B7-001/control-001'
[junit4] 2> 740627 INFO (TEST-CollectionsAPIDistributedZkTest.test-seed#[DED63AA96EBEC1B7]) [ ] o.a.s.c.SolrResourceLoader JNDI not configured for solr (NoInitialContextEx)
[junit4] 2> 740627 INFO (TEST-CollectionsAPIDistributedZkTest.test-seed#[DED63AA96EBEC1B7]) [ ] o.a.s.c.SolrResourceLoader solr home defaulted to 'solr/' (could not find system property or JNDI)
[junit4] 2> 740627 INFO (TEST-CollectionsAPIDistributedZkTest.test-seed#[DED63AA96EBEC1B7]) [ ] o.a.s.c.c.SolrZkClient Using default ZkCredentialsProvider
[junit4] 2> 740628 INFO (TEST-CollectionsAPIDistributedZkTest.test-seed#[DED63AA96EBEC1B7]) [ ] o.a.s.c.c.ConnectionManager Waiting for client to connect to ZooKeeper
[junit4] 2> 740629 INFO (zkCallback-775-thread-1) [ ] o.a.s.c.c.ConnectionManager Watcher org.apache.solr.common.cloud.ConnectionManager@d67c0c name:ZooKeeperConnection Watcher:127.0.0.1:52353/solr got event WatchedEvent state:SyncConnected type:None path:null path:null type:None
[junit4] 2> 740629 INFO (TEST-CollectionsAPIDistributedZkTest.test-seed#[DED63AA96EBEC1B7]) [ ] o.a.s.c.c.ConnectionManager Client is connected to ZooKeeper
[junit4] 2> 740634 INFO (TEST-CollectionsAPIDistributedZkTest.test-seed#[DED63AA96EBEC1B7]) [ ] o.a.s.c.c.SolrZkClient Using default ZkACLProvider
[junit4] 2> 740637 INFO (TEST-CollectionsAPIDistributedZkTest.test-seed#[DED63AA96EBEC1B7]) [ ] o.a.s.s.SolrDispatchFilter Loading solr.xml from SolrHome (not found in ZooKeeper)
[junit4] 2> 740637 INFO (TEST-CollectionsAPIDistributedZkTest.test-seed#[DED63AA96EBEC1B7]) [ ] o.a.s.c.SolrXmlConfig Loading container configuration from /home/jenkins/workspace/Lucene-Solr-trunk-Linux/solr/build/solr-core/test/J1/temp/solr.cloud.CollectionsAPIDistributedZkTest_DED63AA96EBEC1B7-001/control-001/solr.xml
[junit4] 2> 740644 INFO (TEST-CollectionsAPIDistributedZkTest.test-seed#[DED63AA96EBEC1B7]) [ ] o.a.s.c.CorePropertiesLocator Config-defined core root directory: /home/jenkins/workspace/Lucene-Solr-trunk-Linux/solr/build/solr-core/test/J1/temp/solr.cloud.CollectionsAPIDistributedZkTest_DED63AA96EBEC1B7-001/control-001/cores
[junit4] 2> 740644 INFO (TEST-CollectionsAPIDistributedZkTest.test-seed#[DED63AA96EBEC1B7]) [ ] o.a.s.c.CoreContainer New CoreContainer 12099148
[junit4] 2> 740644 INFO (TEST-CollectionsAPIDistributedZkTest.test-seed#[DED63AA96EBEC1B7]) [ ] o.a.s.c.CoreContainer Loading cores into CoreContainer [instanceDir=/home/jenkins/workspace/Lucene-Solr-trunk-Linux/solr/build/solr-core/test/J1/temp/solr.cloud.CollectionsAPIDistributedZkTest_DED63AA96EBEC1B7-001/control-001]
[junit4] 2> 740645 WARN (TEST-CollectionsAPIDistributedZkTest.test-seed#[DED63AA96EBEC1B7]) [ ] o.a.s.c.CoreContainer Couldn't add files from /home/jenkins/workspace/Lucene-Solr-trunk-Linux/solr/build/solr-core/test/J1/temp/solr.cloud.CollectionsAPIDistributedZkTest_DED63AA96EBEC1B7-001/control-001/lib to classpath: /home/jenkins/workspace/Lucene-Solr-trunk-Linux/solr/build/solr-core/test/J1/temp/solr.cloud.CollectionsAPIDistributedZkTest_DED63AA96EBEC1B7-001/control-001/lib
[junit4] 2> 740645 INFO (TEST-CollectionsAPIDistributedZkTest.test-seed#[DED63AA96EBEC1B7]) [ ] o.a.s.h.c.HttpShardHandlerFactory created with socketTimeout : 90000,urlScheme : ,connTimeout : 15000,maxConnectionsPerHost : 20,maxConnections : 10000,corePoolSize : 0,maximumPoolSize : 2147483647,maxThreadIdleTime : 5,sizeOfQueue : -1,fairnessPolicy : false,useRetries : false,
[junit4] 2> 740646 INFO (TEST-CollectionsAPIDistributedZkTest.test-seed#[DED63AA96EBEC1B7]) [ ] o.a.s.u.UpdateShardHandler Creating UpdateShardHandler HTTP client with params: socketTimeout=340000&connTimeout=45000&retry=true
[junit4] 2> 740646 INFO (TEST-CollectionsAPIDistributedZkTest.test-seed#[DED63AA96EBEC1B7]) [ ] o.a.s.l.LogWatcher SLF4J impl is org.slf4j.impl.Log4jLoggerFactory
[junit4] 2> 740646 INFO (TEST-CollectionsAPIDistributedZkTest.test-seed#[DED63AA96EBEC1B7]) [ ] o.a.s.l.LogWatcher Registering Log Listener [Log4j (org.slf4j.impl.Log4jLoggerFactory)]
[junit4] 2> 740646 INFO (TEST-CollectionsAPIDistributedZkTest.test-seed#[DED63AA96EBEC1B7]) [ ] o.a.s.c.ZkContainer Zookeeper client=127.0.0.1:52353/solr
[junit4] 2> 740646 INFO (TEST-CollectionsAPIDistributedZkTest.test-seed#[DED63AA96EBEC1B7]) [ ] o.a.s.c.ZkController zkHost includes chroot
[junit4] 2> 740646 INFO (TEST-CollectionsAPIDistributedZkTest.test-seed#[DED63AA96EBEC1B7]) [ ] o.a.s.c.c.SolrZkClient Using default ZkCredentialsProvider
[junit4] 2> 740648 INFO (TEST-CollectionsAPIDistributedZkTest.test-seed#[DED63AA96EBEC1B7]) [ ] o.a.s.c.c.ConnectionManager Waiting for client to connect to ZooKeeper
[junit4] 2> 740649 INFO (zkCallback-778-thread-1) [ ] o.a.s.c.c.ConnectionManager Watcher org.apache.solr.common.cloud.ConnectionManager@1f3fa76 name:ZooKeeperConnection Watcher:127.0.0.1:52353 got event WatchedEvent state:SyncConnected type:None path:null path:null type:None
[junit4] 2> 740649 INFO (TEST-CollectionsAPIDistributedZkTest.test-seed#[DED63AA96EBEC1B7]) [ ] o.a.s.c.c.ConnectionManager Client is connected to ZooKeeper
[junit4] 2> 740649 INFO (TEST-CollectionsAPIDistributedZkTest.test-seed#[DED63AA96EBEC1B7]) [ ] o.a.s.c.c.SolrZkClient Using default ZkACLProvider
[junit4] 2> 740651 INFO (TEST-CollectionsAPIDistributedZkTest.test-seed#[DED63AA96EBEC1B7]) [n:127.0.0.1:50894_ ] o.a.s.c.c.ConnectionManager Waiting for client to connect to ZooKeeper
[junit4] 2> 740652 INFO (zkCallback-779-thread-1-processing-n:127.0.0.1:50894_) [n:127.0.0.1:50894_ ] o.a.s.c.c.ConnectionManager Watcher org.apache.solr.common.cloud.ConnectionManager@c02b3d name:ZooKeeperConnection Watcher:127.0.0.1:52353/solr got event WatchedEvent state:SyncConnected type:None path:null path:null type:None
[junit4] 2> 740652 INFO (TEST-CollectionsAPIDistributedZkTest.test-seed#[DED63AA96EBEC1B7]) [n:127.0.0.1:50894_ ] o.a.s.c.c.ConnectionManager Client is connected to ZooKeeper
[junit4] 2> 740653 INFO (TEST-CollectionsAPIDistributedZkTest.test-seed#[DED63AA96EBEC1B7]) [n:127.0.0.1:50894_ ] o.a.s.c.c.SolrZkClient makePath: /overseer/queue
[junit4] 2> 740655 INFO (TEST-CollectionsAPIDistributedZkTest.test-seed#[DED63AA96EBEC1B7]) [n:127.0.0.1:50894_ ] o.a.s.c.c.SolrZkClient makePath: /overseer/collection-queue-work
[junit4] 2> 740657 INFO (TEST-CollectionsAPIDistributedZkTest.test-seed#[DED63AA96EBEC1B7]) [n:127.0.0.1:50894_ ] o.a.s.c.c.SolrZkClient makePath: /overseer/collection-map-running
[junit4] 2> 740658 INFO (TEST-CollectionsAPIDistributedZkTest.test-seed#[DED63AA96EBEC1B7]) [n:127.0.0.1:50894_ ] o.a.s.c.c.SolrZkClient makePath: /overseer/collection-map-completed
[junit4] 2> 740659 INFO (TEST-CollectionsAPIDistributedZkTest.test-seed#[DED63AA96EBEC1B7]) [n:127.0.0.1:50894_ ] o.a.s.c.c.SolrZkClient makePath: /overseer/collection-map-failure
[junit4] 2> 740660 INFO (TEST-CollectionsAPIDistributedZkTest.test-seed#[DED63AA96EBEC1B7]) [n:127.0.0.1:50894_ ] o.a.s.c.c.SolrZkClient makePath: /live_nodes
[junit4] 2> 740661 INFO (TEST-CollectionsAPIDistributedZkTest.test-seed#[DED63AA96EBEC1B7]) [n:127.0.0.1:50894_ ] o.a.s.c.c.SolrZkClient makePath: /aliases.json
[junit4] 2> 740662 INFO (TEST-CollectionsAPIDistributedZkTest.test-seed#[DED63AA96EBEC1B7]) [n:127.0.0.1:50894_ ] o.a.s.c.c.SolrZkClient makePath: /clusterstate.json
[junit4] 2> 740663 INFO (TEST-CollectionsAPIDistributedZkTest.test-seed#[DED63AA96EBEC1B7]) [n:127.0.0.1:50894_ ] o.a.s.c.c.SolrZkClient makePath: /security.json
[junit4] 2> 740663 INFO (TEST-CollectionsAPIDistributedZkTest.test-seed#[DED63AA96EBEC1B7]) [n:127.0.0.1:50894_ ] o.a.s.c.ZkController Register node as live in ZooKeeper:/live_nodes/127.0.0.1:50894_
[junit4] 2> 740663 INFO (TEST-CollectionsAPIDistributedZkTest.test-seed#[DED63AA96EBEC1B7]) [n:127.0.0.1:50894_ ] o.a.s.c.c.SolrZkClient makePath: /live_nodes/127.0.0.1:50894_
[junit4] 2> 740664 INFO (TEST-CollectionsAPIDistributedZkTest.test-seed#[DED63AA96EBEC1B7]) [n:127.0.0.1:50894_ ] o.a.s.c.c.SolrZkClient makePath: /overseer_elect
[junit4] 2> 740665 INFO (TEST-CollectionsAPIDistributedZkTest.test-seed#[DED63AA96EBEC1B7]) [n:127.0.0.1:50894_ ] o.a.s.c.c.SolrZkClient makePath: /overseer_elect/election
[junit4] 2> 740665 INFO (TEST-CollectionsAPIDistributedZkTest.test-seed#[DED63AA96EBEC1B7]) [n:127.0.0.1:50894_ ] o.a.s.c.Overseer Overseer (id=null) closing
[junit4] 2> 740666 INFO (TEST-CollectionsAPIDistributedZkTest.test-seed#[DED63AA96EBEC1B7]) [n:127.0.0.1:50894_ ] o.a.s.c.LeaderElector Joined leadership election with path: /overseer_elect/election/95136768788332548-127.0.0.1:50894_-n_0000000000
[junit4] 2> 740666 INFO (TEST-CollectionsAPIDistributedZkTest.test-seed#[DED63AA96EBEC1B7]) [n:127.0.0.1:50894_ ] o.a.s.c.OverseerElectionContext I am going to be the leader 127.0.0.1:50894_
[junit4] 2> 740666 INFO (TEST-CollectionsAPIDistributedZkTest.test-seed#[DED63AA96EBEC1B7]) [n:127.0.0.1:50894_ ] o.a.s.c.c.SolrZkClient makePath: /overseer_elect/leader
[junit4] 2> 740667 INFO (TEST-CollectionsAPIDistributedZkTest.test-seed#[DED63AA96EBEC1B7]) [n:127.0.0.1:50894_ ] o.a.s.c.Overseer Overseer (id=95136768788332548-127.0.0.1:50894_-n_0000000000) starting
[junit4] 2> 740669 INFO (TEST-CollectionsAPIDistributedZkTest.test-seed#[DED63AA96EBEC1B7]) [n:127.0.0.1:50894_ ] o.a.s.c.c.SolrZkClient makePath: /overseer/queue-work
[junit4] 2> 740672 INFO (TEST-CollectionsAPIDistributedZkTest.test-seed#[DED63AA96EBEC1B7]) [n:127.0.0.1:50894_ ] o.a.s.c.OverseerAutoReplicaFailoverThread Starting OverseerAutoReplicaFailoverThread autoReplicaFailoverWorkLoopDelay=10000 autoReplicaFailoverWaitAfterExpiration=10000 autoReplicaFailoverBadNodeExpiration=60000
[junit4] 2> 740672 INFO (OverseerCollectionConfigSetProcessor-95136768788332548-127.0.0.1:50894_-n_0000000000) [n:127.0.0.1:50894_ ] o.a.s.c.OverseerTaskProcessor Process current queue of overseer operations
[junit4] 2> 740672 INFO (TEST-CollectionsAPIDistributedZkTest.test-seed#[DED63AA96EBEC1B7]) [n:127.0.0.1:50894_ ] o.a.s.c.c.ZkStateReader Updating cluster state from ZooKeeper...
[junit4] 2> 740672 INFO (OverseerStateUpdate-95136768788332548-127.0.0.1:50894_-n_0000000000) [n:127.0.0.1:50894_ ] o.a.s.c.Overseer Starting to work on the main queue
[junit4] 2> 740740 INFO (TEST-CollectionsAPIDistributedZkTest.test-seed#[DED63AA96EBEC1B7]) [n:127.0.0.1:50894_ ] o.a.s.c.CoreContainer Security conf doesn't exist. Skipping setup for authorization module.
[junit4] 2> 740740 INFO (TEST-CollectionsAPIDistributedZkTest.test-seed#[DED63AA96EBEC1B7]) [n:127.0.0.1:50894_ ] o.a.s.c.CoreContainer No authentication plugin used.
[junit4] 2> 740741 INFO (TEST-CollectionsAPIDistributedZkTest.test-seed#[DED63AA96EBEC1B7]) [n:127.0.0.1:50894_ ] o.a.s.c.CorePropertiesLocator Looking for core definitions underneath /home/jenkins/workspace/Lucene-Solr-trunk-Linux/solr/build/solr-core/test/J1/temp/solr.cloud.CollectionsAPIDistributedZkTest_DED63AA96EBEC1B7-001/control-001/cores
[junit4] 2> 740742 INFO (TEST-CollectionsAPIDistributedZkTest.test-seed#[DED63AA96EBEC1B7]) [n:127.0.0.1:50894_ ] o.a.s.c.CoreDescriptor Created CoreDescriptor: {name=collection1, config=solrconfig.xml, transient=false, schema=schema.xml, loadOnStartup=true, configSetProperties=configsetprops.json, collection=control_collection, coreNodeName=, dataDir=data/, shard=}
[junit4] 2> 740742 INFO (TEST-CollectionsAPIDistributedZkTest.test-seed#[DED63AA96EBEC1B7]) [n:127.0.0.1:50894_ ] o.a.s.c.CorePropertiesLocator Found core collection1 in /home/jenkins/workspace/Lucene-Solr-trunk-Linux/solr/build/solr-core/test/J1/temp/solr.cloud.CollectionsAPIDistributedZkTest_DED63AA96EBEC1B7-001/control-001/cores/collection1
[junit4] 2> 740742 INFO (TEST-CollectionsAPIDistributedZkTest.test-seed#[DED63AA96EBEC1B7]) [n:127.0.0.1:50894_ ] o.a.s.c.CorePropertiesLocator Found 1 core definitions
[junit4] 2> 740743 INFO (TEST-CollectionsAPIDistributedZkTest.test-seed#[DED63AA96EBEC1B7]) [n:127.0.0.1:50894_ ] o.a.s.s.SolrDispatchFilter user.dir=/home/jenkins/workspace/Lucene-Solr-trunk-Linux/solr/build/solr-core/test/J1
[junit4] 2> 740743 INFO (TEST-CollectionsAPIDistributedZkTest.test-seed#[DED63AA96EBEC1B7]) [n:127.0.0.1:50894_ ] o.a.s.s.SolrDispatchFilter SolrDispatchFilter.init() done
[junit4] 2> 740743 INFO (coreLoadExecutor-2754-thread-1-processing-n:127.0.0.1:50894_) [n:127.0.0.1:50894_ c:control_collection x:collection1] o.a.s.c.ZkController publishing state=down
[junit4] 2> 740743 INFO (coreLoadExecutor-2754-thread-1-processing-n:127.0.0.1:50894_) [n:127.0.0.1:50894_ c:control_collection x:collection1] o.a.s.c.ZkController numShards not found on descriptor - reading it from system property
[junit4] 2> 740744 INFO (OverseerStateUpdate-95136768788332548-127.0.0.1:50894_-n_0000000000) [n:127.0.0.1:50894_ ] o.a.s.c.Overseer processMessage: queueSize: 1, message = {
[junit4] 2> "core":"collection1",
[junit4] 2> "roles":null,
[junit4] 2> "base_url":"http://127.0.0.1:50894",
[junit4] 2> "node_name":"127.0.0.1:50894_",
[junit4] 2> "numShards":"1",
[junit4] 2> "state":"down",
[junit4] 2> "shard":null,
[junit4] 2> "collection":"control_collection",
[junit4] 2> "operation":"state"} current state version: 0
[junit4] 2> 740745 INFO (coreLoadExecutor-2754-thread-1-processing-n:127.0.0.1:50894_) [n:127.0.0.1:50894_ c:control_collection x:collection1] o.a.s.c.ZkController look for our core node name
[junit4] 2> 740745 INFO (OverseerStateUpdate-95136768788332548-127.0.0.1:50894_-n_0000000000) [n:127.0.0.1:50894_ ] o.a.s.c.o.ReplicaMutator Update state numShards=1 message={
[junit4] 2> "core":"collection1",
[junit4] 2> "roles":null,
[junit4] 2> "base_url":"http://127.0.0.1:50894",
[junit4] 2> "node_name":"127.0.0.1:50894_",
[junit4] 2> "numShards":"1",
[junit4] 2> "state":"down",
[junit4] 2> "shard":null,
[junit4] 2> "collection":"control_collection",
[junit4] 2> "operation":"state"}
[junit4] 2> 740745 INFO (OverseerStateUpdate-95136768788332548-127.0.0.1:50894_-n_0000000000) [n:127.0.0.1:50894_ ] o.a.s.c.o.ClusterStateMutator building a new cName: control_collection
[junit4] 2> 740745 INFO (OverseerStateUpdate-95136768788332548-127.0.0.1:50894_-n_0000000000) [n:127.0.0.1:50894_ ] o.a.s.c.o.ReplicaMutator Assigning new node to shard shard=shard1
[junit4] 2> 740746 INFO (zkCallback-779-thread-1-processing-n:127.0.0.1:50894_) [n:127.0.0.1:50894_ ] o.a.s.c.c.ZkStateReader A cluster state change: [WatchedEvent state:SyncConnected type:NodeDataChanged path:/clusterstate.json], has occurred - updating... (live nodes size: [1])
[junit4] 2> 741745 INFO (coreLoadExecutor-2754-thread-1-processing-n:127.0.0.1:50894_) [n:127.0.0.1:50894_ c:control_collection x:collection1] o.a.s.c.ZkController waiting to find shard id in clusterstate for collection1
[junit4] 2> 741745 INFO (coreLoadExecutor-2754-thread-1-processing-n:127.0.0.1:50894_) [n:127.0.0.1:50894_ c:control_collection x:collection1] o.a.s.c.ZkController Check for collection zkNode:control_collection
[junit4] 2> 741746 INFO (coreLoadExecutor-2754-thread-1-processing-n:127.0.0.1:50894_) [n:127.0.0.1:50894_ c:control_collection x:collection1] o.a.s.c.ZkController Collection zkNode exists
[junit4] 2> 741746 INFO (coreLoadExecutor-2754-thread-1-processing-n:127.0.0.1:50894_) [n:127.0.0.1:50894_ c:control_collection x:collection1] o.a.s.c.c.ZkStateReader Load collection config from: [/collections/control_collection]
[junit4] 2> 741746 INFO (coreLoadExecutor-2754-thread-1-processing-n:127.0.0.1:50894_) [n:127.0.0.1:50894_ c:control_collection x:collection1] o.a.s.c.c.ZkStateReader path=[/collections/control_collection] [configName]=[conf1] specified config exists in ZooKeeper
[junit4] 2> 741746 INFO (coreLoadExecutor-2754-thread-1-processing-n:127.0.0.1:50894_) [n:127.0.0.1:50894_ c:control_collection x:collection1] o.a.s.c.SolrResourceLoader new SolrResourceLoader for directory: '/home/jenkins/workspace/Lucene-Solr-trunk-Linux/solr/build/solr-core/test/J1/temp/solr.cloud.CollectionsAPIDistributedZkTest_DED63AA96EBEC1B7-001/control-001/cores/collection1'
[junit4] 2> 741746 INFO (coreLoadExecutor-2754-thread-1-processing-n:127.0.0.1:50894_) [n:127.0.0.1:50894_ c:control_collection x:collection1] o.a.s.c.SolrResourceLoader JNDI not configured for solr (NoInitialContextEx)
[junit4] 2> 741746 INFO (coreLoadExecutor-2754-thread-1-processing-n:127.0.0.1:50894_) [n:127.0.0.1:50894_ c:control_collection x:collection1] o.a.s.c.SolrResourceLoader solr home defaulted to 'solr/' (could not find system property or JNDI)
[junit4] 2> 741748 INFO (coreLoadExecutor-2754-thread-1-processing-n:127.0.0.1:50894_) [n:127.0.0.1:50894_ c:control_collection x:collection1] o.a.s.c.Config loaded config solrconfig.xml with version 0
[junit4] 2> 741756 INFO (coreLoadExecutor-2754-thread-1-processing-n:127.0.0.1:50894_) [n:127.0.0.1:50894_ c:control_collection x:collection1] o.a.s.c.SolrConfig current version of requestparams : -1
[junit4] 2> 741762 INFO (coreLoadExecutor-2754-thread-1-processing-n:127.0.0.1:50894_) [n:127.0.0.1:50894_ c:control_collection x:collection1] o.a.s.c.SolrConfig Using Lucene MatchVersion: 6.0.0
[junit4] 2> 741775 INFO (coreLoadExecutor-2754-thread-1-processing-n:127.0.0.1:50894_) [n:127.0.0.1:50894_ c:control_collection x:collection1] o.a.s.c.SolrConfig Loaded SolrConfig: solrconfig.xml
[junit4] 2> 741789 INFO (coreLoadExecutor-2754-thread-1-processing-n:127.0.0.1:50894_) [n:127.0.0.1:50894_ c:control_collection x:collection1] o.a.s.s.IndexSchema [collection1] Schema name=test
[junit4] 2> 741929 INFO (coreLoadExecutor-2754-thread-1-processing-n:127.0.0.1:50894_) [n:127.0.0.1:50894_ c:control_collection x:collection1] o.a.s.s.OpenExchangeRatesOrgProvider Initialized with rates=open-exchange-rates.json, refreshInterval=1440.
[junit4] 2> 741935 INFO (coreLoadExecutor-2754-thread-1-processing-n:127.0.0.1:50894_) [n:127.0.0.1:50894_ c:control_collection x:collection1] o.a.s.s.IndexSchema default search field in schema is text
[junit4] 2> 741936 INFO (coreLoadExecutor-2754-thread-1-processing-n:127.0.0.1:50894_) [n:127.0.0.1:50894_ c:control_collection x:collection1] o.a.s.s.IndexSchema unique key field: id
[junit4] 2> 741946 INFO (coreLoadExecutor-2754-thread-1-processing-n:127.0.0.1:50894_) [n:127.0.0.1:50894_ c:control_collection x:collection1] o.a.s.s.FileExchangeRateProvider Reloading exchange rates from file currency.xml
[junit4] 2> 741948 INFO (coreLoadExecutor-2754-thread-1-processing-n:127.0.0.1:50894_) [n:127.0.0.1:50894_ c:control_collection x:collection1] o.a.s.s.FileExchangeRateProvider Reloading exchange rates from file currency.xml
[junit4] 2> 741950 INFO (coreLoadExecutor-2754-thread-1-processing-n:127.0.0.1:50894_) [n:127.0.0.1:50894_ c:control_collection x:collection1] o.a.s.s.OpenExchangeRatesOrgProvider Reloading exchange rates from open-exchange-rates.json
[junit4] 2> 741951 WARN (coreLoadExecutor-2754-thread-1-processing-n:127.0.0.1:50894_) [n:127.0.0.1:50894_ c:control_collection x:collection1] o.a.s.s.OpenExchangeRatesOrgProvider Unknown key IMPORTANT NOTE
[junit4] 2> 741951 WARN (coreLoadExecutor-2754-thread-1-processing-n:127.0.0.1:50894_) [n:127.0.0.1:50894_ c:control_collection x:collection1] o.a.s.s.OpenExchangeRatesOrgProvider Expected key, got STRING
[junit4] 2> 741951 INFO (coreLoadExecutor-2754-thread-1-processing-n:127.0.0.1:50894_) [n:127.0.0.1:50894_ c:control_collection x:collection1] o.a.s.s.OpenExchangeRatesOrgProvider Reloading exchange rates from open-exchange-rates.json
[junit4] 2> 741952 WARN (coreLoadExecutor-2754-thread-1-processing-n:127.0.0.1:50894_) [n:127.0.0.1:50894_ c:control_collection x:collection1] o.a.s.s.OpenExchangeRatesOrgProvider Unknown key IMPORTANT NOTE
[junit4] 2> 741952 WARN (coreLoadExecutor-2754-thread-1-processing-n:127.0.0.1:50894_) [n:127.0.0.1:50894_ c:control_collection x:collection1] o.a.s.s.OpenExchangeRatesOrgProvider Expected key, got STRING
[junit4] 2> 741952 INFO (coreLoadExecutor-2754-thread-1-processing-n:127.0.0.1:50894_) [n:127.0.0.1:50894_ c:control_collection x:collection1] o.a.s.c.ConfigSetProperties Did not find ConfigSet properties, assuming default properties: Can't find resource 'configsetprops.json' in classpath or '/configs/conf1', cwd=/home/jenkins/workspace/Lucene-Solr-trunk-Linux/solr/build/solr-core/test/J1
[junit4] 2> 741953 INFO (coreLoadExecutor-2754-thread-1-processing-n:127.0.0.1:50894_) [n:127.0.0.1:50894_ c:control_collection x:collection1] o.a.s.c.CoreContainer Creating SolrCore 'collection1' using configuration from collection control_collection
[junit4] 2> 741953 INFO (coreLoadExecutor-2754-thread-1-processing-n:127.0.0.1:50894_) [n:127.0.0.1:50894_ c:control_collection s:shard1 r:core_node1 x:collection1] o.a.s.c.SolrCore org.apache.solr.core.MockDirectoryFactory
[junit4] 2> 741953 INFO (coreLoadExecutor-2754-thread-1-processing-n:127.0.0.1:50894_) [n:127.0.0.1:50894_ c:control_collection s:shard1 r:core_node1 x:collection1] o.a.s.c.SolrCore [[collection1] ] Opening new SolrCore at [/home/jenkins/workspace/Lucene-Solr-trunk-Linux/solr/build/solr-core/test/J1/temp/solr.cloud.CollectionsAPIDistributedZkTest_DED63AA96EBEC1B7-001/control-001/cores/collection1], dataDir=[/home/jenkins/workspace/Lucene-Solr-trunk-Linux/solr/build/solr-core/test/J1/temp/solr.cloud.CollectionsAPIDistributedZkTest_DED63AA96EBEC1B7-001/control-001/cores/collection1/data/]
[junit4] 2> 741953 INFO (coreLoadExecutor-2754-thread-1-processing-n:127.0.0.1:50894_) [n:127.0.0.1:50894_ c:control_collection s:shard1 r:core_node1 x:collection1] o.a.s.c.JmxMonitoredMap JMX monitoring is enabled. Adding Solr mbeans to JMX Server: com.sun.jmx.mbeanserver.JmxMBeanServer@1ddf9da
[junit4] 2> 741954 INFO (coreLoadExecutor-2754-thread-1-processing-n:127.0.0.1:50894_) [n:127.0.0.1:50894_ c:control_collection s:shard1 r:core_node1 x:collection1] o.a.s.c.CachingDirectoryFactory return new directory for /home/jenkins/workspace/Lucene-Solr-trunk-Linux/solr/build/solr-core/test/J1/temp/solr.cloud.CollectionsAPIDistributedZkTest_DED63AA96EBEC1B7-001/control-001/cores/collection1/data
[junit4] 2> 741954 INFO (coreLoadExecutor-2754-thread-1-processing-n:127.0.0.1:50894_) [n:127.0.0.1:50894_ c:control_collection s:shard1 r:core_node1 x:collection1] o.a.s.c.SolrCore New index directory detected: old=null new=/home/jenkins/workspace/Lucene-Solr-trunk-Linux/solr/build/solr-core/test/J1/temp/solr.cloud.CollectionsAPIDistributedZkTest_DED63AA96EBEC1B7-001/control-001/cores/collection1/data/index/
[junit4] 2> 741954 WARN (coreLoadExecutor-2754-thread-1-processing-n:127.0.0.1:50894_) [n:127.0.0.1:50894_ c:control_collection s:shard1 r:core_node1 x:collection1] o.a.s.c.SolrCore [collection1] Solr index directory '/home/jenkins/workspace/Lucene-Solr-trunk-Linux/solr/build/solr-core/test/J1/temp/solr.cloud.CollectionsAPIDistributedZkTest_DED63AA96EBEC1B7-001/control-001/cores/collection1/data/index' doesn't exist. Creating new index...
[junit4] 2> 741954 INFO (coreLoadExecutor-2754-thread-1-processing-n:127.0.0.1:50894_) [n:127.0.0.1:50894_ c:control_collection s:shard1 r:core_node1 x:collection1] o.a.s.c.CachingDirectoryFactory return new directory for /home/jenkins/workspace/Lucene-Solr-trunk-Linux/solr/build/solr-core/test/J1/temp/solr.cloud.CollectionsAPIDistributedZkTest_DED63AA96EBEC1B7-001/control-001/cores/collection1/data/index
[junit4] 2> 741954 INFO (coreLoadExecutor-2754-thread-1-processing-n:127.0.0.1:50894_) [n:127.0.0.1:50894_ c:control_collection s:shard1 r:core_node1 x:collection1] o.a.s.u.RandomMergePolicy RandomMergePolicy wrapping class org.apache.lucene.index.TieredMergePolicy: [TieredMergePolicy: maxMergeAtOnce=39, maxMergeAtOnceExplicit=20, maxMergedSegmentMB=80.1640625, floorSegmentMB=0.4443359375, forceMergeDeletesPctAllowed=7.367120602587292, segmentsPerTier=23.0, maxCFSSegmentSizeMB=8.796093022207999E12, noCFSRatio=0.0
[junit4] 2> 741955 INFO (coreLoadExecutor-2754-thread-1-processing-n:127.0.0.1:50894_) [n:127.0.0.1:50894_ c:control_collection s:shard1 r:core_node1 x:collection1] o.a.s.c.SolrDeletionPolicy SolrDeletionPolicy.onCommit: commits: num=1
[junit4] 2> commit{dir=MockDirectoryWrapper(RAMDirectory@bbd40c lockFactory=org.apache.lucene.store.SingleInstanceLockFactory@fc68fe),segFN=segments_1,generation=1}
[junit4] 2> 741955 INFO (coreLoadExecutor-2754-thread-1-processing-n:127.0.0.1:50894_) [n:127.0.0.1:50894_ c:control_collection s:shard1 r:core_node1 x:collection1] o.a.s.c.SolrDeletionPolicy newest commit generation = 1
[junit4] 2> 741956 INFO (OldIndexDirectoryCleanupThreadForCore-collection1) [n:127.0.0.1:50894_ c:control_collection s:shard1 r:core_node1 x:collection1] o.a.s.c.SolrCore Looking for old index directories to cleanup for core collection1 in /home/jenkins/workspace/Lucene-Solr-trunk-Linux/solr/build/solr-core/test/J1/temp/solr.cloud.CollectionsAPIDistributedZkTest_DED63AA96EBEC1B7-001/control-001/cores/collection1/data/
[junit4] 2> 741956 WARN (OldIndexDirectoryCleanupThreadForCore-collection1) [n:127.0.0.1:50894_ c:control_collection s:shard1 r:core_node1 x:collection1] o.a.s.c.DirectoryFactory /home/jenkins/workspace/Lucene-Solr-trunk-Linux/solr/build/solr-core/test/J1/temp/solr.cloud.CollectionsAPIDistributedZkTest_DED63AA96EBEC1B7-001/control-001/cores/collection1/data/ does not point to a valid data directory; skipping clean-up of old index directories.
[junit4] 2> 741958 INFO (coreLoadExecutor-2754-thread-1-processing-n:127.0.0.1:50894_) [n:127.0.0.1:50894_ c:control_collection s:shard1 r:core_node1 x:collection1] o.a.s.u.p.UpdateRequestProcessorChain creating updateRequestProcessorChain "nodistrib"
[junit4] 2> 741958 INFO (coreLoadExecutor-2754-thread-1-processing-n:127.0.0.1:50894_) [n:127.0.0.1:50894_ c:control_collection s:shard1 r:core_node1 x:collection1] o.a.s.u.p.UpdateRequestProcessorChain creating updateRequestProcessorChain "dedupe"
[junit4] 2> 741958 INFO (coreLoadExecutor-2754-thread-1-processing-n:127.0.0.1:50894_) [n:127.0.0.1:50894_ c:control_collection s:shard1 r:core_node1 x:collection1] o.a.s.u.p.UpdateRequestProcessorChain inserting DistributedUpdateProcessorFactory into updateRequestProcessorChain "dedupe"
[junit4] 2> 741958 INFO (coreLoadExecutor-2754-thread-1-processing-n:127.0.0.1:50894_) [n:127.0.0.1:50894_ c:control_collection s:shard1 r:core_node1 x:collection1] o.a.s.u.p.UpdateRequestProcessorChain creating updateRequestProcessorChain "stored_sig"
[junit4] 2> 741958 INFO (coreLoadExecutor-2754-thread-1-processing-n:127.0.0.1:50894_) [n:127.0.0.1:50894_ c:control_collection s:shard1 r:core_node1 x:collection1] o.a.s.u.p.UpdateRequestProcessorChain inserting DistributedUpdateProcessorFactory into updateRequestProcessorChain "stored_sig"
[junit4] 2> 741958 INFO (coreLoadExecutor-2754-thread-1-processing-n:127.0.0.1:50894_) [n:127.0.0.1:50894_ c:control_collection s:shard1 r:core_node1 x:collection1] o.a.s.u.p.UpdateRequestProcessorChain creating updateRequestProcessorChain "distrib-dup-test-chain-explicit"
[junit4] 2> 741959 INFO (coreLoadExecutor-2754-thread-1-processing-n:127.0.0.1:50894_) [n:127.0.0.1:50894_ c:control_collection s:shard1 r:core_node1 x:collection1] o.a.s.u.p.UpdateRequestProcessorChain creating updateRequestProcessorChain "distrib-dup-test-chain-implicit"
[junit4] 2> 741959 INFO (coreLoadExecutor-2754-thread-1-processing-n:127.0.0.1:50894_) [n:127.0.0.1:50894_ c:control_collection s:shard1 r:core_node1 x:collection1] o.a.s.u.p.UpdateRequestProcessorChain inserting DistributedUpdateProcessorFactory into updateRequestProcessorChain "distrib-dup-test-chain-implicit"
[junit4] 2> 741959 INFO (coreLoadExecutor-2754-thread-1-processing-n:127.0.0.1:50894_) [n:127.0.0.1:50894_ c:control_collection s:shard1 r:core_node1 x:collection1] o.a.s.c.SolrCore no updateRequestProcessorChain defined as default, creating implicit default
[junit4] 2> 741959 WARN (coreLoadExecutor-2754-thread-1-processing-n:127.0.0.1:50894_) [n:127.0.0.1:50894_ c:control_collection s:shard1 r:core_node1 x:collection1] o.a.s.c.RequestHandlers INVALID paramSet a in requestHandler {type = requestHandler,name = /dump,class = DumpRequestHandler,args = {defaults={a=A,b=B}}}
[junit4] 2> 741960 INFO (coreLoadExecutor-2754-thread-1-processing-n:127.0.0.1:50894_) [n:127.0.0.1:50894_ c:control_collection s:shard1 r:core_node1 x:collection1] o.a.s.h.l.XMLLoader xsltCacheLifetimeSeconds=60
[junit4] 2> 741961 INFO (coreLoadExecutor-2754-thread-1-processing-n:127.0.0.1:50894_) [n:127.0.0.1:50894_ c:control_collection s:shard1 r:core_node1 x:collection1] o.a.s.h.l.XMLLoader xsltCacheLifetimeSeconds=60
[junit4] 2> 741962 INFO (coreLoadExecutor-2754-thread-1-processing-n:127.0.0.1:50894_) [n:127.0.0.1:50894_ c:control_collection s:shard1 r:core_node1 x:collection1] o.a.s.h.l.XMLLoader xsltCacheLifetimeSeconds=60
[junit4] 2> 741963 INFO (coreLoadExecutor-2754-thread-1-processing-n:127.0.0.1:50894_) [n:127.0.0.1:50894_ c:control_collection s:shard1 r:core_node1 x:collection1] o.a.s.h.l.XMLLoader xsltCacheLifetimeSeconds=60
[junit4] 2> 741968 INFO (coreLoadExecutor-2754-thread-1-processing-n:127.0.0.1:50894_) [n:127.0.0.1:50894_ c:control_collection s:shard1 r:core_node1 x:collection1] o.a.s.c.RequestHandlers Registered paths: /admin/mbeans,standard,/dump,/update/csv,/sql,/update/json/docs,/admin/luke,/export,/admin/segments,/get,/admin/system,/replication,/admin/properties,/config,/stream,/schema,/admin/plugins,/admin/logging,/update/json,/admin/threads,/admin/ping,/update,/admin/file
[junit4] 2> 741968 INFO (coreLoadExecutor-2754-thread-1-processing-n:127.0.0.1:50894_) [n:127.0.0.1:50894_ c:control_collection s:shard1 r:core_node1 x:collection1] o.a.s.c.SolrCore Using default statsCache cache: org.apache.solr.search.stats.LocalStatsCache
[junit4] 2> 741969 INFO (coreLoadExecutor-2754-thread-1-processing-n:127.0.0.1:50894_) [n:127.0.0.1:50894_ c:control_collection s:shard1 r:core_node1 x:collection1] o.a.s.u.UpdateHandler Using UpdateLog implementation: org.apache.solr.update.UpdateLog
[junit4] 2> 741969 INFO (coreLoadExecutor-2754-thread-1-processing-n:127.0.0.1:50894_) [n:127.0.0.1:50894_ c:control_collection s:shard1 r:core_node1 x:collection1] o.a.s.u.UpdateLog Initializing UpdateLog: dataDir= defaultSyncLevel=FLUSH numRecordsToKeep=100 maxNumLogsToKeep=10 numVersionBuckets=65536
[junit4] 2> 741970 INFO (coreLoadExecutor-2754-thread-1-processing-n:127.0.0.1:50894_) [n:127.0.0.1:50894_ c:control_collection s:shard1 r:core_node1 x:collection1] o.a.s.u.CommitTracker Hard AutoCommit: disabled
[junit4] 2> 741970 INFO (coreLoadExecutor-2754-thread-1-processing-n:127.0.0.1:50894_) [n:127.0.0.1:50894_ c:control_collection s:shard1 r:core_node1 x:collection1] o.a.s.u.CommitTracker Soft AutoCommit: disabled
[junit4] 2> 741970 INFO (coreLoadExecutor-2754-thread-1-processing-n:127.0.0.1:50894_) [n:127.0.0.1:50894_ c:control_collection s:shard1 r:core_node1 x:collection1] o.a.s.u.RandomMergePolicy RandomMergePolicy wrapping class org.apache.lucene.index.TieredMergePolicy: [TieredMergePolicy: maxMergeAtOnce=39, maxMergeAtOnceExplicit=27, maxMergedSegmentMB=54.2734375, floorSegmentMB=1.5068359375, forceMergeDeletesPctAllowed=20.903669826952193, segmentsPerTier=10.0, maxCFSSegmentSizeMB=8.796093022207999E12, noCFSRatio=0.39798307459761095
[junit4] 2> 741970 INFO (coreLoadExecutor-2754-thread-1-processing-n:127.0.0.1:50894_) [n:127.0.0.1:50894_ c:control_collection s:shard1 r:core_node1 x:collection1] o.a.s.c.SolrDeletionPolicy SolrDeletionPolicy.onInit: commits: num=1
[junit4] 2> commit{dir=MockDirectoryWrapper(RAMDirectory@bbd40c lockFactory=org.apache.lucene.store.SingleInstanceLockFactory@fc68fe),segFN=segments_1,generation=1}
[junit4] 2> 741970 INFO (coreLoadExecutor-2754-thread-1-processing-n:127.0.0.1:50894_) [n:127.0.0.1:50894_ c:control_collection s:shard1 r:core_node1 x:collection1] o.a.s.c.SolrDeletionPolicy newest commit generation = 1
[junit4] 2> 741971 INFO (coreLoadExecutor-2754-thread-1-processing-n:127.0.0.1:50894_) [n:127.0.0.1:50894_ c:control_collection s:shard1 r:core_node1 x:collection1] o.a.s.s.SolrIndexSearcher Opening Searcher@1668dd2[collection1] main
[junit4] 2> 741971 INFO (coreLoadExecutor-2754-thread-1-processing-n:127.0.0.1:50894_) [n:127.0.0.1:50894_ c:control_collection s:shard1 r:core_node1 x:collection1] o.a.s.c.c.ZkStateReader Load collection config from: [/collections/control_collection]
[junit4] 2> 741971 INFO (coreLoadExecutor-2754-thread-1-processing-n:127.0.0.1:50894_) [n:127.0.0.1:50894_ c:control_collection s:shard1 r:core_node1 x:collection1] o.a.s.c.c.ZkStateReader path=[/collections/control_collection] [configName]=[conf1] specified config exists in ZooKeeper
[junit4] 2> 741971 INFO (coreLoadExecutor-2754-thread-1-processing-n:127.0.0.1:50894_) [n:127.0.0.1:50894_ c:control_collection s:shard1 r:core_node1 x:collection1] o.a.s.r.ManagedResourceStorage Setting up ZooKeeper-based storage for the RestManager with znodeBase: /configs/conf1
[junit4] 2> 741972 INFO (coreLoadExecutor-2754-thread-1-processing-n:127.0.0.1:50894_) [n:127.0.0.1:50894_ c:control_collection s:shard1 r:core_node1 x:collection1] o.a.s.r.ManagedResourceStorage Configured ZooKeeperStorageIO with znodeBase: /configs/conf1
[junit4] 2> 741972 INFO (coreLoadExecutor-2754-thread-1-processing-n:127.0.0.1:50894_) [n:127.0.0.1:50894_ c:control_collection s:shard1 r:core_node1 x:collection1] o.a.s.r.RestManager Initializing RestManager with initArgs: {}
[junit4] 2> 741972 INFO (coreLoadExecutor-2754-thread-1-processing-n:127.0.0.1:50894_) [n:127.0.0.1:50894_ c:control_collection s:shard1 r:core_node1 x:collection1] o.a.s.r.ManagedResourceStorage Reading _rest_managed.json using ZooKeeperStorageIO:path=/configs/conf1
[junit4] 2> 741972 INFO (coreLoadExecutor-2754-thread-1-processing-n:127.0.0.1:50894_) [n:127.0.0.1:50894_ c:control_collection s:shard1 r:core_node1 x:collection1] o.a.s.r.ManagedResourceStorage No data found for znode /configs/conf1/_rest_managed.json
[junit4] 2> 741972 INFO (coreLoadExecutor-2754-thread-1-processing-n:127.0.0.1:50894_) [n:127.0.0.1:50894_ c:control_collection s:shard1 r:core_node1 x:collection1] o.a.s.r.ManagedResourceStorage Loaded null at path _rest_managed.json using ZooKeeperStorageIO:path=/configs/conf1
[junit4] 2> 741972 INFO (coreLoadExecutor-2754-thread-1-processing-n:127.0.0.1:50894_) [n:127.0.0.1:50894_ c:control_collection s:shard1 r:core_node1 x:collection1] o.a.s.r.RestManager Initializing 0 registered ManagedResources
[junit4] 2> 741972 INFO (coreLoadExecutor-2754-thread-1-processing-n:127.0.0.1:50894_) [n:127.0.0.1:50894_ c:control_collection s:shard1 r:core_node1 x:collection1] o.a.s.h.ReplicationHandler Commits will be reserved for 10000
[junit4] 2> 741973 INFO (searcherExecutor-2755-thread-1-processing-n:127.0.0.1:50894_ x:collection1 s:shard1 c:control_collection r:core_node1) [n:127.0.0.1:50894_ c:control_collection s:shard1 r:core_node1 x:collection1] o.a.s.c.SolrCore [collection1] Registered new searcher Searcher@1668dd2[collection1] main{ExitableDirectoryReader(UninvertingDirectoryReader())}
[junit4] 2> 741973 INFO (coreLoadExecutor-2754-thread-1-processing-n:127.0.0.1:50894_) [n:127.0.0.1:50894_ c:control_collection s:shard1 r:core_node1 x:collection1] o.a.s.u.UpdateLog Looking up max value of version field to seed version buckets
[junit4] 2> 741973 INFO (coreLoadExecutor-2754-thread-1-processing-n:127.0.0.1:50894_) [n:127.0.0.1:50894_ c:control_collection s:shard1 r:core_node1 x:collection1] o.a.s.u.VersionInfo Refreshing highest value of _version_ for 65536 version buckets from index
[junit4] 2> 741973 INFO (coreLoadExecutor-2754-thread-1-processing-n:127.0.0.1:50894_) [n:127.0.0.1:50894_ c:control_collection s:shard1 r:core_node1 x:collection1] o.a.s.u.VersionInfo No terms found for _version_, cannot seed version bucket highest value from index
[junit4] 2> 741973 INFO (coreLoadExecutor-2754-thread-1-processing-n:127.0.0.1:50894_) [n:127.0.0.1:50894_ c:control_collection s:shard1 r:core_node1 x:collection1] o.a.s.u.UpdateLog Could not find max version in index or recent updates, using new clock 1522188302240710656
[junit4] 2> 741975 INFO (coreLoadExecutor-2754-thread-1-processing-n:127.0.0.1:50894_) [n:127.0.0.1:50894_ c:control_collection s:shard1 r:core_node1 x:collection1] o.a.s.u.UpdateLog Took 2.0ms to seed version buckets with highest version 1522188302240710656
[junit4] 2> 741975 INFO (coreLoadExecutor-2754-thread-1-processing-n:127.0.0.1:50894_) [n:127.0.0.1:50894_ c:control_collection s:shard1 r:core_node1 x:collection1] o.a.s.c.ZkController watch zkdir /configs/conf1
[junit4] 2> 741976 INFO (coreLoadExecutor-2754-thread-1-processing-n:127.0.0.1:50894_) [n:127.0.0.1:50894_ c:control_collection s:shard1 r:core_node1 x:collection1] o.a.s.c.CoreContainer registering core: collection1
[junit4] 2> 741976 INFO (coreZkRegister-2748-thread-1-processing-n:127.0.0.1:50894_ x:collection1 s:shard1 c:control_collection r:core_node1) [n:127.0.0.1:50894_ c:control_collection s:shard1 r:core_node1 x:collection1] o.a.s.c.ZkController Register replica - core:collection1 address:http://127.0.0.1:50894 collection:control_collection shard:shard1
[junit4] 2> 741977 INFO (coreZkRegister-2748-thread-1-processing-n:127.0.0.1:50894_ x:collection1 s:shard1 c:control_collection r:core_node1) [n:127.0.0.1:50894_ c:control_collection s:shard1 r:core_node1 x:collection1] o.a.s.c.c.SolrZkClient makePath: /collections/control_collection/leader_elect/shard1/election
[junit4] 2> 741979 INFO (coreZkRegister-2748-thread-1-processing-n:127.0.0.1:50894_ x:collection1 s:shard1 c:control_collection r:core_node1) [n:127.0.0.1:50894_ c:control_collection s:shard1 r:core_node1 x:collection1] o.a.s.c.LeaderElector Joined leadership election with path: /collections/control_collection/leader_elect/shard1/election/95136768788332548-core_node1-n_0000000000
[junit4] 2> 741979 INFO (coreZkRegister-2748-thread-1-processing-n:127.0.0.1:50894_ x:collection1 s:shard1 c:control_collection r:core_node1) [n:127.0.0.1:50894_ c:control_collection s:shard1 r:core_node1 x:collection1] o.a.s.c.ShardLeaderElectionContext Running the leader process for shard=shard1 and weAreReplacement=false and leaderVoteWait=180000
[junit4] 2> 741980 INFO (coreZkRegister-2748-thread-1-processing-n:127.0.0.1:50894_ x:collection1 s:shard1 c:control_collection r:core_node1) [n:127.0.0.1:50894_ c:control_collection s:shard1 r:core_node1 x:collection1] o.a.s.c.ShardLeaderElectionContext Enough replicas found to continue.
[junit4] 2> 741980 INFO (coreZkRegister-2748-thread-1-processing-n:127.0.0.1:50894_ x:collection1 s:shard1 c:control_collection r:core_node1) [n:127.0.0.1:50894_ c:control_collection s:shard1 r:core_node1 x:collection1] o.a.s.c.ShardLeaderElectionContext I may be the new leader - try and sync
[junit4] 2> 741980 INFO (coreZkRegister-2748-thread-1-processing-n:127.0.0.1:50894_ x:collection1 s:shard1 c:control_collection r:core_node1) [n:127.0.0.1:50894_ c:control_collection s:shard1 r:core_node1 x:collection1] o.a.s.c.SyncStrategy Sync replicas to http://127.0.0.1:50894/collection1/
[junit4] 2> 741980 INFO (OverseerStateUpdate-95136768788332548-127.0.0.1:50894_-n_0000000000) [n:127.0.0.1:50894_ ] o.a.s.c.Overseer processMessage: queueSize: 1, message = {
[junit4] 2> "operation":"leader",
[junit4] 2> "shard":"shard1",
[junit4] 2> "collection":"control_collection"} current state version: 1
[junit4] 2> 741980 INFO (coreZkRegister-2748-thread-1-processing-n:127.0.0.1:50894_ x:collection1 s:shard1 c:control_collection r:core_node1) [n:127.0.0.1:50894_ c:control_collection s:shard1 r:core_node1 x:collection1] o.a.s.c.SyncStrategy Sync Success - now sync replicas to me
[junit4] 2> 741980 INFO (coreZkRegister-2748-thread-1-processing-n:127.0.0.1:50894_ x:collection1 s:shard1 c:control_collection r:core_node1) [n:127.0.0.1:50894_ c:control_collection s:shard1 r:core_node1 x:collection1] o.a.s.c.SyncStrategy http://127.0.0.1:50894/collection1/ has no replicas
[junit4] 2> 741981 INFO (coreZkRegister-2748-thread-1-processing-n:127.0.0.1:50894_ x:collection1 s:shard1 c:control_collection r:core_node1) [n:127.0.0.1:50894_ c:control_collection s:shard1 r:core_node1 x:collection1] o.a.s.c.c.SolrZkClient makePath: /collections/control_collection/leaders/shard1
[junit4] 2> 741982 INFO (coreZkRegister-2748-thread-1-processing-n:127.0.0.1:50894_ x:collection1 s:shard1 c:control_collection r:core_node1) [n:127.0.0.1:50894_ c:control_collection s:shard1 r:core_node1 x:collection1] o.a.s.c.ShardLeaderElectionContextBase Creating leader registration node
[junit4] 2> 741983 INFO (coreZkRegister-2748-thread-1-processing-n:127.0.0.1:50894_ x:collection1 s:shard1 c:control_collection r:core_node1) [n:127.0.0.1:50894_ c:control_collection s:shard1 r:core_node1 x:collection1] o.a.s.c.ShardLeaderElectionContext I am the new leader: http://127.0.0.1:50894/collection1/ shard1
[junit4] 2> 741984 INFO (OverseerStateUpdate-95136768788332548-127.0.0.1:50894_-n_0000000000) [n:127.0.0.1:50894_ ] o.a.s.c.Overseer processMessage: queueSize: 1, message = {
[junit4] 2> "operation":"leader",
[junit4] 2> "shard":"shard1",
[junit4] 2> "collection":"control_collection",
[junit4] 2> "base_url":"http://127.0.0.1:50894",
[junit4] 2> "core":"collection1",
[junit4] 2> "state":"active"} current state version: 1
[junit4] 2> 742086 INFO (zkCallback-779-thread-1-processing-n:127.0.0.1:50894_) [n:127.0.0.1:50894_ ] o.a.s.c.c.ZkStateReader A cluster state change: [WatchedEvent state:SyncConnected type:NodeDataChanged path:/clusterstate.json], has occurred - updating... (live nodes size: [1])
[junit4] 2> 742134 INFO (coreZkRegister-2748-thread-1-processing-n:127.0.0.1:50894_ x:collection1 s:shard1 c:control_collection r:core_node1) [n:127.0.0.1:50894_ c:control_collection s:shard1 r:core_node1 x:collection1] o.a.s.c.ZkController We are http://127.0.0.1:50894/collection1/ and leader is http://127.0.0.1:50894/collection1/
[junit4] 2> 742134 INFO (coreZkRegister-2748-thread-1-processing-n:127.0.0.1:50894_ x:collection1 s:shard1 c:control_collection r:core_node1) [n:127.0.0.1:50894_ c:control_collection s:shard1 r:core_node1 x:collection1] o.a.s.c.ZkController No LogReplay needed for core=collection1 baseURL=http://127.0.0.1:50894
[junit4] 2> 742134 INFO (coreZkRegister-2748-thread-1-processing-n:127.0.0.1:50894_ x:collection1 s:shard1 c:control_collection r:core_node1) [n:127.0.0.1:50894_ c:control_collection s:shard1 r:core_node1 x:collection1] o.a.s.c.ZkController I am the leader, no recovery necessary
[junit4] 2> 742134 INFO (coreZkRegister-2748-thread-1-processing-n:127.0.0.1:50894_ x:collection1 s:shard1 c:control_collection r:core_node1) [n:127.0.0.1:50894_ c:control_collection s:shard1 r:core_node1 x:collection1] o.a.s.c.ZkController publishing state=active
[junit4] 2> 742134 INFO (coreZkRegister-2748-thread-1-processing-n:127.0.0.1:50894_ x:collection1 s:shard1 c:control_collection r:core_node1) [n:127.0.0.1:50894_ c:control_collection s:shard1 r:core_node1 x:collection1] o.a.s.c.ZkController numShards not found on descriptor - reading it from system property
[junit4] 2> 742136 INFO (OverseerStateUpdate-95136768788332548-127.0.0.1:50894_-n_0000000000) [n:127.0.0.1:50894_ ] o.a.s.c.Overseer processMessage: queueSize: 1, message = {
[junit4] 2> "core":"collection1",
[junit4] 2> "core_node_name":"core_node1",
[junit4] 2> "roles":null,
[junit4] 2> "base_url":"http://127.0.0.1:50894",
[junit4] 2> "node_name":"127.0.0.1:50894_",
[junit4] 2> "numShards":"1",
[junit4] 2> "state":"active",
[junit4] 2> "shard":"shard1",
[junit4] 2> "collection":"control_collection",
[junit4] 2> "operation":"state"} current state version: 2
[junit4] 2> 742136 INFO (OverseerStateUpdate-95136768788332548-127.0.0.1:50894_-n_0000000000) [n:127.0.0.1:50894_ ] o.a.s.c.o.ReplicaMutator Update state numShards=1 message={
[junit4] 2> "core":"collection1",
[junit4] 2> "core_node_name":"core_node1",
[junit4] 2> "roles":null,
[junit4] 2> "base_url":"http://127.0.0.1:50894",
[junit4] 2> "node_name":"127.0.0.1:50894_",
[junit4] 2> "numShards":"1",
[junit4] 2> "state":"active",
[junit4] 2> "shard":"shard1",
[junit4] 2> "collection":"control_collection",
[junit4] 2> "operation":"state"}
[junit4] 2> 742238 INFO (zkCallback-779-thread-1-processing-n:127.0.0.1:50894_) [n:127.0.0.1:50894_ ] o.a.s.c.c.ZkStateReader A cluster state change: [WatchedEvent state:SyncConnected type:NodeDataChanged path:/clusterstate.json], has occurred - updating... (live nodes size: [1])
[junit4] 2> 742244 INFO (TEST-CollectionsAPIDistributedZkTest.test-seed#[DED63AA96EBEC1B7]) [ ] o.a.s.c.c.SolrZkClient Using default ZkCredentialsProvider
[junit4] 2> 742245 INFO (TEST-CollectionsAPIDistributedZkTest.test-seed#[DED63AA96EBEC1B7]) [ ] o.a.s.c.c.ConnectionManager Waiting for client to connect to ZooKeeper
[junit4] 2> 742246 INFO (zkCallback-781-thread-1) [ ] o.a.s.c.c.ConnectionManager Watcher org.apache.solr.common.cloud.ConnectionManager@f2e827 name:ZooKeeperConnection Watcher:127.0.0.1:52353/solr got event WatchedEvent state:SyncConnected type:None path:null path:null type:None
[junit4] 2> 742246 INFO (TEST-CollectionsAPIDistributedZkTest.test-seed#[DED63AA96EBEC1B7]) [ ] o.a.s.c.c.ConnectionManager Client is connected to ZooKeeper
[junit4] 2> 742247 INFO (TEST-CollectionsAPIDistributedZkTest.test-seed#[DED63AA96EBEC1B7]) [ ] o.a.s.c.c.SolrZkClient Using default ZkACLProvider
[junit4] 2> 742247 INFO (TEST-CollectionsAPIDistributedZkTest.test-seed#[DED63AA96EBEC1B7]) [ ] o.a.s.c.c.ZkStateReader Updating cluster state from ZooKeeper...
[junit4] 2> 742248 INFO (TEST-CollectionsAPIDistributedZkTest.test-seed#[DED63AA96EBEC1B7]) [ ] o.a.s.c.ChaosMonkey monkey: init - expire sessions:false cause connection loss:false
[junit4] 2> 742319 INFO (TEST-CollectionsAPIDistributedZkTest.test-seed#[DED63AA96EBEC1B7]) [ ] o.a.s.SolrTestCaseJ4 Writing core.properties file to /home/jenkins/workspace/Lucene-Solr-trunk-Linux/solr/build/solr-core/test/J1/temp/solr.cloud.CollectionsAPIDistributedZkTest_DED63AA96EBEC1B7-001/shard-1-001/cores/collection1
[junit4] 2> 742319 INFO (TEST-CollectionsAPIDistributedZkTest.test-seed#[DED63AA96EBEC1B7]) [ ] o.a.s.c.AbstractFullDistribZkTestBase create jetty 1 in directory /home/jenkins/workspace/Lucene-Solr-trunk-Linux/solr/build/solr-core/test/J1/temp/solr.cloud.CollectionsAPIDistributedZkTest_DED63AA96EBEC1B7-001/shard-1-001
[junit4] 2> 742320 INFO (TEST-CollectionsAPIDistributedZkTest.test-seed#[DED63AA96EBEC1B7]) [ ] o.e.j.s.Server jetty-9.3.6.v20151106
[junit4] 2> 742321 INFO (TEST-CollectionsAPIDistributedZkTest.test-seed#[DED63AA96EBEC1B7]) [ ] o.e.j.s.h.ContextHandler Started o.e.j.s.ServletContextHandler@177ffc5{/,null,AVAILABLE}
[junit4] 2> 742322 INFO (TEST-CollectionsAPIDistributedZkTest.test-seed#[DED63AA96EBEC1B7]) [ ] o.e.j.s.ServerConnector Started ServerConnector@10e29bf{HTTP/1.1,[http/1.1]}{127.0.0.1:35867}
[junit4] 2> 742322 INFO (TEST-CollectionsAPIDistributedZkTest.test-seed#[DED63AA96EBEC1B7]) [ ] o.e.j.s.Server Started @743479ms
[junit4] 2> 742322 INFO (TEST-CollectionsAPIDistributedZkTest.test-seed#[DED63AA96EBEC1B7]) [ ] o.a.s.c.s.e.JettySolrRunner Jetty properties: {solr.data.dir=/home/jenkins/workspace/Lucene-Solr-trunk-Linux/solr/build/solr-core/test/J1/temp/solr.cloud.CollectionsAPIDistributedZkTest_DED63AA96EBEC1B7-001/tempDir-001/jetty1, solrconfig=solrconfig.xml, hostContext=/, hostPort=35867, coreRootDirectory=/home/jenkins/workspace/Lucene-Solr-trunk-Linux/solr/build/solr-core/test/J1/temp/solr.cloud.CollectionsAPIDistributedZkTest_DED63AA96EBEC1B7-001/shard-1-001/cores}
[junit4] 2> 742322 INFO (TEST-CollectionsAPIDistributedZkTest.test-seed#[DED63AA96EBEC1B7]) [ ] o.a.s.s.SolrDispatchFilter SolrDispatchFilter.init(): sun.misc.Launcher$AppClassLoader@e2f2a
[junit4] 2> 742322 INFO (TEST-CollectionsAPIDistributedZkTest.test-seed#[DED63AA96EBEC1B7]) [ ] o.a.s.c.SolrResourceLoader new SolrResourceLoader for directory: '/home/jenkins/workspace/Lucene-Solr-trunk-Linux/solr/build/solr-core/test/J1/temp/solr.cloud.CollectionsAPIDistributedZkTest_DED63AA96EBEC1B7-001/shard-1-001'
[junit4] 2> 742322 INFO (TEST-CollectionsAPIDistributedZkTest.test-seed#[DED63AA96EBEC1B7]) [ ] o.a.s.c.SolrResourceLoader JNDI not configured for solr (NoInitialContextEx)
[junit4] 2> 742323 INFO (TEST-CollectionsAPIDistributedZkTest.test-seed#[DED63AA96EBEC1B7]) [ ] o.a.s.c.SolrResourceLoader solr home defaulted to 'solr/' (could not find system property or JNDI)
[junit4] 2> 742323 INFO (TEST-CollectionsAPIDistributedZkTest.test-seed#[DED63AA96EBEC1B7]) [ ] o.a.s.c.c.SolrZkClient Using default ZkCredentialsProvider
[junit4] 2> 742327 INFO (TEST-CollectionsAPIDistributedZkTest.test-seed#[DED63AA96EBEC1B7]) [ ] o.a.s.c.c.ConnectionManager Waiting for client to connect to ZooKeeper
[junit4] 2> 742329 INFO (zkCallback-782-thread-1) [ ] o.a.s.c.c.ConnectionManager Watcher org.apache.solr.common.cloud.ConnectionManager@219f0d name:ZooKeeperConnection Watcher:127.0.0.1:52353/solr got event WatchedEvent state:SyncConnected type:None path:null path:null type:None
[junit4] 2> 742329 INFO (TEST-CollectionsAPIDistributedZkTest.test-seed#[DED63AA96EBEC1B7]) [ ] o.a.s.c.c.ConnectionManager Client is connected to ZooKeeper
[junit4] 2> 742329 INFO (TEST-CollectionsAPIDistributedZkTest.test-seed#[DED63AA96EBEC1B7]) [ ] o.a.s.c.c.SolrZkClient Using default ZkACLProvider
[junit4] 2> 742331 INFO (TEST-CollectionsAPIDistributedZkTest.test-seed#[DED63AA96EBEC1B7]) [ ] o.a.s.s.SolrDispatchFilter Loading solr.xml from SolrHome (not found in ZooKeeper)
[junit4] 2> 742331 INFO (TEST-CollectionsAPIDistributedZkTest.test-seed#[DED63AA96EBEC1B7]) [ ] o.a.s.c.SolrXmlConfig Loading container configuration from /home/jenkins/workspace/Lucene-Solr-trunk-Linux/solr/build/solr-core/test/J1/temp/solr.cloud.CollectionsAPIDistributedZkTest_DED63AA96EBEC1B7-001/shard-1-001/solr.xml
[junit4] 2> 742337 INFO (TEST-CollectionsAPIDistributedZkTest.test-seed#[DED63AA96EBEC1B7]) [ ] o.a.s.c.CorePropertiesLocator Config-defined core root directory: /home/jenkins/workspace/Lucene-Solr-trunk-Linux/solr/build/solr-core/test/J1/temp/solr.cloud.CollectionsAPIDistributedZkTest_DED63AA96EBEC1B7-001/shard-1-001/cores
[junit4] 2> 742337 INFO (TEST-CollectionsAPIDistributedZkTest.test-seed#[DED63AA96EBEC1B7]) [ ] o.a.s.c.CoreContainer New CoreContainer 11829352
[junit4] 2> 742337 INFO (TEST-CollectionsAPIDistributedZkTest.test-seed#[DED63AA96EBEC1B7]) [ ] o.a.s.c.CoreContainer Loading cores into CoreContainer [instanceDir=/home/jenkins/workspace/Lucene-Solr-trunk-Linux/solr/build/solr-core/test/J1/temp/solr.cloud.CollectionsAPIDistributedZkTest_DED63AA96EBEC1B7-001/shard-1-001]
[junit4] 2> 742337 WARN (TEST-CollectionsAPIDistributedZkTest.test-seed#[DED63AA96EBEC1B7]) [ ] o.a.s.c.CoreContainer Couldn't add files from /home/jenkins/workspace/Lucene-Solr-trunk-Linux/solr/build/solr-core/test/J1/temp/solr.cloud.CollectionsAPIDistributedZkTest_DED63AA96EBEC1B7-001/shard-1-001/lib to classpath: /home/jenkins/workspace/Lucene-Solr-trunk-Linux/solr/build/solr-core/test/J1/temp/solr.cloud.CollectionsAPIDistributedZkTest_DED63AA96EBEC1B7-001/shard-1-001/lib
[junit4] 2> 742337 INFO (TEST-CollectionsAPIDistributedZkTest.test-seed#[DED63AA96EBEC1B7]) [ ] o.a.s.h.c.HttpShardHandlerFactory created with socketTimeout : 90000,urlScheme : ,connTimeout : 15000,maxConnectionsPerHost : 20,maxConnections : 10000,corePoolSize : 0,maximumPoolSize : 2147483647,maxThreadIdleTime : 5,sizeOfQueue : -1,fairnessPolicy : false,useRetries : false,
[junit4] 2> 742338 INFO (TEST-CollectionsAPIDistributedZkTest.test-seed#[DED63AA96EBEC1B7]) [ ] o.a.s.u.UpdateShardHandler Creating UpdateShardHandler HTTP client with params: socketTimeout=340000&connTimeout=45000&retry=true
[junit4] 2> 742339 INFO (TEST-CollectionsAPIDistributedZkTest.test-seed#[DED63AA96EBEC1B7]) [ ] o.a.s.l.LogWatcher SLF4J impl is org.slf4j.impl.Log4jLoggerFactory
[junit4] 2> 742339 INFO (TEST-CollectionsAPIDistributedZkTest.test-seed#[DED63AA96EBEC1B7]) [ ] o.a.s.l.LogWatcher Registering Log Listener [Log4j (org.slf4j.impl.Log4jLoggerFactory)]
[junit4] 2> 742339 INFO (TEST-CollectionsAPIDistributedZkTest.test-seed#[DED63AA96EBEC1B7]) [ ] o.a.s.c.ZkContainer Zookeeper client=127.0.0.1:52353/solr
[junit4] 2> 742339 INFO (TEST-CollectionsAPIDistributedZkTest.test-seed#[DED63AA96EBEC1B7]) [ ] o.a.s.c.ZkController zkHost includes chroot
[junit4] 2> 742339 INFO (TEST-CollectionsAPIDistributedZkTest.test-seed#[DED63AA96EBEC1B7]) [ ] o.a.s.c.c.SolrZkClient Using default ZkCredentialsProvider
[junit4] 2> 742340 INFO (TEST-CollectionsAPIDistributedZkTest.test-seed#[DED63AA96EBEC1B7]) [ ] o.a.s.c.c.ConnectionManager Waiting for client to connect to ZooKeeper
[junit4] 2> 742341 INFO (zkCallback-785-thread-1) [ ] o.a.s.c.c.ConnectionManager Watcher org.apache.solr.common.cloud.ConnectionManager@10b72a7 name:ZooKeeperConnection Watcher:127.0.0.1:52353 got event WatchedEvent state:SyncConnected type:None path:null path:null type:None
[junit4] 2> 742341 INFO (TEST-CollectionsAPIDistributedZkTest.test-seed#[DED63AA96EBEC1B7]) [ ] o.a.s.c.c.ConnectionManager Client is connected to ZooKeeper
[junit4] 2> 742341 INFO (TEST-CollectionsAPIDistributedZkTest.test-seed#[DED63AA96EBEC1B7]) [ ] o.a.s.c.c.SolrZkClient Using default ZkACLProvider
[junit4] 2> 742343 INFO (TEST-CollectionsAPIDistributedZkTest.test-seed#[DED63AA96EBEC1B7]) [n:127.0.0.1:35867_ ] o.a.s.c.c.ConnectionManager Waiting for client to connect to ZooKeeper
[junit4] 2> 742344 INFO (zkCallback-786-thread-1-processing-n:127.0.0.1:35867_) [n:127.0.0.1:35867_ ] o.a.s.c.c.ConnectionManager Watcher org.apache.solr.common.cloud.ConnectionManager@1b13a45 name:ZooKeeperConnection Watcher:127.0.0.1:52353/solr got event WatchedEvent state:SyncConnected type:None path:null path:null type:None
[junit4] 2> 742345 INFO (TEST-CollectionsAPIDistributedZkTest.test-seed#[DED63AA96EBEC1B7]) [n:127.0.0.1:35867_ ] o.a.s.c.c.ConnectionManager Client is connected to ZooKeeper
[junit4] 2> 742348 INFO (TEST-CollectionsAPIDistributedZkTest.test-seed#[DED63AA96EBEC1B7]) [n:127.0.0.1:35867_ ] o.a.s.c.c.ZkStateReader Updating cluster state from ZooKeeper...
[junit4] 2> 743352 INFO (TEST-CollectionsAPIDistributedZkTest.test-seed#[DED63AA96EBEC1B7]) [n:127.0.0.1:35867_ ] o.a.s.c.ZkController Register node as live in ZooKeeper:/live_nodes/127.0.0.1:35867_
[junit4] 2> 743352 INFO (TEST-CollectionsAPIDistributedZkTest.test-seed#[DED63AA96EBEC1B7]) [n:127.0.0.1:35867_ ] o.a.s.c.c.SolrZkClient makePath: /live_nodes/127.0.0.1:35867_
[junit4] 2> 743353 IN
[...truncated too long message...]
uedSynchronizer$ConditionObject.await(AbstractQueuedSynchronizer.java:2039)
[junit4] > at java.util.concurrent.LinkedBlockingQueue.take(LinkedBlockingQueue.java:442)
[junit4] > at org.apache.zookeeper.ClientCnxn$EventThread.run(ClientCnxn.java:494)
[junit4] > 3) Thread[id=5365, name=TEST-CollectionsAPIDistributedZkTest.test-seed#[DED63AA96EBEC1B7]-SendThread(127.0.0.1:52353), state=TIMED_WAITING, group=TGRP-CollectionsAPIDistributedZkTest]
[junit4] > at java.lang.Thread.sleep(Native Method)
[junit4] > at org.apache.zookeeper.client.StaticHostProvider.next(StaticHostProvider.java:101)
[junit4] > at org.apache.zookeeper.ClientCnxn$SendThread.startConnect(ClientCnxn.java:940)
[junit4] > at org.apache.zookeeper.ClientCnxn$SendThread.run(ClientCnxn.java:1003)
[junit4] > 4) Thread[id=5459, name=zkCallback-809-thread-3, state=TIMED_WAITING, group=TGRP-CollectionsAPIDistributedZkTest]
[junit4] > at sun.misc.Unsafe.park(Native Method)
[junit4] > at java.util.concurrent.locks.LockSupport.parkNanos(LockSupport.java:215)
[junit4] > at java.util.concurrent.SynchronousQueue$TransferStack.awaitFulfill(SynchronousQueue.java:460)
[junit4] > at java.util.concurrent.SynchronousQueue$TransferStack.transfer(SynchronousQueue.java:362)
[junit4] > at java.util.concurrent.SynchronousQueue.poll(SynchronousQueue.java:941)
[junit4] > at java.util.concurrent.ThreadPoolExecutor.getTask(ThreadPoolExecutor.java:1066)
[junit4] > at java.util.concurrent.ThreadPoolExecutor.runWorker(ThreadPoolExecutor.java:1127)
[junit4] > at java.util.concurrent.ThreadPoolExecutor$Worker.run(ThreadPoolExecutor.java:617)
[junit4] > at java.lang.Thread.run(Thread.java:745)
[junit4] > 5) Thread[id=5367, name=zkCallback-809-thread-1, state=TIMED_WAITING, group=TGRP-CollectionsAPIDistributedZkTest]
[junit4] > at sun.misc.Unsafe.park(Native Method)
[junit4] > at java.util.concurrent.locks.LockSupport.parkNanos(LockSupport.java:215)
[junit4] > at java.util.concurrent.SynchronousQueue$TransferStack.awaitFulfill(SynchronousQueue.java:460)
[junit4] > at java.util.concurrent.SynchronousQueue$TransferStack.transfer(SynchronousQueue.java:362)
[junit4] > at java.util.concurrent.SynchronousQueue.poll(SynchronousQueue.java:941)
[junit4] > at java.util.concurrent.ThreadPoolExecutor.getTask(ThreadPoolExecutor.java:1066)
[junit4] > at java.util.concurrent.ThreadPoolExecutor.runWorker(ThreadPoolExecutor.java:1127)
[junit4] > at java.util.concurrent.ThreadPoolExecutor$Worker.run(ThreadPoolExecutor.java:617)
[junit4] > at java.lang.Thread.run(Thread.java:745)
[junit4] > 6) Thread[id=5717, name=zkCallback-809-thread-4, state=TIMED_WAITING, group=TGRP-CollectionsAPIDistributedZkTest]
[junit4] > at sun.misc.Unsafe.park(Native Method)
[junit4] > at java.util.concurrent.locks.LockSupport.parkNanos(LockSupport.java:215)
[junit4] > at java.util.concurrent.SynchronousQueue$TransferStack.awaitFulfill(SynchronousQueue.java:460)
[junit4] > at java.util.concurrent.SynchronousQueue$TransferStack.transfer(SynchronousQueue.java:362)
[junit4] > at java.util.concurrent.SynchronousQueue.poll(SynchronousQueue.java:941)
[junit4] > at java.util.concurrent.ThreadPoolExecutor.getTask(ThreadPoolExecutor.java:1066)
[junit4] > at java.util.concurrent.ThreadPoolExecutor.runWorker(ThreadPoolExecutor.java:1127)
[junit4] > at java.util.concurrent.ThreadPoolExecutor$Worker.run(ThreadPoolExecutor.java:617)
[junit4] > at java.lang.Thread.run(Thread.java:745)
[junit4] > at __randomizedtesting.SeedInfo.seed([DED63AA96EBEC1B7]:0)Throwable #2: com.carrotsearch.randomizedtesting.ThreadLeakError: There are still zombie threads that couldn't be terminated:
[junit4] > 1) Thread[id=5456, name=zkCallback-809-thread-2, state=TIMED_WAITING, group=TGRP-CollectionsAPIDistributedZkTest]
[junit4] > at sun.misc.Unsafe.park(Native Method)
[junit4] > at java.util.concurrent.locks.LockSupport.parkNanos(LockSupport.java:215)
[junit4] > at java.util.concurrent.SynchronousQueue$TransferStack.awaitFulfill(SynchronousQueue.java:460)
[junit4] > at java.util.concurrent.SynchronousQueue$TransferStack.transfer(SynchronousQueue.java:362)
[junit4] > at java.util.concurrent.SynchronousQueue.poll(SynchronousQueue.java:941)
[junit4] > at java.util.concurrent.ThreadPoolExecutor.getTask(ThreadPoolExecutor.java:1066)
[junit4] > at java.util.concurrent.ThreadPoolExecutor.runWorker(ThreadPoolExecutor.java:1127)
[junit4] > at java.util.concurrent.ThreadPoolExecutor$Worker.run(ThreadPoolExecutor.java:617)
[junit4] > at java.lang.Thread.run(Thread.java:745)
[junit4] > 2) Thread[id=5365, name=TEST-CollectionsAPIDistributedZkTest.test-seed#[DED63AA96EBEC1B7]-SendThread(127.0.0.1:52353), state=TIMED_WAITING, group=TGRP-CollectionsAPIDistributedZkTest]
[junit4] > at java.lang.Thread.sleep(Native Method)
[junit4] > at org.apache.zookeeper.ClientCnxn$SendThread.run(ClientCnxn.java:994)
[junit4] > 3) Thread[id=5459, name=zkCallback-809-thread-3, state=TIMED_WAITING, group=TGRP-CollectionsAPIDistributedZkTest]
[junit4] > at sun.misc.Unsafe.park(Native Method)
[junit4] > at java.util.concurrent.locks.LockSupport.parkNanos(LockSupport.java:215)
[junit4] > at java.util.concurrent.SynchronousQueue$TransferStack.awaitFulfill(SynchronousQueue.java:460)
[junit4] > at java.util.concurrent.SynchronousQueue$TransferStack.transfer(SynchronousQueue.java:362)
[junit4] > at java.util.concurrent.SynchronousQueue.poll(SynchronousQueue.java:941)
[junit4] > at java.util.concurrent.ThreadPoolExecutor.getTask(ThreadPoolExecutor.java:1066)
[junit4] > at java.util.concurrent.ThreadPoolExecutor.runWorker(ThreadPoolExecutor.java:1127)
[junit4] > at java.util.concurrent.ThreadPoolExecutor$Worker.run(ThreadPoolExecutor.java:617)
[junit4] > at java.lang.Thread.run(Thread.java:745)
[junit4] > 4) Thread[id=5367, name=zkCallback-809-thread-1, state=TIMED_WAITING, group=TGRP-CollectionsAPIDistributedZkTest]
[junit4] > at sun.misc.Unsafe.park(Native Method)
[junit4] > at java.util.concurrent.locks.LockSupport.parkNanos(LockSupport.java:215)
[junit4] > at java.util.concurrent.SynchronousQueue$TransferStack.awaitFulfill(SynchronousQueue.java:460)
[junit4] > at java.util.concurrent.SynchronousQueue$TransferStack.transfer(SynchronousQueue.java:362)
[junit4] > at java.util.concurrent.SynchronousQueue.poll(SynchronousQueue.java:941)
[junit4] > at java.util.concurrent.ThreadPoolExecutor.getTask(ThreadPoolExecutor.java:1066)
[junit4] > at java.util.concurrent.ThreadPoolExecutor.runWorker(ThreadPoolExecutor.java:1127)
[junit4] > at java.util.concurrent.ThreadPoolExecutor$Worker.run(ThreadPoolExecutor.java:617)
[junit4] > at java.lang.Thread.run(Thread.java:745)
[junit4] > 5) Thread[id=5717, name=zkCallback-809-thread-4, state=TIMED_WAITING, group=TGRP-CollectionsAPIDistributedZkTest]
[junit4] > at sun.misc.Unsafe.park(Native Method)
[junit4] > at java.util.concurrent.locks.LockSupport.parkNanos(LockSupport.java:215)
[junit4] > at java.util.concurrent.SynchronousQueue$TransferStack.awaitFulfill(SynchronousQueue.java:460)
[junit4] > at java.util.concurrent.SynchronousQueue$TransferStack.transfer(SynchronousQueue.java:362)
[junit4] > at java.util.concurrent.SynchronousQueue.poll(SynchronousQueue.java:941)
[junit4] > at java.util.concurrent.ThreadPoolExecutor.getTask(ThreadPoolExecutor.java:1066)
[junit4] > at java.util.concurrent.ThreadPoolExecutor.runWorker(ThreadPoolExecutor.java:1127)
[junit4] > at java.util.concurrent.ThreadPoolExecutor$Worker.run(ThreadPoolExecutor.java:617)
[junit4] > at java.lang.Thread.run(Thread.java:745)
[junit4] > at __randomizedtesting.SeedInfo.seed([DED63AA96EBEC1B7]:0)
[junit4] Completed [278/573 (1!)] on J1 in 85.40s, 1 test, 3 errors <<< FAILURES!
[...truncated 956 lines...]
BUILD FAILED
/home/jenkins/workspace/Lucene-Solr-trunk-Linux/build.xml:784: The following error occurred while executing this line:
/home/jenkins/workspace/Lucene-Solr-trunk-Linux/build.xml:728: The following error occurred while executing this line:
/home/jenkins/workspace/Lucene-Solr-trunk-Linux/build.xml:59: The following error occurred while executing this line:
/home/jenkins/workspace/Lucene-Solr-trunk-Linux/solr/build.xml:233: The following error occurred while executing this line:
/home/jenkins/workspace/Lucene-Solr-trunk-Linux/solr/common-build.xml:516: The following error occurred while executing this line:
/home/jenkins/workspace/Lucene-Solr-trunk-Linux/lucene/common-build.xml:1424: The following error occurred while executing this line:
/home/jenkins/workspace/Lucene-Solr-trunk-Linux/lucene/common-build.xml:981: There were test failures: 573 suites (8 ignored), 2284 tests, 2 suite-level errors, 1 error, 1129 ignored (68 assumptions) [seed: DED63AA96EBEC1B7]
Total time: 37 minutes 12 seconds
Build step 'Invoke Ant' marked build as failure
Archiving artifacts
[WARNINGS] Skipping publisher since build result is FAILURE
Recording test results
Email was triggered for: Failure - Any
Sending email for trigger: Failure - Any