You are viewing a plain text version of this content. The canonical link for it is here.
Posted to builds@beam.apache.org by Apache Jenkins Server <je...@builds.apache.org> on 2022/03/28 12:12:09 UTC

Build failed in Jenkins: beam_PostCommit_Java_Nexmark_Dataflow_V2_Java11 #1219

See <https://ci-beam.apache.org/job/beam_PostCommit_Java_Nexmark_Dataflow_V2_Java11/1219/display/redirect>

Changes:


------------------------------------------
[...truncated 286.03 KB...]
  0000  query:PASSTHROUGH; numEvents:10000000
  0001  query:CURRENCY_CONVERSION; numEvents:10000000
  0002  query:SELECTION; numEvents:10000000
  0003  query:LOCAL_ITEM_SUGGESTION; numEvents:10000000
  0004  query:AVERAGE_PRICE_FOR_CATEGORY; numEvents:1000000
  0005  query:HOT_ITEMS; numEvents:10000000
  0006  query:AVERAGE_SELLING_PRICE_BY_SELLER; numEvents:1000000
  0007  query:HIGHEST_BID; numEvents:10000000
  0008  query:MONITOR_NEW_USERS; numEvents:10000000
  0009  query:WINNING_BIDS; numEvents:1000000
  0010  query:LOG_TO_SHARDED_FILES; numEvents:10000000
  0011  query:USER_SESSIONS; numEvents:10000000
  0012  query:PROCESSING_TIME_WINDOWS; numEvents:10000000
  0013  query:PORTABILITY_BATCH; numEvents:10000000
  0014  query:RESHUFFLE; numEvents:10000000
  0015  query:BOUNDED_SIDE_INPUT_JOIN; numEvents:10000000
  0016  query:SESSION_SIDE_INPUT_JOIN; numEvents:10000000

Performance:
  Conf  Runtime(sec)    (Baseline)  Events(/sec)    (Baseline)       Results    (Baseline)
  0000          19.6                    510829.6                    10000000              
  0001          25.3                    394539.6                     9200000              
  0002          12.9                    773036.5                       83527              
  0003  *** not run ***
  0004  *** not run ***
  0005          29.9                    334896.2                        4567              
  0006  *** not run ***
  0007  *** not run ***
  0008          24.8                    403567.5                       92833              
  0009  *** not run ***
  0010          53.5                    186874.0                         100              
  0011          34.1                    293289.5                     1839657              
  0012          16.7                    597193.2                      199929              
  0013          46.4                    215387.3                    10000000              
  0014          58.4                    171315.0                    10000000              
  0015  *** not run ***
  0016  *** not run ***
==========================================================================================

22/03/28 12:11:55 DEBUG org.apache.http.client.protocol.RequestAddCookies: CookieSpec selected: default
22/03/28 12:11:56 DEBUG org.apache.http.client.protocol.RequestAuthCache: Auth cache not set in the context
22/03/28 12:11:56 DEBUG org.apache.http.impl.conn.PoolingHttpClientConnectionManager: Connection request: [route: {}->http://10.128.0.96:8086][total available: 0; route allocated: 0 of 2; total allocated: 0 of 20]
22/03/28 12:11:56 DEBUG org.apache.http.impl.conn.PoolingHttpClientConnectionManager: Connection leased: [id: 0][route: {}->http://10.128.0.96:8086][total available: 0; route allocated: 1 of 2; total allocated: 1 of 20]
22/03/28 12:11:56 DEBUG org.apache.http.impl.execchain.MainClientExec: Opening connection {}->http://10.128.0.96:8086
22/03/28 12:11:56 DEBUG org.apache.http.impl.conn.DefaultHttpClientConnectionOperator: Connecting to /10.128.0.96:8086
22/03/28 12:11:56 DEBUG org.apache.http.impl.conn.DefaultHttpClientConnectionOperator: Connection established 10.128.0.167:45434<->10.128.0.96:8086
22/03/28 12:11:56 DEBUG org.apache.http.impl.execchain.MainClientExec: Executing request POST /write?db=beam_test_metrics&rp=forever&precision=s HTTP/1.1
22/03/28 12:11:56 DEBUG org.apache.http.impl.execchain.MainClientExec: Target auth state: UNCHALLENGED
22/03/28 12:11:56 DEBUG org.apache.http.impl.execchain.MainClientExec: Proxy auth state: UNCHALLENGED
22/03/28 12:11:56 DEBUG org.apache.http.headers: http-outgoing-0 >> POST /write?db=beam_test_metrics&rp=forever&precision=s HTTP/1.1
22/03/28 12:11:56 DEBUG org.apache.http.headers: http-outgoing-0 >> Transfer-Encoding: chunked
22/03/28 12:11:56 DEBUG org.apache.http.headers: http-outgoing-0 >> Content-Encoding: gzip
22/03/28 12:11:56 DEBUG org.apache.http.headers: http-outgoing-0 >> Host: 10.128.0.96:8086
22/03/28 12:11:56 DEBUG org.apache.http.headers: http-outgoing-0 >> Connection: Keep-Alive
22/03/28 12:11:56 DEBUG org.apache.http.headers: http-outgoing-0 >> User-Agent: Apache-HttpClient/4.5.13 (Java/1.8.0_312)
22/03/28 12:11:56 DEBUG org.apache.http.headers: http-outgoing-0 >> Accept-Encoding: gzip,deflate
22/03/28 12:11:56 DEBUG org.apache.http.wire: http-outgoing-0 >> "POST /write?db=beam_test_metrics&rp=forever&precision=s HTTP/1.1[\r][\n]"
22/03/28 12:11:56 DEBUG org.apache.http.wire: http-outgoing-0 >> "Transfer-Encoding: chunked[\r][\n]"
22/03/28 12:11:56 DEBUG org.apache.http.wire: http-outgoing-0 >> "Content-Encoding: gzip[\r][\n]"
22/03/28 12:11:56 DEBUG org.apache.http.wire: http-outgoing-0 >> "Host: 10.128.0.96:8086[\r][\n]"
22/03/28 12:11:56 DEBUG org.apache.http.wire: http-outgoing-0 >> "Connection: Keep-Alive[\r][\n]"
22/03/28 12:11:56 DEBUG org.apache.http.wire: http-outgoing-0 >> "User-Agent: Apache-HttpClient/4.5.13 (Java/1.8.0_312)[\r][\n]"
22/03/28 12:11:56 DEBUG org.apache.http.wire: http-outgoing-0 >> "Accept-Encoding: gzip,deflate[\r][\n]"
22/03/28 12:11:56 DEBUG org.apache.http.wire: http-outgoing-0 >> "[\r][\n]"
22/03/28 12:11:56 DEBUG org.apache.http.wire: http-outgoing-0 >> "a[\r][\n]"
22/03/28 12:11:56 DEBUG org.apache.http.wire: http-outgoing-0 >> "[0x1f][0x8b][0x8][0x0][0x0][0x0][0x0][0x0][0x0][0x0][\r][\n]"
22/03/28 12:11:56 DEBUG org.apache.http.wire: http-outgoing-0 >> "dc[\r][\n]"
22/03/28 12:11:56 DEBUG org.apache.http.wire: http-outgoing-0 >> "[0xad][0xd4];N[0x3]1[0x10][0x6][0xe0][0x9e]S[0xe4][0x0][[0xec]<[0xed])[0xb6][0xa3][0xa5]I[0x91]62[0xc8][0x88][0x85][0xac]#[0xed][0x83][0xe4][0xf8] [0x8][0xc5]&F[0x2]i[0xdc][0x8d]]|[0xfa]gF.[0xf9]<[0xa4][0xf1]m[0x1f][0xf7][0x8f]i~zi[0xc6][0xa5][0x94]<v[0xf7]iN[0xcf][0x87][0xe3]i[0xfb]U^nwy[0x9c][0xfa]c[0xe9]v[0xd8][0xbc][0xa6][0xf7][0xf4]S[0x2]l>[0xdf][0xe7]~[0xc8][0xf]S[0x87][0x1c][0x82][0xf5]MY[0x86]m[0x9e][0x96][0xc3]<u[0x86][0x91][0xa8][0xdf][0x80]rd5@[0xb9]+[0x17][0x13][0xc0][0x9]%nMW(D2[0x95]Pe[0xd1]I[0x5]4Z[0xab][0x91][0x4][0xeb]&[0xb8][0xa1][0x1a]X[0xd6]Q[0xcd][0xc][0xad][0xaa][0xb6]^[0xa8]I[0xb8][0xea]o[0xfb]}[0xaa][0xac]x[0xed][0x92]EmW,[0x8b][0xfe][0xd2]_/[0x93][0x95]1[0xfe]=*[0xa8][0x93]+[0x91][0x2][0xfe][0xc3][0xf5][0x1a][0xad][0x90][0xc0][0x8d]['[0xbd][0xa6]*[0xc4]z[0xf5]C[0xdc][0x6][0xfd][0x0][0xb5]\E[0xc7][0x98][0x4][0x0][0x0][\r][\n]"
22/03/28 12:11:56 DEBUG org.apache.http.wire: http-outgoing-0 >> "0[\r][\n]"
22/03/28 12:11:56 DEBUG org.apache.http.wire: http-outgoing-0 >> "[\r][\n]"
22/03/28 12:11:56 DEBUG org.apache.http.wire: http-outgoing-0 << "HTTP/1.1 401 Unauthorized[\r][\n]"
22/03/28 12:11:56 DEBUG org.apache.http.wire: http-outgoing-0 << "Content-Type: application/json[\r][\n]"
22/03/28 12:11:56 DEBUG org.apache.http.wire: http-outgoing-0 << "Request-Id: 42c643a8-ae90-11ec-9107-9e1ade9a9417[\r][\n]"
22/03/28 12:11:56 DEBUG org.apache.http.wire: http-outgoing-0 << "Www-Authenticate: Basic realm="InfluxDB"[\r][\n]"
22/03/28 12:11:56 DEBUG org.apache.http.wire: http-outgoing-0 << "X-Influxdb-Build: OSS[\r][\n]"
22/03/28 12:11:56 DEBUG org.apache.http.wire: http-outgoing-0 << "X-Influxdb-Version: 1.8.0[\r][\n]"
22/03/28 12:11:56 DEBUG org.apache.http.wire: http-outgoing-0 << "X-Request-Id: 42c643a8-ae90-11ec-9107-9e1ade9a9417[\r][\n]"
22/03/28 12:11:56 DEBUG org.apache.http.wire: http-outgoing-0 << "Date: Mon, 28 Mar 2022 12:11:56 GMT[\r][\n]"
22/03/28 12:11:56 DEBUG org.apache.http.wire: http-outgoing-0 << "Content-Length: 55[\r][\n]"
22/03/28 12:11:56 DEBUG org.apache.http.wire: http-outgoing-0 << "[\r][\n]"
22/03/28 12:11:56 DEBUG org.apache.http.wire: http-outgoing-0 << "{"error":"unable to parse authentication credentials"}[\n]"
22/03/28 12:11:56 DEBUG org.apache.http.headers: http-outgoing-0 << HTTP/1.1 401 Unauthorized
22/03/28 12:11:56 DEBUG org.apache.http.headers: http-outgoing-0 << Content-Type: application/json
22/03/28 12:11:56 DEBUG org.apache.http.headers: http-outgoing-0 << Request-Id: 42c643a8-ae90-11ec-9107-9e1ade9a9417
22/03/28 12:11:56 DEBUG org.apache.http.headers: http-outgoing-0 << Www-Authenticate: Basic realm="InfluxDB"
22/03/28 12:11:56 DEBUG org.apache.http.headers: http-outgoing-0 << X-Influxdb-Build: OSS
22/03/28 12:11:56 DEBUG org.apache.http.headers: http-outgoing-0 << X-Influxdb-Version: 1.8.0
22/03/28 12:11:56 DEBUG org.apache.http.headers: http-outgoing-0 << X-Request-Id: 42c643a8-ae90-11ec-9107-9e1ade9a9417
22/03/28 12:11:56 DEBUG org.apache.http.headers: http-outgoing-0 << Date: Mon, 28 Mar 2022 12:11:56 GMT
22/03/28 12:11:56 DEBUG org.apache.http.headers: http-outgoing-0 << Content-Length: 55
22/03/28 12:11:56 DEBUG org.apache.http.impl.execchain.MainClientExec: Connection can be kept alive indefinitely
22/03/28 12:11:56 DEBUG org.apache.http.impl.auth.HttpAuthenticator: Authentication required
22/03/28 12:11:56 DEBUG org.apache.http.impl.auth.HttpAuthenticator: 10.128.0.96:8086 requested authentication
22/03/28 12:11:56 DEBUG org.apache.http.impl.client.TargetAuthenticationStrategy: Authentication schemes in the order of preference: [Negotiate, Kerberos, NTLM, CredSSP, Digest, Basic]
22/03/28 12:11:56 DEBUG org.apache.http.impl.client.TargetAuthenticationStrategy: Challenge for Negotiate authentication scheme not available
22/03/28 12:11:56 DEBUG org.apache.http.impl.client.TargetAuthenticationStrategy: Challenge for Kerberos authentication scheme not available
22/03/28 12:11:56 DEBUG org.apache.http.impl.client.TargetAuthenticationStrategy: Challenge for NTLM authentication scheme not available
22/03/28 12:11:56 DEBUG org.apache.http.impl.client.TargetAuthenticationStrategy: Challenge for CredSSP authentication scheme not available
22/03/28 12:11:56 DEBUG org.apache.http.impl.client.TargetAuthenticationStrategy: Challenge for Digest authentication scheme not available
22/03/28 12:11:56 DEBUG org.apache.http.impl.auth.HttpAuthenticator: Selected authentication options: [BASIC [complete=true]]
22/03/28 12:11:56 DEBUG org.apache.http.impl.execchain.MainClientExec: Executing request POST /write?db=beam_test_metrics&rp=forever&precision=s HTTP/1.1
22/03/28 12:11:56 DEBUG org.apache.http.impl.execchain.MainClientExec: Target auth state: CHALLENGED
22/03/28 12:11:56 DEBUG org.apache.http.impl.auth.HttpAuthenticator: Generating response to an authentication challenge using basic scheme
22/03/28 12:11:56 DEBUG org.apache.http.impl.execchain.MainClientExec: Proxy auth state: UNCHALLENGED
22/03/28 12:11:56 DEBUG org.apache.http.headers: http-outgoing-0 >> POST /write?db=beam_test_metrics&rp=forever&precision=s HTTP/1.1
22/03/28 12:11:56 DEBUG org.apache.http.headers: http-outgoing-0 >> Transfer-Encoding: chunked
22/03/28 12:11:56 DEBUG org.apache.http.headers: http-outgoing-0 >> Content-Encoding: gzip
22/03/28 12:11:56 DEBUG org.apache.http.headers: http-outgoing-0 >> Host: 10.128.0.96:8086
22/03/28 12:11:56 DEBUG org.apache.http.headers: http-outgoing-0 >> Connection: Keep-Alive
22/03/28 12:11:56 DEBUG org.apache.http.headers: http-outgoing-0 >> User-Agent: Apache-HttpClient/4.5.13 (Java/1.8.0_312)
22/03/28 12:11:56 DEBUG org.apache.http.headers: http-outgoing-0 >> Accept-Encoding: gzip,deflate
22/03/28 12:11:56 DEBUG org.apache.http.headers: http-outgoing-0 >> Authorization: Basic d29ya2VyOldxNDdXNEY2R3VVSmtqdXNHUGhD
22/03/28 12:11:56 DEBUG org.apache.http.wire: http-outgoing-0 >> "POST /write?db=beam_test_metrics&rp=forever&precision=s HTTP/1.1[\r][\n]"
22/03/28 12:11:56 DEBUG org.apache.http.wire: http-outgoing-0 >> "Transfer-Encoding: chunked[\r][\n]"
22/03/28 12:11:56 DEBUG org.apache.http.wire: http-outgoing-0 >> "Content-Encoding: gzip[\r][\n]"
22/03/28 12:11:56 DEBUG org.apache.http.wire: http-outgoing-0 >> "Host: 10.128.0.96:8086[\r][\n]"
22/03/28 12:11:56 DEBUG org.apache.http.wire: http-outgoing-0 >> "Connection: Keep-Alive[\r][\n]"
22/03/28 12:11:56 DEBUG org.apache.http.wire: http-outgoing-0 >> "User-Agent: Apache-HttpClient/4.5.13 (Java/1.8.0_312)[\r][\n]"
22/03/28 12:11:56 DEBUG org.apache.http.wire: http-outgoing-0 >> "Accept-Encoding: gzip,deflate[\r][\n]"
22/03/28 12:11:56 DEBUG org.apache.http.wire: http-outgoing-0 >> "Authorization: Basic d29ya2VyOldxNDdXNEY2R3VVSmtqdXNHUGhD[\r][\n]"
22/03/28 12:11:56 DEBUG org.apache.http.wire: http-outgoing-0 >> "[\r][\n]"
22/03/28 12:11:56 DEBUG org.apache.http.wire: http-outgoing-0 >> "a[\r][\n]"
22/03/28 12:11:56 DEBUG org.apache.http.wire: http-outgoing-0 >> "[0x1f][0x8b][0x8][0x0][0x0][0x0][0x0][0x0][0x0][0x0][\r][\n]"
22/03/28 12:11:56 DEBUG org.apache.http.wire: http-outgoing-0 >> "dc[\r][\n]"
22/03/28 12:11:56 DEBUG org.apache.http.wire: http-outgoing-0 >> "[0xad][0xd4];N[0x3]1[0x10][0x6][0xe0][0x9e]S[0xe4][0x0][[0xec]<[0xed])[0xb6][0xa3][0xa5]I[0x91]62[0xc8][0x88][0x85][0xac]#[0xed][0x83][0xe4][0xf8] [0x8][0xc5]&F[0x2]i[0xdc][0x8d]]|[0xfa]gF.[0xf9]<[0xa4][0xf1]m[0x1f][0xf7][0x8f]i~zi[0xc6][0xa5][0x94]<v[0xf7]iN[0xcf][0x87][0xe3]i[0xfb]U^nwy[0x9c][0xfa]c[0xe9]v[0xd8][0xbc][0xa6][0xf7][0xf4]S[0x2]l>[0xdf][0xe7]~[0xc8][0xf]S[0x87][0x1c][0x82][0xf5]MY[0x86]m[0x9e][0x96][0xc3]<u[0x86][0x91][0xa8][0xdf][0x80]rd5@[0xb9]+[0x17][0x13][0xc0][0x9]%nMW(D2[0x95]Pe[0xd1]I[0x5]4Z[0xab][0x91][0x4][0xeb]&[0xb8][0xa1][0x1a]X[0xd6]Q[0xcd][0xc][0xad][0xaa][0xb6]^[0xa8]I[0xb8][0xea]o[0xfb]}[0xaa][0xac]x[0xed][0x92]EmW,[0x8b][0xfe][0xd2]_/[0x93][0x95]1[0xfe]=*[0xa8][0x93]+[0x91][0x2][0xfe][0xc3][0xf5][0x1a][0xad][0x90][0xc0][0x8d]['[0xbd][0xa6]*[0xc4]z[0xf5]C[0xdc][0x6][0xfd][0x0][0xb5]\E[0xc7][0x98][0x4][0x0][0x0][\r][\n]"
22/03/28 12:11:56 DEBUG org.apache.http.wire: http-outgoing-0 >> "0[\r][\n]"
22/03/28 12:11:56 DEBUG org.apache.http.wire: http-outgoing-0 >> "[\r][\n]"
22/03/28 12:11:56 DEBUG org.apache.http.wire: http-outgoing-0 << "HTTP/1.1 204 No Content[\r][\n]"
22/03/28 12:11:56 DEBUG org.apache.http.wire: http-outgoing-0 << "Content-Type: application/json[\r][\n]"
22/03/28 12:11:56 DEBUG org.apache.http.wire: http-outgoing-0 << "Request-Id: 42ca25c5-ae90-11ec-9108-9e1ade9a9417[\r][\n]"
22/03/28 12:11:56 DEBUG org.apache.http.wire: http-outgoing-0 << "X-Influxdb-Build: OSS[\r][\n]"
22/03/28 12:11:56 DEBUG org.apache.http.wire: http-outgoing-0 << "X-Influxdb-Version: 1.8.0[\r][\n]"
22/03/28 12:11:56 DEBUG org.apache.http.wire: http-outgoing-0 << "X-Request-Id: 42ca25c5-ae90-11ec-9108-9e1ade9a9417[\r][\n]"
22/03/28 12:11:56 DEBUG org.apache.http.wire: http-outgoing-0 << "Date: Mon, 28 Mar 2022 12:11:56 GMT[\r][\n]"
22/03/28 12:11:56 DEBUG org.apache.http.wire: http-outgoing-0 << "[\r][\n]"
22/03/28 12:11:56 DEBUG org.apache.http.headers: http-outgoing-0 << HTTP/1.1 204 No Content
22/03/28 12:11:56 DEBUG org.apache.http.headers: http-outgoing-0 << Content-Type: application/json
22/03/28 12:11:56 DEBUG org.apache.http.headers: http-outgoing-0 << Request-Id: 42ca25c5-ae90-11ec-9108-9e1ade9a9417
22/03/28 12:11:56 DEBUG org.apache.http.headers: http-outgoing-0 << X-Influxdb-Build: OSS
22/03/28 12:11:56 DEBUG org.apache.http.headers: http-outgoing-0 << X-Influxdb-Version: 1.8.0
22/03/28 12:11:56 DEBUG org.apache.http.headers: http-outgoing-0 << X-Request-Id: 42ca25c5-ae90-11ec-9108-9e1ade9a9417
22/03/28 12:11:56 DEBUG org.apache.http.headers: http-outgoing-0 << Date: Mon, 28 Mar 2022 12:11:56 GMT
22/03/28 12:11:56 DEBUG org.apache.http.impl.execchain.MainClientExec: Connection can be kept alive indefinitely
22/03/28 12:11:56 DEBUG org.apache.http.impl.auth.HttpAuthenticator: Authentication succeeded
22/03/28 12:11:56 DEBUG org.apache.http.impl.client.TargetAuthenticationStrategy: Caching 'basic' auth scheme for http://10.128.0.96:8086
22/03/28 12:11:56 DEBUG org.apache.http.impl.conn.PoolingHttpClientConnectionManager: Connection [id: 0][route: {}->http://10.128.0.96:8086] can be kept alive indefinitely
22/03/28 12:11:56 DEBUG org.apache.http.impl.conn.DefaultManagedHttpClientConnection: http-outgoing-0: set socket timeout to 0
22/03/28 12:11:56 DEBUG org.apache.http.impl.conn.PoolingHttpClientConnectionManager: Connection released: [id: 0][route: {}->http://10.128.0.96:8086][total available: 1; route allocated: 1 of 2; total allocated: 1 of 20]

==========================================================================================
Run started 2022-03-28T12:05:25.745Z and ran for PT390.338S

Default configuration:
{"debug":true,"query":null,"sourceType":"DIRECT","generateEventFilePathPrefix":null,"sinkType":"DEVNULL","exportSummaryToBigQuery":false,"pubSubMode":"COMBINED","pubsubMessageSerializationMethod":"CODER","sideInputType":"DIRECT","sideInputRowCount":500,"sideInputNumShards":3,"sideInputUrl":null,"sessionGap":600000,"numEvents":100000,"numEventGenerators":100,"rateShape":"SINE","firstEventRate":10000,"nextEventRate":10000,"rateUnit":"PER_SECOND","ratePeriodSec":600,"preloadSeconds":0,"streamTimeout":240,"isRateLimited":false,"useWallclockEventTime":false,"avgPersonByteSize":200,"avgAuctionByteSize":500,"avgBidByteSize":100,"hotAuctionRatio":2,"hotSellersRatio":4,"hotBiddersRatio":4,"windowSizeSec":10,"windowPeriodSec":5,"watermarkHoldbackSec":0,"numInFlightAuctions":100,"numActivePeople":1000,"coderStrategy":"HAND","cpuDelayMs":0,"diskBusyBytes":0,"auctionSkip":123,"fanout":5,"maxAuctionsWaitingTime":600,"occasionalDelaySec":3,"probDelayedEvent":0.1,"maxLogEvents":100000,"usePubsubPublishTime":false,"outOfOrderGroupSize":1,"numKeyBuckets":20000,"pardoCPUFactor":1.0}

Configurations:
  Conf  Description
  0000  query:PASSTHROUGH; numEvents:10000000
  0001  query:CURRENCY_CONVERSION; numEvents:10000000
  0002  query:SELECTION; numEvents:10000000
  0003  query:LOCAL_ITEM_SUGGESTION; numEvents:10000000
  0004  query:AVERAGE_PRICE_FOR_CATEGORY; numEvents:1000000
  0005  query:HOT_ITEMS; numEvents:10000000
  0006  query:AVERAGE_SELLING_PRICE_BY_SELLER; numEvents:1000000
  0007  query:HIGHEST_BID; numEvents:10000000
  0008  query:MONITOR_NEW_USERS; numEvents:10000000
  0009  query:WINNING_BIDS; numEvents:1000000
  0010  query:LOG_TO_SHARDED_FILES; numEvents:10000000
  0011  query:USER_SESSIONS; numEvents:10000000
  0012  query:PROCESSING_TIME_WINDOWS; numEvents:10000000
  0013  query:PORTABILITY_BATCH; numEvents:10000000
  0014  query:RESHUFFLE; numEvents:10000000
  0015  query:BOUNDED_SIDE_INPUT_JOIN; numEvents:10000000
  0016  query:SESSION_SIDE_INPUT_JOIN; numEvents:10000000

Performance:
  Conf  Runtime(sec)    (Baseline)  Events(/sec)    (Baseline)       Results    (Baseline)
  0000          19.6                    510829.6                    10000000              
  0001          25.3                    394539.6                     9200000              
  0002          12.9                    773036.5                       83527              
  0003  *** not run ***
  0004  *** not run ***
  0005          29.9                    334896.2                        4567              
  0006  *** not run ***
  0007  *** not run ***
  0008          24.8                    403567.5                       92833              
  0009  *** not run ***
  0010          53.5                    186874.0                         100              
  0011          34.1                    293289.5                     1839657              
  0012          16.7                    597193.2                      199929              
  0013          46.4                    215387.3                    10000000              
  0014          58.4                    171315.0                    10000000              
  0015  *** not run ***
  0016  *** not run ***
==========================================================================================


> Task :runners:google-cloud-dataflow-java:cleanUpDockerJavaImages
Untagged: us.gcr.io/apache-beam-testing/java-postcommit-it/java:20220328120056
Untagged: us.gcr.io/apache-beam-testing/java-postcommit-it/java@sha256:91663e9b6452b0213c9536c2891a770d7029a5c21120f2836d913fd205a71446
Tag: [us.gcr.io/apache-beam-testing/java-postcommit-it/java:20220328120056]
- referencing digest: [us.gcr.io/apache-beam-testing/java-postcommit-it/java@sha256:91663e9b6452b0213c9536c2891a770d7029a5c21120f2836d913fd205a71446]

Deleted [[us.gcr.io/apache-beam-testing/java-postcommit-it/java:20220328120056] (referencing [us.gcr.io/apache-beam-testing/java-postcommit-it/java@sha256:91663e9b6452b0213c9536c2891a770d7029a5c21120f2836d913fd205a71446])].
Removing untagged image us.gcr.io/apache-beam-testing/java-postcommit-it/java@sha256:91663e9b6452b0213c9536c2891a770d7029a5c21120f2836d913fd205a71446
Digests:
- us.gcr.io/apache-beam-testing/java-postcommit-it/java@sha256:91663e9b6452b0213c9536c2891a770d7029a5c21120f2836d913fd205a71446
Deleted [us.gcr.io/apache-beam-testing/java-postcommit-it/java@sha256:91663e9b6452b0213c9536c2891a770d7029a5c21120f2836d913fd205a71446].
Removing untagged image us.gcr.io/apache-beam-testing/java-postcommit-it/java@sha256:0d3710f65a837916b568aa78ebdf63bc96f5a85a486e88e6cd6553b7e59ece44
Digests:
- us.gcr.io/apache-beam-testing/java-postcommit-it/java@sha256:0d3710f65a837916b568aa78ebdf63bc96f5a85a486e88e6cd6553b7e59ece44
ERROR: (gcloud.container.images.delete) Not found: response: {'docker-distribution-api-version': 'registry/2.0', 'content-type': 'application/json', 'date': 'Mon, 28 Mar 2022 12:12:07 GMT', 'server': 'Docker Registry', 'cache-control': 'private', 'x-xss-protection': '0', 'x-frame-options': 'SAMEORIGIN', 'transfer-encoding': 'chunked', 'status': '404', 'content-length': '168', '-content-encoding': 'gzip'}
Failed to compute blob liveness for manifest: 'sha256:0d3710f65a837916b568aa78ebdf63bc96f5a85a486e88e6cd6553b7e59ece44': None

> Task :runners:google-cloud-dataflow-java:cleanUpDockerJavaImages FAILED

FAILURE: Build failed with an exception.

* Where:
Build file '<https://ci-beam.apache.org/job/beam_PostCommit_Java_Nexmark_Dataflow_V2_Java11/ws/src/runners/google-cloud-dataflow-java/build.gradle'> line: 297

* What went wrong:
Execution failed for task ':runners:google-cloud-dataflow-java:cleanUpDockerJavaImages'.
> Process 'command './scripts/cleanup_untagged_gcr_images.sh'' finished with non-zero exit value 1

* Try:
> Run with --stacktrace option to get the stack trace.
> Run with --info or --debug option to get more log output.
> Run with --scan to get full insights.

* Get more help at https://help.gradle.org

Deprecated Gradle features were used in this build, making it incompatible with Gradle 8.0.

You can use '--warning-mode all' to show the individual deprecation warnings and determine if they come from your own scripts or plugins.

See https://docs.gradle.org/7.3.2/userguide/command_line_interface.html#sec:command_line_warnings

Execution optimizations have been disabled for 1 invalid unit(s) of work during this build to ensure correctness.
Please consult deprecation warnings for more details.

BUILD FAILED in 11m 36s
136 actionable tasks: 91 executed, 41 from cache, 4 up-to-date

Publishing build scan...
https://gradle.com/s/qbmr3hgrs2aca

Build step 'Invoke Gradle script' changed build result to FAILURE
Build step 'Invoke Gradle script' marked build as failure

---------------------------------------------------------------------
To unsubscribe, e-mail: builds-unsubscribe@beam.apache.org
For additional commands, e-mail: builds-help@beam.apache.org


Jenkins build is back to normal : beam_PostCommit_Java_Nexmark_Dataflow_V2_Java11 #1220

Posted by Apache Jenkins Server <je...@builds.apache.org>.
See <https://ci-beam.apache.org/job/beam_PostCommit_Java_Nexmark_Dataflow_V2_Java11/1220/display/redirect?page=changes>


---------------------------------------------------------------------
To unsubscribe, e-mail: builds-unsubscribe@beam.apache.org
For additional commands, e-mail: builds-help@beam.apache.org