You are viewing a plain text version of this content. The canonical link for it is here.
Posted to dev@kafka.apache.org by Apache Jenkins Server <je...@builds.apache.org> on 2019/01/17 10:01:58 UTC

Build failed in Jenkins: kafka-trunk-jdk11 #218

See <https://builds.apache.org/job/kafka-trunk-jdk11/218/display/redirect?page=changes>

Changes:

[me] MINOR: Start Connect REST server in standalone mode to match distributed

------------------------------------------
[...truncated 2.27 MB...]

org.apache.kafka.connect.json.JsonConverterTest > bytesToJson PASSED

org.apache.kafka.connect.json.JsonConverterTest > shortToConnect STARTED

org.apache.kafka.connect.json.JsonConverterTest > shortToConnect PASSED

org.apache.kafka.connect.json.JsonConverterTest > intToJson STARTED

org.apache.kafka.connect.json.JsonConverterTest > intToJson PASSED

org.apache.kafka.connect.json.JsonConverterTest > nullSchemaAndNullValueToJson STARTED

org.apache.kafka.connect.json.JsonConverterTest > nullSchemaAndNullValueToJson PASSED

org.apache.kafka.connect.json.JsonConverterTest > timestampToConnectOptional STARTED

org.apache.kafka.connect.json.JsonConverterTest > timestampToConnectOptional PASSED

org.apache.kafka.connect.json.JsonConverterTest > structToConnect STARTED

org.apache.kafka.connect.json.JsonConverterTest > structToConnect PASSED

org.apache.kafka.connect.json.JsonConverterTest > stringToJson STARTED

org.apache.kafka.connect.json.JsonConverterTest > stringToJson PASSED

org.apache.kafka.connect.json.JsonConverterTest > nullSchemaAndArrayToJson STARTED

org.apache.kafka.connect.json.JsonConverterTest > nullSchemaAndArrayToJson PASSED

org.apache.kafka.connect.json.JsonConverterTest > byteToConnect STARTED

org.apache.kafka.connect.json.JsonConverterTest > byteToConnect PASSED

org.apache.kafka.connect.json.JsonConverterTest > nullSchemaPrimitiveToConnect STARTED

org.apache.kafka.connect.json.JsonConverterTest > nullSchemaPrimitiveToConnect PASSED

org.apache.kafka.connect.json.JsonConverterTest > byteToJson STARTED

org.apache.kafka.connect.json.JsonConverterTest > byteToJson PASSED

org.apache.kafka.connect.json.JsonConverterTest > intToConnect STARTED

org.apache.kafka.connect.json.JsonConverterTest > intToConnect PASSED

org.apache.kafka.connect.json.JsonConverterTest > dateToJson STARTED

org.apache.kafka.connect.json.JsonConverterTest > dateToJson PASSED

org.apache.kafka.connect.json.JsonConverterTest > noSchemaToConnect STARTED

org.apache.kafka.connect.json.JsonConverterTest > noSchemaToConnect PASSED

org.apache.kafka.connect.json.JsonConverterTest > noSchemaToJson STARTED

org.apache.kafka.connect.json.JsonConverterTest > noSchemaToJson PASSED

org.apache.kafka.connect.json.JsonConverterTest > nullSchemaAndPrimitiveToJson STARTED

org.apache.kafka.connect.json.JsonConverterTest > nullSchemaAndPrimitiveToJson PASSED

org.apache.kafka.connect.json.JsonConverterTest > decimalToConnectOptionalWithDefaultValue STARTED

org.apache.kafka.connect.json.JsonConverterTest > decimalToConnectOptionalWithDefaultValue PASSED

org.apache.kafka.connect.json.JsonConverterTest > mapToJsonStringKeys STARTED

org.apache.kafka.connect.json.JsonConverterTest > mapToJsonStringKeys PASSED

org.apache.kafka.connect.json.JsonConverterTest > arrayToJson STARTED

org.apache.kafka.connect.json.JsonConverterTest > arrayToJson PASSED

org.apache.kafka.connect.json.JsonConverterTest > nullToConnect STARTED

org.apache.kafka.connect.json.JsonConverterTest > nullToConnect PASSED

org.apache.kafka.connect.json.JsonConverterTest > timeToJson STARTED

org.apache.kafka.connect.json.JsonConverterTest > timeToJson PASSED

org.apache.kafka.connect.json.JsonConverterTest > structToJson STARTED

org.apache.kafka.connect.json.JsonConverterTest > structToJson PASSED

org.apache.kafka.connect.json.JsonConverterTest > testConnectSchemaMetadataTranslation STARTED

org.apache.kafka.connect.json.JsonConverterTest > testConnectSchemaMetadataTranslation PASSED

org.apache.kafka.connect.json.JsonConverterTest > shortToJson STARTED

org.apache.kafka.connect.json.JsonConverterTest > shortToJson PASSED

org.apache.kafka.connect.json.JsonConverterTest > dateToConnect STARTED

org.apache.kafka.connect.json.JsonConverterTest > dateToConnect PASSED

org.apache.kafka.connect.json.JsonConverterTest > doubleToJson STARTED

org.apache.kafka.connect.json.JsonConverterTest > doubleToJson PASSED

org.apache.kafka.connect.json.JsonConverterTest > testStringHeaderToJson STARTED

org.apache.kafka.connect.json.JsonConverterTest > testStringHeaderToJson PASSED

org.apache.kafka.connect.json.JsonConverterTest > decimalToConnectOptional STARTED

org.apache.kafka.connect.json.JsonConverterTest > decimalToConnectOptional PASSED

org.apache.kafka.connect.json.JsonConverterTest > structSchemaIdentical STARTED

org.apache.kafka.connect.json.JsonConverterTest > structSchemaIdentical PASSED

org.apache.kafka.connect.json.JsonConverterTest > timeToConnectWithDefaultValue STARTED

org.apache.kafka.connect.json.JsonConverterTest > timeToConnectWithDefaultValue PASSED

org.apache.kafka.connect.json.JsonConverterTest > timeToConnect STARTED

org.apache.kafka.connect.json.JsonConverterTest > timeToConnect PASSED

org.apache.kafka.connect.json.JsonConverterTest > dateToConnectOptionalWithDefaultValue STARTED

org.apache.kafka.connect.json.JsonConverterTest > dateToConnectOptionalWithDefaultValue PASSED

org.apache.kafka.connect.json.JsonConverterTest > mapToConnectStringKeys STARTED

org.apache.kafka.connect.json.JsonConverterTest > mapToConnectStringKeys PASSED

org.apache.kafka.connect.json.JsonConverterTest > dateToConnectOptional STARTED

org.apache.kafka.connect.json.JsonConverterTest > dateToConnectOptional PASSED

org.apache.kafka.connect.json.JsonConverterTest > timeToConnectOptionalWithDefaultValue STARTED

org.apache.kafka.connect.json.JsonConverterTest > timeToConnectOptionalWithDefaultValue PASSED

org.apache.kafka.connect.json.JsonConverterTest > floatToConnect STARTED

org.apache.kafka.connect.json.JsonConverterTest > floatToConnect PASSED

org.apache.kafka.connect.json.JsonConverterTest > decimalToConnectWithDefaultValue STARTED

org.apache.kafka.connect.json.JsonConverterTest > decimalToConnectWithDefaultValue PASSED

org.apache.kafka.connect.json.JsonConverterTest > decimalToJson STARTED

org.apache.kafka.connect.json.JsonConverterTest > decimalToJson PASSED

org.apache.kafka.connect.json.JsonConverterTest > arrayToConnect STARTED

org.apache.kafka.connect.json.JsonConverterTest > arrayToConnect PASSED

org.apache.kafka.connect.json.JsonConverterTest > testCacheSchemaToConnectConversion STARTED

org.apache.kafka.connect.json.JsonConverterTest > testCacheSchemaToConnectConversion PASSED

org.apache.kafka.connect.json.JsonConverterTest > booleanToJson STARTED

org.apache.kafka.connect.json.JsonConverterTest > booleanToJson PASSED

org.apache.kafka.connect.json.JsonConverterTest > bytesToConnect STARTED

org.apache.kafka.connect.json.JsonConverterTest > bytesToConnect PASSED

org.apache.kafka.connect.json.JsonConverterTest > doubleToConnect STARTED

org.apache.kafka.connect.json.JsonConverterTest > doubleToConnect PASSED

org.apache.kafka.connect.json.JsonConverterTest > timestampToConnectOptionalWithDefaultValue STARTED

org.apache.kafka.connect.json.JsonConverterTest > timestampToConnectOptionalWithDefaultValue PASSED

> Task :connect:basic-auth-extension:test

org.apache.kafka.connect.rest.basic.auth.extension.JaasBasicAuthFilterTest > testSuccess STARTED
WARNING: An illegal reflective access operation has occurred
WARNING: Illegal reflective access by org.powermock.reflect.internal.WhiteboxImpl (file:/home/jenkins/.gradle/caches/modules-2/files-2.1/org.powermock/powermock-reflect/2.0.0/cd452bc345ec9f88ec5efecd41139de0cb1d4265/powermock-reflect-2.0.0.jar) to method java.lang.Object.clone()
WARNING: Please consider reporting this to the maintainers of org.powermock.reflect.internal.WhiteboxImpl
WARNING: Use --illegal-access=warn to enable warnings of further illegal reflective access operations
WARNING: All illegal access operations will be denied in a future release

org.apache.kafka.connect.rest.basic.auth.extension.JaasBasicAuthFilterTest > testSuccess PASSED

org.apache.kafka.connect.rest.basic.auth.extension.JaasBasicAuthFilterTest > testBadCredential STARTED

org.apache.kafka.connect.rest.basic.auth.extension.JaasBasicAuthFilterTest > testBadCredential PASSED

org.apache.kafka.connect.rest.basic.auth.extension.JaasBasicAuthFilterTest > testBadPassword STARTED

org.apache.kafka.connect.rest.basic.auth.extension.JaasBasicAuthFilterTest > testBadPassword PASSED

org.apache.kafka.connect.rest.basic.auth.extension.JaasBasicAuthFilterTest > testUnknownBearer STARTED

org.apache.kafka.connect.rest.basic.auth.extension.JaasBasicAuthFilterTest > testUnknownBearer PASSED

org.apache.kafka.connect.rest.basic.auth.extension.JaasBasicAuthFilterTest > testUnknownLoginModule STARTED

org.apache.kafka.connect.rest.basic.auth.extension.JaasBasicAuthFilterTest > testUnknownLoginModule PASSED

org.apache.kafka.connect.rest.basic.auth.extension.JaasBasicAuthFilterTest > testUnknownCredentialsFile STARTED

org.apache.kafka.connect.rest.basic.auth.extension.JaasBasicAuthFilterTest > testUnknownCredentialsFile PASSED

org.apache.kafka.connect.rest.basic.auth.extension.JaasBasicAuthFilterTest > testEmptyCredentialsFile STARTED

org.apache.kafka.connect.rest.basic.auth.extension.JaasBasicAuthFilterTest > testEmptyCredentialsFile PASSED

org.apache.kafka.connect.rest.basic.auth.extension.JaasBasicAuthFilterTest > testNoFileOption STARTED

org.apache.kafka.connect.rest.basic.auth.extension.JaasBasicAuthFilterTest > testNoFileOption PASSED

FAILURE: Build completed with 2 failures.

1: Task failed with an exception.
-----------
* What went wrong:
Execution failed for task ':connect:runtime:test'.
> There were failing tests. See the report at: file://<https://builds.apache.org/job/kafka-trunk-jdk11/ws/connect/runtime/build/reports/tests/test/index.html>

* Try:
Run with --stacktrace option to get the stack trace. Run with --info or --debug option to get more log output. Run with --scan to get full insights.
==============================================================================

2: Task failed with an exception.
-----------
* What went wrong:
Execution failed for task ':core:test'.
> There were failing tests. See the report at: file://<https://builds.apache.org/job/kafka-trunk-jdk11/ws/core/build/reports/tests/test/index.html>

* Try:
Run with --stacktrace option to get the stack trace. Run with --info or --debug option to get more log output. Run with --scan to get full insights.
==============================================================================

* Get more help at https://help.gradle.org

Deprecated Gradle features were used in this build, making it incompatible with Gradle 6.0.
Use '--warning-mode all' to show the individual deprecation warnings.
See https://docs.gradle.org/5.1/userguide/command_line_interface.html#sec:command_line_warnings

BUILD FAILED in 2h 34m 48s
166 actionable tasks: 165 executed, 1 up-to-date
Build step 'Execute shell' marked build as failure
Recording test results
Setting GRADLE_4_10_2_HOME=/home/jenkins/tools/gradle/4.10.2
Setting GRADLE_4_10_2_HOME=/home/jenkins/tools/gradle/4.10.2
Not sending mail to unregistered user noreply@github.com

Jenkins build is back to normal : kafka-trunk-jdk11 #222

Posted by Apache Jenkins Server <je...@builds.apache.org>.
See <https://builds.apache.org/job/kafka-trunk-jdk11/222/display/redirect?page=changes>


Build failed in Jenkins: kafka-trunk-jdk11 #221

Posted by Apache Jenkins Server <je...@builds.apache.org>.
See <https://builds.apache.org/job/kafka-trunk-jdk11/221/display/redirect?page=changes>

Changes:

[junrao] MINOR: log when controller begins processing logdir failure event

------------------------------------------
[...truncated 2.27 MB...]

org.apache.kafka.connect.header.ConnectHeadersTest > shouldValidateLogicalTypes PASSED

org.apache.kafka.connect.header.ConnectHeadersTest > shouldHaveToString STARTED

org.apache.kafka.connect.header.ConnectHeadersTest > shouldHaveToString PASSED

org.apache.kafka.connect.header.ConnectHeadersTest > shouldTransformHeadersWithKey STARTED

org.apache.kafka.connect.header.ConnectHeadersTest > shouldTransformHeadersWithKey PASSED

org.apache.kafka.connect.header.ConnectHeadersTest > shouldAddDate STARTED

org.apache.kafka.connect.header.ConnectHeadersTest > shouldAddDate PASSED

org.apache.kafka.connect.header.ConnectHeadersTest > shouldAddTime STARTED

org.apache.kafka.connect.header.ConnectHeadersTest > shouldAddTime PASSED

org.apache.kafka.connect.header.ConnectHeadersTest > shouldNotAddHeadersWithObjectValuesAndMismatchedSchema STARTED

org.apache.kafka.connect.header.ConnectHeadersTest > shouldNotAddHeadersWithObjectValuesAndMismatchedSchema PASSED

org.apache.kafka.connect.header.ConnectHeadersTest > shouldNotValidateMismatchedValuesWithBuiltInTypes STARTED

org.apache.kafka.connect.header.ConnectHeadersTest > shouldNotValidateMismatchedValuesWithBuiltInTypes PASSED

org.apache.kafka.connect.header.ConnectHeadersTest > shouldRemoveAllHeadersWithSameKey STARTED

org.apache.kafka.connect.header.ConnectHeadersTest > shouldRemoveAllHeadersWithSameKey PASSED

org.apache.kafka.connect.header.ConnectHeadersTest > shouldTransformAndRemoveHeaders STARTED

org.apache.kafka.connect.header.ConnectHeadersTest > shouldTransformAndRemoveHeaders PASSED

org.apache.kafka.connect.header.ConnectHeadersTest > shouldBeEquals STARTED

org.apache.kafka.connect.header.ConnectHeadersTest > shouldBeEquals PASSED

org.apache.kafka.connect.header.ConnectHeadersTest > shouldValidateBuildInTypes STARTED

org.apache.kafka.connect.header.ConnectHeadersTest > shouldValidateBuildInTypes PASSED

org.apache.kafka.connect.header.ConnectHeadersTest > shouldRemoveAllHeaders STARTED

org.apache.kafka.connect.header.ConnectHeadersTest > shouldRemoveAllHeaders PASSED

org.apache.kafka.connect.header.ConnectHeadersTest > shouldNotValidateNullValuesWithBuiltInTypes STARTED

org.apache.kafka.connect.header.ConnectHeadersTest > shouldNotValidateNullValuesWithBuiltInTypes PASSED

org.apache.kafka.connect.header.ConnectHeadersTest > shouldTransformHeaders STARTED

org.apache.kafka.connect.header.ConnectHeadersTest > shouldTransformHeaders PASSED

org.apache.kafka.connect.header.ConnectHeadersTest > shouldAddMultipleHeadersWithSameKeyAndRetainLatest STARTED

org.apache.kafka.connect.header.ConnectHeadersTest > shouldAddMultipleHeadersWithSameKeyAndRetainLatest PASSED

org.apache.kafka.connect.header.ConnectHeadersTest > shouldAddHeadersWithPrimitiveValues STARTED

org.apache.kafka.connect.header.ConnectHeadersTest > shouldAddHeadersWithPrimitiveValues PASSED

org.apache.kafka.connect.header.ConnectHeadersTest > shouldNotAddHeadersWithNullObjectValuesWithNonOptionalSchema STARTED

org.apache.kafka.connect.header.ConnectHeadersTest > shouldNotAddHeadersWithNullObjectValuesWithNonOptionalSchema PASSED

org.apache.kafka.connect.header.ConnectHeadersTest > shouldDuplicateAndAlwaysReturnEquivalentButDifferentObject STARTED

org.apache.kafka.connect.header.ConnectHeadersTest > shouldDuplicateAndAlwaysReturnEquivalentButDifferentObject PASSED

org.apache.kafka.connect.header.ConnectHeadersTest > shouldAddTimestamp STARTED

org.apache.kafka.connect.header.ConnectHeadersTest > shouldAddTimestamp PASSED

org.apache.kafka.connect.header.ConnectHeadersTest > shouldAddDecimal STARTED

org.apache.kafka.connect.header.ConnectHeadersTest > shouldAddDecimal PASSED

org.apache.kafka.connect.header.ConnectHeadersTest > shouldAddHeadersWithNullObjectValuesWithOptionalSchema STARTED

org.apache.kafka.connect.header.ConnectHeadersTest > shouldAddHeadersWithNullObjectValuesWithOptionalSchema PASSED

> Task :jmh-benchmarks:test NO-SOURCE

> Task :streams:streams-scala:test

org.apache.kafka.streams.scala.kstream.ConsumedTest > Create a Consumed should create a Consumed with Serdes STARTED

org.apache.kafka.streams.scala.kstream.ConsumedTest > Create a Consumed should create a Consumed with Serdes PASSED

org.apache.kafka.streams.scala.kstream.ConsumedTest > Create a Consumed with timestampExtractor and resetPolicy should create a Consumed with Serdes, timestampExtractor and resetPolicy STARTED

org.apache.kafka.streams.scala.kstream.ConsumedTest > Create a Consumed with timestampExtractor and resetPolicy should create a Consumed with Serdes, timestampExtractor and resetPolicy PASSED

org.apache.kafka.streams.scala.kstream.ConsumedTest > Create a Consumed with timestampExtractor should create a Consumed with Serdes and timestampExtractor STARTED

org.apache.kafka.streams.scala.kstream.ConsumedTest > Create a Consumed with timestampExtractor should create a Consumed with Serdes and timestampExtractor PASSED

org.apache.kafka.streams.scala.kstream.ConsumedTest > Create a Consumed with resetPolicy should create a Consumed with Serdes and resetPolicy STARTED

org.apache.kafka.streams.scala.kstream.ConsumedTest > Create a Consumed with resetPolicy should create a Consumed with Serdes and resetPolicy PASSED

org.apache.kafka.streams.scala.kstream.KTableTest > filter a KTable should filter records satisfying the predicate STARTED

org.apache.kafka.streams.scala.kstream.KTableTest > filter a KTable should filter records satisfying the predicate PASSED

org.apache.kafka.streams.scala.kstream.KTableTest > filterNot a KTable should filter records not satisfying the predicate STARTED

org.apache.kafka.streams.scala.kstream.KTableTest > filterNot a KTable should filter records not satisfying the predicate PASSED

org.apache.kafka.streams.scala.kstream.KTableTest > join 2 KTables should join correctly records STARTED

org.apache.kafka.streams.scala.kstream.KTableTest > join 2 KTables should join correctly records PASSED

org.apache.kafka.streams.scala.kstream.KTableTest > join 2 KTables with a Materialized should join correctly records and state store STARTED

org.apache.kafka.streams.scala.kstream.KTableTest > join 2 KTables with a Materialized should join correctly records and state store PASSED

org.apache.kafka.streams.scala.kstream.ProducedTest > Create a Produced should create a Produced with Serdes STARTED

org.apache.kafka.streams.scala.kstream.ProducedTest > Create a Produced should create a Produced with Serdes PASSED

org.apache.kafka.streams.scala.kstream.ProducedTest > Create a Produced with timestampExtractor and resetPolicy should create a Consumed with Serdes, timestampExtractor and resetPolicy STARTED

org.apache.kafka.streams.scala.kstream.ProducedTest > Create a Produced with timestampExtractor and resetPolicy should create a Consumed with Serdes, timestampExtractor and resetPolicy PASSED

org.apache.kafka.streams.scala.kstream.GroupedTest > Create a Grouped should create a Grouped with Serdes STARTED

org.apache.kafka.streams.scala.kstream.GroupedTest > Create a Grouped should create a Grouped with Serdes PASSED

org.apache.kafka.streams.scala.kstream.GroupedTest > Create a Grouped with repartition topic name should create a Grouped with Serdes, and repartition topic name STARTED

org.apache.kafka.streams.scala.kstream.GroupedTest > Create a Grouped with repartition topic name should create a Grouped with Serdes, and repartition topic name PASSED

org.apache.kafka.streams.scala.kstream.JoinedTest > Create a Joined should create a Joined with Serdes STARTED

org.apache.kafka.streams.scala.kstream.JoinedTest > Create a Joined should create a Joined with Serdes PASSED

org.apache.kafka.streams.scala.kstream.JoinedTest > Create a Joined should create a Joined with Serdes and repartition topic name STARTED

org.apache.kafka.streams.scala.kstream.JoinedTest > Create a Joined should create a Joined with Serdes and repartition topic name PASSED

org.apache.kafka.streams.scala.kstream.MaterializedTest > Create a Materialized should create a Materialized with Serdes STARTED

org.apache.kafka.streams.scala.kstream.MaterializedTest > Create a Materialized should create a Materialized with Serdes PASSED

org.apache.kafka.streams.scala.kstream.MaterializedTest > Create a Materialize with a store name should create a Materialized with Serdes and a store name STARTED

org.apache.kafka.streams.scala.kstream.MaterializedTest > Create a Materialize with a store name should create a Materialized with Serdes and a store name PASSED

org.apache.kafka.streams.scala.kstream.MaterializedTest > Create a Materialize with a window store supplier should create a Materialized with Serdes and a store supplier STARTED

org.apache.kafka.streams.scala.kstream.MaterializedTest > Create a Materialize with a window store supplier should create a Materialized with Serdes and a store supplier PASSED

org.apache.kafka.streams.scala.kstream.MaterializedTest > Create a Materialize with a key value store supplier should create a Materialized with Serdes and a store supplier STARTED

org.apache.kafka.streams.scala.kstream.MaterializedTest > Create a Materialize with a key value store supplier should create a Materialized with Serdes and a store supplier PASSED

org.apache.kafka.streams.scala.kstream.MaterializedTest > Create a Materialize with a session store supplier should create a Materialized with Serdes and a store supplier STARTED

org.apache.kafka.streams.scala.kstream.MaterializedTest > Create a Materialize with a session store supplier should create a Materialized with Serdes and a store supplier PASSED

org.apache.kafka.streams.scala.kstream.KStreamTest > filter a KStream should filter records satisfying the predicate STARTED

org.apache.kafka.streams.scala.kstream.KStreamTest > filter a KStream should filter records satisfying the predicate PASSED

org.apache.kafka.streams.scala.kstream.KStreamTest > filterNot a KStream should filter records not satisfying the predicate STARTED

org.apache.kafka.streams.scala.kstream.KStreamTest > filterNot a KStream should filter records not satisfying the predicate PASSED

org.apache.kafka.streams.scala.kstream.KStreamTest > foreach a KStream should run foreach actions on records STARTED

org.apache.kafka.streams.scala.kstream.KStreamTest > foreach a KStream should run foreach actions on records PASSED

org.apache.kafka.streams.scala.kstream.KStreamTest > peek a KStream should run peek actions on records STARTED

org.apache.kafka.streams.scala.kstream.KStreamTest > peek a KStream should run peek actions on records PASSED

org.apache.kafka.streams.scala.kstream.KStreamTest > selectKey a KStream should select a new key STARTED

org.apache.kafka.streams.scala.kstream.KStreamTest > selectKey a KStream should select a new key PASSED

org.apache.kafka.streams.scala.kstream.KStreamTest > join 2 KStreams should join correctly records STARTED

org.apache.kafka.streams.scala.kstream.KStreamTest > join 2 KStreams should join correctly records PASSED

org.apache.kafka.streams.scala.TopologyTest > shouldBuildIdenticalTopologyInJavaNScalaJoin STARTED

org.apache.kafka.streams.scala.TopologyTest > shouldBuildIdenticalTopologyInJavaNScalaJoin PASSED

org.apache.kafka.streams.scala.TopologyTest > shouldBuildIdenticalTopologyInJavaNScalaSimple STARTED

org.apache.kafka.streams.scala.TopologyTest > shouldBuildIdenticalTopologyInJavaNScalaSimple PASSED

org.apache.kafka.streams.scala.TopologyTest > shouldBuildIdenticalTopologyInJavaNScalaAggregate STARTED

org.apache.kafka.streams.scala.TopologyTest > shouldBuildIdenticalTopologyInJavaNScalaAggregate PASSED

org.apache.kafka.streams.scala.TopologyTest > shouldBuildIdenticalTopologyInJavaNScalaTransform STARTED

org.apache.kafka.streams.scala.TopologyTest > shouldBuildIdenticalTopologyInJavaNScalaTransform PASSED

org.apache.kafka.streams.scala.StreamToTableJoinScalaIntegrationTestImplicitSerdes > testShouldCountClicksPerRegionWithNamedRepartitionTopic STARTED

org.apache.kafka.streams.scala.StreamToTableJoinScalaIntegrationTestImplicitSerdes > testShouldCountClicksPerRegionWithNamedRepartitionTopic PASSED

org.apache.kafka.streams.scala.StreamToTableJoinScalaIntegrationTestImplicitSerdes > testShouldCountClicksPerRegionJava STARTED

org.apache.kafka.streams.scala.StreamToTableJoinScalaIntegrationTestImplicitSerdes > testShouldCountClicksPerRegionJava PASSED

org.apache.kafka.streams.scala.StreamToTableJoinScalaIntegrationTestImplicitSerdes > testShouldCountClicksPerRegion STARTED

org.apache.kafka.streams.scala.StreamToTableJoinScalaIntegrationTestImplicitSerdes > testShouldCountClicksPerRegion PASSED

org.apache.kafka.streams.scala.WordCountTest > testShouldCountWordsMaterialized STARTED

org.apache.kafka.streams.scala.WordCountTest > testShouldCountWordsMaterialized PASSED

org.apache.kafka.streams.scala.WordCountTest > testShouldCountWordsJava STARTED

org.apache.kafka.streams.scala.WordCountTest > testShouldCountWordsJava PASSED

org.apache.kafka.streams.scala.WordCountTest > testShouldCountWords STARTED

org.apache.kafka.streams.scala.WordCountTest > testShouldCountWords PASSED

FAILURE: Build failed with an exception.

* What went wrong:
Execution failed for task ':connect:runtime:test'.
> There were failing tests. See the report at: file://<https://builds.apache.org/job/kafka-trunk-jdk11/ws/connect/runtime/build/reports/tests/test/index.html>

* Try:
Run with --stacktrace option to get the stack trace. Run with --info or --debug option to get more log output. Run with --scan to get full insights.

* Get more help at https://help.gradle.org

Deprecated Gradle features were used in this build, making it incompatible with Gradle 6.0.
Use '--warning-mode all' to show the individual deprecation warnings.
See https://docs.gradle.org/5.1/userguide/command_line_interface.html#sec:command_line_warnings

BUILD FAILED in 2h 23m 4s
166 actionable tasks: 162 executed, 4 up-to-date
Build step 'Execute shell' marked build as failure
Recording test results
Setting GRADLE_4_10_2_HOME=/home/jenkins/tools/gradle/4.10.2
Setting GRADLE_4_10_2_HOME=/home/jenkins/tools/gradle/4.10.2
Not sending mail to unregistered user noreply@github.com

Build failed in Jenkins: kafka-trunk-jdk11 #220

Posted by Apache Jenkins Server <je...@builds.apache.org>.
See <https://builds.apache.org/job/kafka-trunk-jdk11/220/display/redirect?page=changes>

Changes:

[junrao] KAFKA-7829; Javadoc should show that AdminClient.alterReplicaLogDirs()

------------------------------------------
[...truncated 2.27 MB...]

org.apache.kafka.connect.json.JsonConverterTest > timestampToJson PASSED

org.apache.kafka.connect.json.JsonConverterTest > timestampToConnect STARTED

org.apache.kafka.connect.json.JsonConverterTest > timestampToConnect PASSED

org.apache.kafka.connect.json.JsonConverterTest > timestampToConnectWithDefaultValue STARTED

org.apache.kafka.connect.json.JsonConverterTest > timestampToConnectWithDefaultValue PASSED

org.apache.kafka.connect.json.JsonConverterTest > timeToConnectOptional STARTED

org.apache.kafka.connect.json.JsonConverterTest > timeToConnectOptional PASSED

org.apache.kafka.connect.json.JsonConverterTest > dateToConnectWithDefaultValue STARTED

org.apache.kafka.connect.json.JsonConverterTest > dateToConnectWithDefaultValue PASSED

org.apache.kafka.connect.json.JsonConverterTest > nullValueToJson STARTED

org.apache.kafka.connect.json.JsonConverterTest > nullValueToJson PASSED

org.apache.kafka.connect.json.JsonConverterTest > decimalToConnect STARTED

org.apache.kafka.connect.json.JsonConverterTest > decimalToConnect PASSED

org.apache.kafka.connect.json.JsonConverterTest > stringHeaderToConnect STARTED

org.apache.kafka.connect.json.JsonConverterTest > stringHeaderToConnect PASSED

org.apache.kafka.connect.json.JsonConverterTest > mapToJsonNonStringKeys STARTED

org.apache.kafka.connect.json.JsonConverterTest > mapToJsonNonStringKeys PASSED

org.apache.kafka.connect.json.JsonConverterTest > longToJson STARTED

org.apache.kafka.connect.json.JsonConverterTest > longToJson PASSED

org.apache.kafka.connect.json.JsonConverterTest > mismatchSchemaJson STARTED

org.apache.kafka.connect.json.JsonConverterTest > mismatchSchemaJson PASSED

org.apache.kafka.connect.json.JsonConverterTest > mapToConnectNonStringKeys STARTED

org.apache.kafka.connect.json.JsonConverterTest > mapToConnectNonStringKeys PASSED

org.apache.kafka.connect.json.JsonConverterTest > testJsonSchemaMetadataTranslation STARTED

org.apache.kafka.connect.json.JsonConverterTest > testJsonSchemaMetadataTranslation PASSED

org.apache.kafka.connect.json.JsonConverterTest > bytesToJson STARTED

org.apache.kafka.connect.json.JsonConverterTest > bytesToJson PASSED

org.apache.kafka.connect.json.JsonConverterTest > shortToConnect STARTED

org.apache.kafka.connect.json.JsonConverterTest > shortToConnect PASSED

org.apache.kafka.connect.json.JsonConverterTest > intToJson STARTED

org.apache.kafka.connect.json.JsonConverterTest > intToJson PASSED

org.apache.kafka.connect.json.JsonConverterTest > nullSchemaAndNullValueToJson STARTED

org.apache.kafka.connect.json.JsonConverterTest > nullSchemaAndNullValueToJson PASSED

org.apache.kafka.connect.json.JsonConverterTest > timestampToConnectOptional STARTED

org.apache.kafka.connect.json.JsonConverterTest > timestampToConnectOptional PASSED

org.apache.kafka.connect.json.JsonConverterTest > structToConnect STARTED

org.apache.kafka.connect.json.JsonConverterTest > structToConnect PASSED

org.apache.kafka.connect.json.JsonConverterTest > stringToJson STARTED

org.apache.kafka.connect.json.JsonConverterTest > stringToJson PASSED

org.apache.kafka.connect.json.JsonConverterTest > nullSchemaAndArrayToJson STARTED

org.apache.kafka.connect.json.JsonConverterTest > nullSchemaAndArrayToJson PASSED

org.apache.kafka.connect.json.JsonConverterTest > byteToConnect STARTED

org.apache.kafka.connect.json.JsonConverterTest > byteToConnect PASSED

org.apache.kafka.connect.json.JsonConverterTest > nullSchemaPrimitiveToConnect STARTED

org.apache.kafka.connect.json.JsonConverterTest > nullSchemaPrimitiveToConnect PASSED

org.apache.kafka.connect.json.JsonConverterTest > byteToJson STARTED

org.apache.kafka.connect.json.JsonConverterTest > byteToJson PASSED

org.apache.kafka.connect.json.JsonConverterTest > intToConnect STARTED

org.apache.kafka.connect.json.JsonConverterTest > intToConnect PASSED

org.apache.kafka.connect.json.JsonConverterTest > dateToJson STARTED

org.apache.kafka.connect.json.JsonConverterTest > dateToJson PASSED

org.apache.kafka.connect.json.JsonConverterTest > noSchemaToConnect STARTED

org.apache.kafka.connect.json.JsonConverterTest > noSchemaToConnect PASSED

org.apache.kafka.connect.json.JsonConverterTest > noSchemaToJson STARTED

org.apache.kafka.connect.json.JsonConverterTest > noSchemaToJson PASSED

org.apache.kafka.connect.json.JsonConverterTest > nullSchemaAndPrimitiveToJson STARTED

org.apache.kafka.connect.json.JsonConverterTest > nullSchemaAndPrimitiveToJson PASSED

org.apache.kafka.connect.json.JsonConverterTest > decimalToConnectOptionalWithDefaultValue STARTED

org.apache.kafka.connect.json.JsonConverterTest > decimalToConnectOptionalWithDefaultValue PASSED

org.apache.kafka.connect.json.JsonConverterTest > mapToJsonStringKeys STARTED

org.apache.kafka.connect.json.JsonConverterTest > mapToJsonStringKeys PASSED

org.apache.kafka.connect.json.JsonConverterTest > arrayToJson STARTED

org.apache.kafka.connect.json.JsonConverterTest > arrayToJson PASSED

org.apache.kafka.connect.json.JsonConverterTest > nullToConnect STARTED

org.apache.kafka.connect.json.JsonConverterTest > nullToConnect PASSED

org.apache.kafka.connect.json.JsonConverterTest > timeToJson STARTED

org.apache.kafka.connect.json.JsonConverterTest > timeToJson PASSED

org.apache.kafka.connect.json.JsonConverterTest > structToJson STARTED

org.apache.kafka.connect.json.JsonConverterTest > structToJson PASSED

org.apache.kafka.connect.json.JsonConverterTest > testConnectSchemaMetadataTranslation STARTED

org.apache.kafka.connect.json.JsonConverterTest > testConnectSchemaMetadataTranslation PASSED

org.apache.kafka.connect.json.JsonConverterTest > shortToJson STARTED

org.apache.kafka.connect.json.JsonConverterTest > shortToJson PASSED

org.apache.kafka.connect.json.JsonConverterTest > dateToConnect STARTED

org.apache.kafka.connect.json.JsonConverterTest > dateToConnect PASSED

org.apache.kafka.connect.json.JsonConverterTest > doubleToJson STARTED

org.apache.kafka.connect.json.JsonConverterTest > doubleToJson PASSED

org.apache.kafka.connect.json.JsonConverterTest > testStringHeaderToJson STARTED

org.apache.kafka.connect.json.JsonConverterTest > testStringHeaderToJson PASSED

org.apache.kafka.connect.json.JsonConverterTest > decimalToConnectOptional STARTED

org.apache.kafka.connect.json.JsonConverterTest > decimalToConnectOptional PASSED

org.apache.kafka.connect.json.JsonConverterTest > structSchemaIdentical STARTED

org.apache.kafka.connect.json.JsonConverterTest > structSchemaIdentical PASSED

org.apache.kafka.connect.json.JsonConverterTest > timeToConnectWithDefaultValue STARTED

org.apache.kafka.connect.json.JsonConverterTest > timeToConnectWithDefaultValue PASSED

org.apache.kafka.connect.json.JsonConverterTest > timeToConnect STARTED

org.apache.kafka.connect.json.JsonConverterTest > timeToConnect PASSED

org.apache.kafka.connect.json.JsonConverterTest > dateToConnectOptionalWithDefaultValue STARTED

org.apache.kafka.connect.json.JsonConverterTest > dateToConnectOptionalWithDefaultValue PASSED

org.apache.kafka.connect.json.JsonConverterTest > mapToConnectStringKeys STARTED

org.apache.kafka.connect.json.JsonConverterTest > mapToConnectStringKeys PASSED

org.apache.kafka.connect.json.JsonConverterTest > dateToConnectOptional STARTED

org.apache.kafka.connect.json.JsonConverterTest > dateToConnectOptional PASSED

org.apache.kafka.connect.json.JsonConverterTest > timeToConnectOptionalWithDefaultValue STARTED

org.apache.kafka.connect.json.JsonConverterTest > timeToConnectOptionalWithDefaultValue PASSED

org.apache.kafka.connect.json.JsonConverterTest > floatToConnect STARTED

org.apache.kafka.connect.json.JsonConverterTest > floatToConnect PASSED

org.apache.kafka.connect.json.JsonConverterTest > decimalToConnectWithDefaultValue STARTED

org.apache.kafka.connect.json.JsonConverterTest > decimalToConnectWithDefaultValue PASSED

org.apache.kafka.connect.json.JsonConverterTest > decimalToJson STARTED

org.apache.kafka.connect.json.JsonConverterTest > decimalToJson PASSED

org.apache.kafka.connect.json.JsonConverterTest > arrayToConnect STARTED

org.apache.kafka.connect.json.JsonConverterTest > arrayToConnect PASSED

org.apache.kafka.connect.json.JsonConverterTest > testCacheSchemaToConnectConversion STARTED

org.apache.kafka.connect.json.JsonConverterTest > testCacheSchemaToConnectConversion PASSED

org.apache.kafka.connect.json.JsonConverterTest > booleanToJson STARTED

org.apache.kafka.connect.json.JsonConverterTest > booleanToJson PASSED

org.apache.kafka.connect.json.JsonConverterTest > bytesToConnect STARTED

org.apache.kafka.connect.json.JsonConverterTest > bytesToConnect PASSED

org.apache.kafka.connect.json.JsonConverterTest > doubleToConnect STARTED

org.apache.kafka.connect.json.JsonConverterTest > doubleToConnect PASSED

org.apache.kafka.connect.json.JsonConverterTest > timestampToConnectOptionalWithDefaultValue STARTED

org.apache.kafka.connect.json.JsonConverterTest > timestampToConnectOptionalWithDefaultValue PASSED

FAILURE: Build failed with an exception.

* What went wrong:
Execution failed for task ':core:test'.
> There were failing tests. See the report at: file://<https://builds.apache.org/job/kafka-trunk-jdk11/ws/core/build/reports/tests/test/index.html>

* Try:
Run with --stacktrace option to get the stack trace. Run with --info or --debug option to get more log output. Run with --scan to get full insights.

* Get more help at https://help.gradle.org

Deprecated Gradle features were used in this build, making it incompatible with Gradle 6.0.
Use '--warning-mode all' to show the individual deprecation warnings.
See https://docs.gradle.org/5.1/userguide/command_line_interface.html#sec:command_line_warnings

BUILD FAILED in 2h 12m 50s
166 actionable tasks: 165 executed, 1 up-to-date
Build step 'Execute shell' marked build as failure
Recording test results
Setting GRADLE_4_10_2_HOME=/home/jenkins/tools/gradle/4.10.2
Setting GRADLE_4_10_2_HOME=/home/jenkins/tools/gradle/4.10.2
Not sending mail to unregistered user noreply@github.com

Build failed in Jenkins: kafka-trunk-jdk11 #219

Posted by Apache Jenkins Server <je...@builds.apache.org>.
See <https://builds.apache.org/job/kafka-trunk-jdk11/219/display/redirect?page=changes>

Changes:

[jason] KAFKA-7738; Track leader epochs in client Metadata (#6045)

------------------------------------------
[...truncated 2.27 MB...]

org.apache.kafka.connect.transforms.MaskFieldTest > withSchema STARTED

org.apache.kafka.connect.transforms.MaskFieldTest > withSchema PASSED

org.apache.kafka.connect.transforms.MaskFieldTest > schemaless STARTED

org.apache.kafka.connect.transforms.MaskFieldTest > schemaless PASSED

org.apache.kafka.connect.transforms.ExtractFieldTest > withSchema STARTED

org.apache.kafka.connect.transforms.ExtractFieldTest > withSchema PASSED

org.apache.kafka.connect.transforms.ExtractFieldTest > testNullWithSchema STARTED

org.apache.kafka.connect.transforms.ExtractFieldTest > testNullWithSchema PASSED

org.apache.kafka.connect.transforms.ExtractFieldTest > schemaless STARTED

org.apache.kafka.connect.transforms.ExtractFieldTest > schemaless PASSED

org.apache.kafka.connect.transforms.ExtractFieldTest > testNullSchemaless STARTED

org.apache.kafka.connect.transforms.ExtractFieldTest > testNullSchemaless PASSED

org.apache.kafka.connect.transforms.TimestampRouterTest > defaultConfiguration STARTED

org.apache.kafka.connect.transforms.TimestampRouterTest > defaultConfiguration PASSED

org.apache.kafka.connect.transforms.CastTest > castWholeDateRecordValueWithSchemaString STARTED

org.apache.kafka.connect.transforms.CastTest > castWholeDateRecordValueWithSchemaString PASSED

org.apache.kafka.connect.transforms.CastTest > castWholeRecordValueSchemalessBooleanTrue STARTED

org.apache.kafka.connect.transforms.CastTest > castWholeRecordValueSchemalessBooleanTrue PASSED

org.apache.kafka.connect.transforms.CastTest > testConfigInvalidTargetType STARTED

org.apache.kafka.connect.transforms.CastTest > testConfigInvalidTargetType PASSED

org.apache.kafka.connect.transforms.CastTest > testConfigMixWholeAndFieldTransformation STARTED

org.apache.kafka.connect.transforms.CastTest > testConfigMixWholeAndFieldTransformation PASSED

org.apache.kafka.connect.transforms.CastTest > castWholeRecordValueSchemalessFloat32 STARTED

org.apache.kafka.connect.transforms.CastTest > castWholeRecordValueSchemalessFloat32 PASSED

org.apache.kafka.connect.transforms.CastTest > castWholeRecordValueSchemalessFloat64 STARTED

org.apache.kafka.connect.transforms.CastTest > castWholeRecordValueSchemalessFloat64 PASSED

org.apache.kafka.connect.transforms.CastTest > castWholeRecordValueSchemalessUnsupportedType STARTED

org.apache.kafka.connect.transforms.CastTest > castWholeRecordValueSchemalessUnsupportedType PASSED

org.apache.kafka.connect.transforms.CastTest > castWholeRecordKeySchemaless STARTED

org.apache.kafka.connect.transforms.CastTest > castWholeRecordKeySchemaless PASSED

org.apache.kafka.connect.transforms.CastTest > castWholeRecordValueWithSchemaFloat32 STARTED

org.apache.kafka.connect.transforms.CastTest > castWholeRecordValueWithSchemaFloat32 PASSED

org.apache.kafka.connect.transforms.CastTest > castWholeRecordValueWithSchemaFloat64 STARTED

org.apache.kafka.connect.transforms.CastTest > castWholeRecordValueWithSchemaFloat64 PASSED

org.apache.kafka.connect.transforms.CastTest > castWholeRecordValueWithSchemaString STARTED

org.apache.kafka.connect.transforms.CastTest > castWholeRecordValueWithSchemaString PASSED

org.apache.kafka.connect.transforms.CastTest > testConfigEmpty STARTED

org.apache.kafka.connect.transforms.CastTest > testConfigEmpty PASSED

org.apache.kafka.connect.transforms.CastTest > castWholeRecordValueSchemalessInt16 STARTED

org.apache.kafka.connect.transforms.CastTest > castWholeRecordValueSchemalessInt16 PASSED

org.apache.kafka.connect.transforms.CastTest > castWholeRecordValueSchemalessInt32 STARTED

org.apache.kafka.connect.transforms.CastTest > castWholeRecordValueSchemalessInt32 PASSED

org.apache.kafka.connect.transforms.CastTest > castWholeRecordValueSchemalessInt64 STARTED

org.apache.kafka.connect.transforms.CastTest > castWholeRecordValueSchemalessInt64 PASSED

org.apache.kafka.connect.transforms.CastTest > castFieldsSchemaless STARTED

org.apache.kafka.connect.transforms.CastTest > castFieldsSchemaless PASSED

org.apache.kafka.connect.transforms.CastTest > testUnsupportedTargetType STARTED

org.apache.kafka.connect.transforms.CastTest > testUnsupportedTargetType PASSED

org.apache.kafka.connect.transforms.CastTest > castWholeRecordValueWithSchemaInt16 STARTED

org.apache.kafka.connect.transforms.CastTest > castWholeRecordValueWithSchemaInt16 PASSED

org.apache.kafka.connect.transforms.CastTest > castWholeRecordValueWithSchemaInt32 STARTED

org.apache.kafka.connect.transforms.CastTest > castWholeRecordValueWithSchemaInt32 PASSED

org.apache.kafka.connect.transforms.CastTest > castWholeRecordValueWithSchemaInt64 STARTED

org.apache.kafka.connect.transforms.CastTest > castWholeRecordValueWithSchemaInt64 PASSED

org.apache.kafka.connect.transforms.CastTest > castWholeBigDecimalRecordValueWithSchemaString STARTED

org.apache.kafka.connect.transforms.CastTest > castWholeBigDecimalRecordValueWithSchemaString PASSED

org.apache.kafka.connect.transforms.CastTest > castWholeRecordValueWithSchemaBooleanFalse STARTED

org.apache.kafka.connect.transforms.CastTest > castWholeRecordValueWithSchemaBooleanFalse PASSED

org.apache.kafka.connect.transforms.CastTest > testConfigInvalidMap STARTED

org.apache.kafka.connect.transforms.CastTest > testConfigInvalidMap PASSED

org.apache.kafka.connect.transforms.CastTest > castWholeRecordValueWithSchemaBooleanTrue STARTED

org.apache.kafka.connect.transforms.CastTest > castWholeRecordValueWithSchemaBooleanTrue PASSED

org.apache.kafka.connect.transforms.CastTest > castWholeRecordDefaultValue STARTED

org.apache.kafka.connect.transforms.CastTest > castWholeRecordDefaultValue PASSED

org.apache.kafka.connect.transforms.CastTest > castWholeRecordValueWithSchemaInt8 STARTED

org.apache.kafka.connect.transforms.CastTest > castWholeRecordValueWithSchemaInt8 PASSED

org.apache.kafka.connect.transforms.CastTest > castWholeRecordKeyWithSchema STARTED

org.apache.kafka.connect.transforms.CastTest > castWholeRecordKeyWithSchema PASSED

org.apache.kafka.connect.transforms.CastTest > castWholeRecordValueSchemalessInt8 STARTED

org.apache.kafka.connect.transforms.CastTest > castWholeRecordValueSchemalessInt8 PASSED

org.apache.kafka.connect.transforms.CastTest > castWholeRecordValueSchemalessBooleanFalse STARTED

org.apache.kafka.connect.transforms.CastTest > castWholeRecordValueSchemalessBooleanFalse PASSED

org.apache.kafka.connect.transforms.CastTest > testConfigInvalidSchemaType STARTED

org.apache.kafka.connect.transforms.CastTest > testConfigInvalidSchemaType PASSED

org.apache.kafka.connect.transforms.CastTest > castWholeRecordValueSchemalessString STARTED

org.apache.kafka.connect.transforms.CastTest > castWholeRecordValueSchemalessString PASSED

org.apache.kafka.connect.transforms.CastTest > castFieldsWithSchema STARTED

org.apache.kafka.connect.transforms.CastTest > castFieldsWithSchema PASSED

> Task :connect:file:test

org.apache.kafka.connect.file.FileStreamSinkTaskTest > testPutFlush STARTED

org.apache.kafka.connect.file.FileStreamSinkTaskTest > testPutFlush PASSED

org.apache.kafka.connect.file.FileStreamSinkTaskTest > testStart STARTED

org.apache.kafka.connect.file.FileStreamSinkTaskTest > testStart PASSED

org.apache.kafka.connect.file.FileStreamSourceConnectorTest > testBlankTopic STARTED

org.apache.kafka.connect.file.FileStreamSourceConnectorTest > testBlankTopic PASSED

org.apache.kafka.connect.file.FileStreamSourceConnectorTest > testSourceTasks STARTED

org.apache.kafka.connect.file.FileStreamSourceConnectorTest > testSourceTasks PASSED

org.apache.kafka.connect.file.FileStreamSourceConnectorTest > testMissingTopic STARTED

org.apache.kafka.connect.file.FileStreamSourceConnectorTest > testMissingTopic PASSED

org.apache.kafka.connect.file.FileStreamSourceConnectorTest > testSourceTasksStdin STARTED

org.apache.kafka.connect.file.FileStreamSourceConnectorTest > testSourceTasksStdin PASSED

org.apache.kafka.connect.file.FileStreamSourceConnectorTest > testTaskClass STARTED

org.apache.kafka.connect.file.FileStreamSourceConnectorTest > testTaskClass PASSED

org.apache.kafka.connect.file.FileStreamSourceConnectorTest > testInvalidBatchSize STARTED

org.apache.kafka.connect.file.FileStreamSourceConnectorTest > testInvalidBatchSize PASSED

org.apache.kafka.connect.file.FileStreamSourceConnectorTest > testConnectorConfigValidation STARTED

org.apache.kafka.connect.file.FileStreamSourceConnectorTest > testConnectorConfigValidation PASSED

org.apache.kafka.connect.file.FileStreamSourceConnectorTest > testMultipleSourcesInvalid STARTED

org.apache.kafka.connect.file.FileStreamSourceConnectorTest > testMultipleSourcesInvalid PASSED

org.apache.kafka.connect.file.FileStreamSourceTaskTest > testNormalLifecycle STARTED

org.apache.kafka.connect.file.FileStreamSourceTaskTest > testNormalLifecycle PASSED

org.apache.kafka.connect.file.FileStreamSourceTaskTest > testBatchSize STARTED

org.apache.kafka.connect.file.FileStreamSourceTaskTest > testBatchSize PASSED

org.apache.kafka.connect.file.FileStreamSourceTaskTest > testMissingFile STARTED

org.apache.kafka.connect.file.FileStreamSourceTaskTest > testMissingFile PASSED

org.apache.kafka.connect.file.FileStreamSinkConnectorTest > testSinkTasks STARTED

org.apache.kafka.connect.file.FileStreamSinkConnectorTest > testSinkTasks PASSED

org.apache.kafka.connect.file.FileStreamSinkConnectorTest > testTaskClass STARTED

org.apache.kafka.connect.file.FileStreamSinkConnectorTest > testTaskClass PASSED

org.apache.kafka.connect.file.FileStreamSinkConnectorTest > testConnectorConfigValidation STARTED

org.apache.kafka.connect.file.FileStreamSinkConnectorTest > testConnectorConfigValidation PASSED

org.apache.kafka.connect.file.FileStreamSinkConnectorTest > testSinkTasksStdout STARTED

org.apache.kafka.connect.file.FileStreamSinkConnectorTest > testSinkTasksStdout PASSED

FAILURE: Build failed with an exception.

* What went wrong:
Execution failed for task ':connect:runtime:test'.
> There were failing tests. See the report at: file://<https://builds.apache.org/job/kafka-trunk-jdk11/ws/connect/runtime/build/reports/tests/test/index.html>

* Try:
Run with --stacktrace option to get the stack trace. Run with --info or --debug option to get more log output. Run with --scan to get full insights.

* Get more help at https://help.gradle.org

Deprecated Gradle features were used in this build, making it incompatible with Gradle 6.0.
Use '--warning-mode all' to show the individual deprecation warnings.
See https://docs.gradle.org/5.1/userguide/command_line_interface.html#sec:command_line_warnings

BUILD FAILED in 2h 24m 30s
166 actionable tasks: 165 executed, 1 up-to-date
Build step 'Execute shell' marked build as failure
Recording test results
Setting GRADLE_4_10_2_HOME=/home/jenkins/tools/gradle/4.10.2
Setting GRADLE_4_10_2_HOME=/home/jenkins/tools/gradle/4.10.2
Not sending mail to unregistered user noreply@github.com