You are viewing a plain text version of this content. The canonical link for it is here.
Posted to builds@cassandra.apache.org by Apache Jenkins Server <je...@builds.apache.org> on 2020/11/05 10:45:14 UTC
Build complete: Cassandra-trunk #118 [UNSTABLE]
d68c45eb2a4d6bcea0bac78c1797496988e23ee0
-------------------------------------------------------------------------------
Build Cassandra-trunk #118 Still Unstable
URL: https://ci-cassandra.apache.org/job/Cassandra-trunk/118/
-------------------------------------------------------------------------------
Changes:
[Marcus Eriksson] remove bad import from CASSANDRA-15789
-------------------------------------------------------------------------------
Failed Tests:
12 tests failed.
FAILED: dtest-offheap.rebuild_test.TestRebuild.test_resumable_rebuild
FAILED: org.apache.cassandra.distributed.upgrade.MixedModeReadRepairTest.mixedModeReadRepairCompactStorage
FAILED: org.apache.cassandra.transport.frame.checksum.ChecksummingTransformerTest.corruptionCausesFailure-cdc
FAILED: org.apache.cassandra.index.sasi.SASIIndexTest.testMultiExpressionQueriesWhereRowSplitBetweenSSTables-compression
FAILED: org.apache.cassandra.net.ConnectionTest.testMessageDeliveryOnReconnect-compression
FAILED: org.apache.cassandra.index.CustomIndexTest.testFailing2iFlush
FAILED: org.apache.cassandra.distributed.test.GossipTest.testPreventStoppingGossipDuringBootstrap
FAILED: org.apache.cassandra.distributed.test.GossipTest.testPreventStoppingGossipDuringBootstrap
FAILED: junit.framework.TestSuite.org.apache.cassandra.streaming.LongStreamingTest
FAILED: junit.framework.TestSuite.org.apache.cassandra.streaming.LongStreamingTest
FAILED: org.apache.cassandra.hints.HintsWriteThenReadTest.testWriteReadCycle
FAILED: org.apache.cassandra.hints.HintsWriteThenReadTest.testWriteReadCycle
-------------------------------------------------------------------------------
Cassandra CI Results
-------------------------------------------------------------------------------
Tests Failures Errors Skipped Success rate Time
35316 5 545 194 98.44% 172483.057
-------------------------------------------------------------------------------
Name Tests Errors Failures Skipped Time(s)
3826 539 0 0 129041.088
cqlshlib.python3.jdk8 166 0 0 0 0.000
org.apache.cassandra.audit 288 0 0 0 516.028
org.apache.cassandra.auth 216 0 0 0 96.650
org.apache.cassandra.auth.jmx 138 0 0 0 32.451
org.apache.cassandra.batchlog 72 0 0 0 161.063
org.apache.cassandra.cache 24 0 0 0 46.991
org.apache.cassandra.concurrent 58 0 0 0 1752.961
org.apache.cassandra.config 150 0 0 0 17.083
org.apache.cassandra.cql.jdbc 6 0 0 0 0.685
org.apache.cassandra.cql3 1438 0 0 54 3335.774
org.apache.cassandra.cql3.conditions 24 0 0 0 3.593
org.apache.cassandra.cql3.functions 186 0 0 0 80.656
org.apache.cassandra.cql3.restrictions 138 0 0 0 6.668
org.apache.cassandra.cql3.selection 60 0 0 0 73.400
org.apache.cassandra.cql3.statements 144 0 0 0 156.757
org.apache.cassandra.cql3.validation.entities 2244 0 0 6 2017.515
org.apache.cassandra.cql3.validation.miscellaneous 336 0 0 0 266.969
org.apache.cassandra.cql3.validation.operations 2388 0 0 0 1767.068
org.apache.cassandra.db 2352 0 0 4 1339.231
org.apache.cassandra.db.aggregation 36 0 0 0 5.759
org.apache.cassandra.db.columniterator 6 0 0 0 19.511
org.apache.cassandra.db.commitlog 2426 0 0 14 1701.702
org.apache.cassandra.db.compaction 1126 0 0 12 2895.306
org.apache.cassandra.db.composites 18 0 0 0 3.244
org.apache.cassandra.db.context 48 0 0 0 12.189
org.apache.cassandra.db.filter 48 0 0 0 8.717
org.apache.cassandra.db.lifecycle 408 0 0 0 166.870
org.apache.cassandra.db.marshal 846 0 0 0 251.644
org.apache.cassandra.db.monitoring 90 0 0 0 32.658
org.apache.cassandra.db.partition 60 0 0 0 381.868
org.apache.cassandra.db.partitions 48 0 0 0 3.853
org.apache.cassandra.db.repair 138 0 0 6 117.500
org.apache.cassandra.db.rows 324 0 0 0 256.106
org.apache.cassandra.db.streaming 108 0 0 0 170.920
org.apache.cassandra.db.transform 132 0 0 0 36.876
org.apache.cassandra.db.view 24 0 0 0 128.726
org.apache.cassandra.db.virtual 78 0 0 0 157.386
org.apache.cassandra.dht 624 0 0 0 312.409
org.apache.cassandra.dht.tokenallocator 18 0 0 2 439.629
org.apache.cassandra.diag 36 0 0 0 5.678
org.apache.cassandra.diag.store 36 0 0 0 0.694
org.apache.cassandra.distributed.test 1614 2 0 24 8460.508
org.apache.cassandra.distributed.test.ring 10 0 0 0 491.845
org.apache.cassandra.distributed.upgrade 12 1 0 0 446.703
org.apache.cassandra.fql 210 0 0 0 50.243
org.apache.cassandra.fqltool 50 0 0 0 9.218
org.apache.cassandra.gms 96 0 0 0 111.989
org.apache.cassandra.hints 224 0 2 0 1416.446
org.apache.cassandra.index 242 1 0 0 302.101
org.apache.cassandra.index.internal 162 0 0 0 129.853
org.apache.cassandra.index.sasi 246 0 1 0 261.862
org.apache.cassandra.index.sasi.analyzer 150 0 0 0 10.259
org.apache.cassandra.index.sasi.conf 84 0 0 0 7.783
org.apache.cassandra.index.sasi.disk 168 0 0 0 227.007
org.apache.cassandra.index.sasi.plan 48 0 0 0 30.867
org.apache.cassandra.index.sasi.utils 312 0 0 0 19.904
org.apache.cassandra.io 30 0 0 0 102.413
org.apache.cassandra.io.compress 276 0 0 0 136.462
org.apache.cassandra.io.sstable 764 0 0 12 1836.358
org.apache.cassandra.io.sstable.format 6 0 0 0 14.299
org.apache.cassandra.io.sstable.format.big 12 0 0 0 24.748
org.apache.cassandra.io.sstable.metadata 60 0 0 0 9.157
org.apache.cassandra.io.util 798 0 0 0 290.700
org.apache.cassandra.locator 422 0 0 0 722.784
org.apache.cassandra.metrics 414 0 0 6 448.972
org.apache.cassandra.net 938 0 1 0 1331.026
org.apache.cassandra.net.proxy 18 0 0 0 5.225
org.apache.cassandra.repair 210 0 0 6 278.971
org.apache.cassandra.repair.asymmetric 78 0 0 0 8.961
org.apache.cassandra.repair.consistent 414 0 0 6 118.185
org.apache.cassandra.repair.consistent.admin 30 0 0 0 19.117
org.apache.cassandra.repair.messages 108 0 0 0 15.977
org.apache.cassandra.schema 198 0 0 6 110.861
org.apache.cassandra.security 156 0 0 0 26.935
org.apache.cassandra.serializers 198 0 0 0 4.476
org.apache.cassandra.service 768 0 0 6 846.183
org.apache.cassandra.service.pager 42 0 0 0 7.889
org.apache.cassandra.service.reads 714 0 0 6 70.806
org.apache.cassandra.service.reads.repair 204 0 0 6 121.631
org.apache.cassandra.streaming 60 2 0 0 139.156
org.apache.cassandra.streaming.async 108 0 0 0 21.090
org.apache.cassandra.streaming.compression 36 0 0 0 8.045
org.apache.cassandra.streaming.messages 6 0 0 0 0.932
org.apache.cassandra.stress.generate 12 0 0 0 0.567
org.apache.cassandra.stress.settings 16 0 0 0 2.013
org.apache.cassandra.stress.util 10 0 0 0 0.235
org.apache.cassandra.tools 786 0 0 0 1349.956
org.apache.cassandra.tools.cassandrastress 6 0 0 0 81.567
org.apache.cassandra.tools.cqlsh 6 0 0 0 80.034
org.apache.cassandra.tools.nodetool 6 0 0 0 14.990
org.apache.cassandra.tools.nodetool.formatter 36 0 0 0 0.893
org.apache.cassandra.tools.nodetool.stats 84 0 0 0 189.605
org.apache.cassandra.tracing 36 0 0 0 6.981
org.apache.cassandra.transport 324 0 0 0 584.016
org.apache.cassandra.transport.frame.checksum 36 0 1 0 257.804
org.apache.cassandra.transport.messages 12 0 0 0 5.715
org.apache.cassandra.triggers 120 0 0 0 70.949
org.apache.cassandra.utils 1120 0 0 12 2569.062
org.apache.cassandra.utils.binlog 126 0 0 0 135.450
org.apache.cassandra.utils.btree 240 0 0 0 5.846
org.apache.cassandra.utils.concurrent 378 0 0 6 51.356
org.apache.cassandra.utils.memory 220 0 0 0 534.468
org.apache.cassandra.utils.obs 24 0 0 0 3.751
org.apache.cassandra.utils.streamhist 66 0 0 0 16.025
org.apache.cassandra.utils.vint 24 0 0 0 1.951
-------------------------------------------------------------------------------
-------------------------------------------------------------------------------
Packages
-------------------------------------------------------------------------------
Name Tests Errors Failures Skipped Time(s)
Cassandra dtests 5 0 0 440.818
Cassandra dtests 6 0 0 718.963
Cassandra dtests 5 0 0 763.899
Cassandra dtests 5 0 0 863.102
Cassandra dtests 4 0 0 329.190
Cassandra dtests 2 0 0 337.995
Cassandra dtests 3 0 0 915.298
Cassandra dtests 5 0 0 848.014
Cassandra dtests 22 3 0 426.178
Cassandra dtests 22 4 0 475.823
Cassandra dtests 21 4 0 517.341
Cassandra dtests 22 5 0 569.081
Cassandra dtests 22 5 0 450.339
Cassandra dtests 22 4 0 760.023
Cassandra dtests 20 2 0 710.608
Cassandra dtests 20 2 0 782.513
Cassandra dtests 20 2 0 607.098
Cassandra dtests 20 2 0 1092.282
Cassandra dtests 20 2 0 929.110
Cassandra dtests 23 4 0 484.349
Cassandra dtests 20 2 0 1096.951
Cassandra dtests 19 2 0 576.945
Cassandra dtests 18 2 0 628.491
Cassandra dtests 20 3 0 522.913
Cassandra dtests 17 1 0 444.453
Cassandra dtests 19 2 0 473.235
Cassandra dtests 19 2 0 551.848
Cassandra dtests 19 1 0 630.652
Cassandra dtests 20 2 0 714.583
Cassandra dtests 21 2 0 1178.876
Cassandra dtests 22 3 0 465.314
Cassandra dtests 20 3 0 763.156
Cassandra dtests 20 3 0 648.159
Cassandra dtests 19 3 0 585.512
Cassandra dtests 17 2 0 377.751
Cassandra dtests 19 3 0 545.710
Cassandra dtests 19 2 0 506.647
Cassandra dtests 20 3 0 482.728
Cassandra dtests 21 4 0 438.449
Cassandra dtests 20 4 0 361.945
Cassandra dtests 19 2 0 580.772
Cassandra dtests 22 3 0 554.347
Cassandra dtests 18 2 0 1093.804
Cassandra dtests 19 2 0 943.230
Cassandra dtests 22 4 0 1045.626
Cassandra dtests 20 3 0 761.317
Cassandra dtests 20 3 0 849.637
Cassandra dtests 20 3 0 1024.832
Cassandra dtests 20 3 0 877.637
Cassandra dtests 20 3 0 973.139
Cassandra dtests 20 2 0 698.025
Cassandra dtests 20 2 0 818.012
Cassandra dtests 22 4 0 426.592
Cassandra dtests 20 2 0 1005.407
Cassandra dtests 20 2 0 1593.876
Cassandra dtests 20 2 0 1151.981
Cassandra dtests 21 3 0 935.137
Cassandra dtests 22 4 0 685.522
Cassandra dtests 20 2 0 900.782
Cassandra dtests 20 2 0 568.597
Cassandra dtests 21 3 0 925.653
Cassandra dtests 21 4 0 846.470
Cassandra dtests 22 4 0 575.577
Cassandra dtests 23 5 0 470.550
Cassandra dtests 21 3 0 449.443
Cassandra dtests 21 3 0 889.176
Cassandra dtests 21 3 0 747.093
Cassandra dtests 23 5 0 509.826
Cassandra dtests 23 5 0 434.910
Cassandra dtests 21 3 0 551.509
Cassandra dtests 21 3 0 506.918
Cassandra dtests 22 4 0 549.910
Cassandra dtests 20 2 0 842.165
Cassandra dtests 18 2 0 513.733
Cassandra dtests 19 3 0 483.839
Cassandra dtests 20 4 0 287.046
Cassandra dtests 18 2 0 564.798
Cassandra dtests 20 3 0 383.585
Cassandra dtests 19 2 0 442.115
Cassandra dtests 21 4 0 465.696
Cassandra dtests 20 3 0 717.999
Cassandra dtests 20 4 0 595.219
Cassandra dtests 19 4 0 392.825
Cassandra dtests 21 3 0 848.124
Cassandra dtests 18 3 0 298.594
Cassandra dtests 20 3 0 523.907
Cassandra dtests 20 3 0 497.006
Cassandra dtests 22 5 0 296.326
Cassandra dtests 21 4 0 712.197
Cassandra dtests 21 4 0 422.009
Cassandra dtests 19 2 0 697.917
Cassandra dtests 20 3 0 558.181
Cassandra dtests 21 5 0 430.576
Cassandra dtests 18 2 0 547.390
Cassandra dtests 20 2 0 599.729
Cassandra dtests 18 2 0 534.837
Cassandra dtests 18 2 0 489.157
Cassandra dtests 18 2 0 577.812
Cassandra dtests 16 2 0 386.423
Cassandra dtests 17 2 0 536.766
Cassandra dtests 18 2 0 557.400
Cassandra dtests 17 2 0 764.193
Cassandra dtests 18 2 0 729.792
Cassandra dtests 19 2 0 787.258
Cassandra dtests 20 4 0 431.909
Cassandra dtests 20 2 0 883.472
Cassandra dtests 19 3 0 979.868
Cassandra dtests 18 2 0 897.952
Cassandra dtests 20 3 0 712.450
Cassandra dtests 20 3 0 728.562
Cassandra dtests 20 3 0 492.610
Cassandra dtests 19 2 0 496.912
Cassandra dtests 20 3 0 572.200
Cassandra dtests 20 3 0 1014.191
Cassandra dtests 20 3 0 615.485
Cassandra dtests 20 3 0 434.180
Cassandra dtests 20 2 0 838.624
Cassandra dtests 19 2 0 875.501
Cassandra dtests 19 2 0 788.774
Cassandra dtests 19 2 0 540.244
Cassandra dtests 19 2 0 703.330
Cassandra dtests 21 4 0 501.460
Cassandra dtests 19 2 0 663.131
Cassandra dtests 20 3 0 587.358
Cassandra dtests 21 4 0 587.706
Cassandra dtests 20 3 0 648.582
Cassandra dtests 20 3 0 572.763
Cassandra dtests 19 2 0 571.794
Cassandra dtests 21 4 0 859.004
Cassandra dtests 20 3 0 971.118
Cassandra dtests 21 4 0 949.954
Cassandra dtests 21 4 0 482.262
Cassandra dtests 18 1 0 830.078
Cassandra dtests 18 2 0 746.598
Cassandra dtests 16 1 0 604.806
Cassandra dtests 19 3 0 404.542
Cassandra dtests 20 2 0 862.208
Cassandra dtests 18 2 0 592.865
Cassandra dtests 18 2 0 564.117
Cassandra dtests 20 4 0 276.635
Cassandra dtests 19 3 0 562.634
Cassandra dtests 19 2 0 486.585
Cassandra dtests 19 2 0 355.853
Cassandra dtests 21 4 0 461.274
Cassandra dtests 20 3 0 719.554
Cassandra dtests 20 4 0 505.300
Cassandra dtests 17 2 0 462.071
Cassandra dtests 21 3 0 905.012
Cassandra dtests 19 4 0 175.570
Cassandra dtests 20 3 0 615.552
Cassandra dtests 20 3 0 499.262
Cassandra dtests 21 4 0 324.998
Cassandra dtests 25 5 0 596.485
Cassandra dtests 21 4 0 355.987
Cassandra dtests 20 3 0 547.259
Cassandra dtests 20 3 0 645.134
Cassandra dtests 20 4 0 492.878
Cassandra dtests 19 3 0 462.550
Cassandra dtests 19 1 0 917.106
Cassandra dtests 18 2 0 506.361
Cassandra dtests 18 2 0 533.062
Cassandra dtests 18 2 0 574.712
Cassandra dtests 17 2 0 578.473
Cassandra dtests 16 2 0 323.259
Cassandra dtests 18 2 0 826.738
Cassandra dtests 18 2 0 821.617
Cassandra dtests 17 2 0 596.947
Cassandra dtests 19 2 0 741.677
Cassandra dtests 20 4 0 498.652
Cassandra dtests 20 2 0 611.671
Cassandra dtests 19 3 0 913.964
Cassandra dtests 19 3 0 740.447
Cassandra dtests 19 2 0 794.685
Cassandra dtests 20 3 0 684.405
Cassandra dtests 19 2 0 532.518
Cassandra dtests 20 3 0 429.678
Cassandra dtests 19 2 0 572.126
Cassandra dtests 20 3 0 991.813
Cassandra dtests 20 3 0 668.013
Cassandra dtests 21 4 0 389.408
Cassandra dtests 20 2 0 967.373
Cassandra dtests 19 2 0 561.350
Cassandra dtests 19 2 0 756.381
Cassandra dtests 19 2 0 751.706
Cassandra dtests 19 2 0 697.735
Cassandra dtests 21 4 0 515.773
Cassandra dtests 19 2 0 652.805
Cassandra dtests 19 2 0 649.942
Cassandra dtests 21 4 0 679.754
Cassandra dtests 21 4 0 603.883
Cassandra dtests 20 3 0 503.286
Cassandra dtests 18 1 0 776.974
Cassandra dtests 21 4 0 490.902
Cassandra dtests 20 3 0 765.406
Cassandra dtests 21 4 0 1095.991
Cassandra dtests 21 4 0 1043.338
Cassandra dtests 19 2 0 599.588
Cassandra dtests 20 3 0 658.199
Cassandra dtests 16 1 0 625.202
Cassandra dtests 19 3 0 494.702
-------------------------------------------------------------------------------
cqlshlib.python3.jdk8
Name Tests Errors Failures Skipped Time(s)
no_cython 83 0 0 NaN
cython 83 0 0 NaN
-------------------------------------------------------------------------------
org.apache.cassandra.audit
Name Tests Errors Failures Skipped Time(s)
AuditLogFilterTest-cdc 10 0 0 0 0.243
AuditLoggerAuthTest-cdc 9 0 0 0 53.212
AuditLoggerTest-cdc 28 0 0 0 21.894
BinAuditLoggerTest-cdc 1 0 0 0 12.929
AuditLogFilterTest-cdc 10 0 0 0 0.327
AuditLoggerAuthTest-cdc 9 0 0 0 52.086
AuditLoggerTest-cdc 28 0 0 0 20.182
BinAuditLoggerTest-cdc 1 0 0 0 11.907
AuditLogFilterTest-compression 10 0 0 0 0.248
AuditLoggerAuthTest-compression 9 0 0 0 52.651
AuditLoggerTest-compression 28 0 0 0 21.079
BinAuditLoggerTest-compression 1 0 0 0 12.668
AuditLogFilterTest-compression 10 0 0 0 0.315
AuditLoggerAuthTest-compression 9 0 0 0 52.275
AuditLoggerTest-compression 28 0 0 0 19.585
BinAuditLoggerTest-compression 1 0 0 0 11.493
AuditLogFilterTest 10 0 0 0 0.236
AuditLoggerAuthTest 9 0 0 0 53.041
AuditLoggerTest 28 0 0 0 21.753
BinAuditLoggerTest 1 0 0 0 12.699
AuditLogFilterTest 10 0 0 0 0.325
AuditLoggerAuthTest 9 0 0 0 52.406
AuditLoggerTest 28 0 0 0 20.419
BinAuditLoggerTest 1 0 0 0 12.055
-------------------------------------------------------------------------------
org.apache.cassandra.auth
Name Tests Errors Failures Skipped Time(s)
AuthCacheTest-cdc 14 0 0 0 0.521
CassandraNetworkAuthorizerTest-cdc 6 0 0 0 4.098
CassandraRoleManagerTest-cdc 1 0 0 0 3.378
PasswordAuthenticatorTest-cdc 7 0 0 0 5.543
RoleOptionsTest-cdc 4 0 0 0 0.403
RolesTest-cdc 4 0 0 0 3.302
AuthCacheTest-cdc 14 0 0 0 0.597
CassandraNetworkAuthorizerTest-cdc 6 0 0 0 3.610
CassandraRoleManagerTest-cdc 1 0 0 0 3.058
PasswordAuthenticatorTest-cdc 7 0 0 0 4.753
RoleOptionsTest-cdc 4 0 0 0 0.458
RolesTest-cdc 4 0 0 0 3.017
AuthCacheTest-compression 14 0 0 0 0.493
CassandraNetworkAuthorizerTest- 6 0 0 0 4.034
compression
CassandraRoleManagerTest-compression 1 0 0 0 3.331
PasswordAuthenticatorTest-compression 7 0 0 0 5.371
RoleOptionsTest-compression 4 0 0 0 0.391
RolesTest-compression 4 0 0 0 3.358
AuthCacheTest-compression 14 0 0 0 0.558
CassandraNetworkAuthorizerTest- 6 0 0 0 3.389
compression
CassandraRoleManagerTest-compression 1 0 0 0 2.790
PasswordAuthenticatorTest-compression 7 0 0 0 4.470
RoleOptionsTest-compression 4 0 0 0 0.428
RolesTest-compression 4 0 0 0 2.835
AuthCacheTest 14 0 0 0 0.528
CassandraNetworkAuthorizerTest 6 0 0 0 4.054
CassandraRoleManagerTest 1 0 0 0 3.457
PasswordAuthenticatorTest 7 0 0 0 5.568
RoleOptionsTest 4 0 0 0 0.405
RolesTest 4 0 0 0 3.359
AuthCacheTest 14 0 0 0 0.647
CassandraNetworkAuthorizerTest 6 0 0 0 3.545
CassandraRoleManagerTest 1 0 0 0 2.853
PasswordAuthenticatorTest 7 0 0 0 4.759
RoleOptionsTest 4 0 0 0 0.468
RolesTest 4 0 0 0 2.821
-------------------------------------------------------------------------------
org.apache.cassandra.auth.jmx
Name Tests Errors Failures Skipped Time(s)
AuthorizationProxyTest-cdc 20 0 0 0 1.056
JMXAuthTest-cdc 3 0 0 0 4.592
AuthorizationProxyTest-cdc 20 0 0 0 1.211
JMXAuthTest-cdc 3 0 0 0 4.116
AuthorizationProxyTest-compression 20 0 0 0 1.022
JMXAuthTest-compression 3 0 0 0 4.394
AuthorizationProxyTest-compression 20 0 0 0 1.128
JMXAuthTest-compression 3 0 0 0 3.985
AuthorizationProxyTest 20 0 0 0 1.070
JMXAuthTest 3 0 0 0 4.702
AuthorizationProxyTest 20 0 0 0 1.175
JMXAuthTest 3 0 0 0 4.000
-------------------------------------------------------------------------------
org.apache.cassandra.batchlog
Name Tests Errors Failures Skipped Time(s)
BatchlogEndpointFilterTest-cdc 5 0 0 0 0.459
BatchlogManagerTest-cdc 6 0 0 0 23.597
BatchlogTest-cdc 1 0 0 0 3.344
BatchlogEndpointFilterTest-cdc 5 0 0 0 0.549
BatchlogManagerTest-cdc 6 0 0 0 23.146
BatchlogTest-cdc 1 0 0 0 2.817
BatchlogEndpointFilterTest-compression 5 0 0 0 0.430
BatchlogManagerTest-compression 6 0 0 0 23.512
BatchlogTest-compression 1 0 0 0 3.156
BatchlogEndpointFilterTest-compression 5 0 0 0 0.513
BatchlogManagerTest-compression 6 0 0 0 23.067
BatchlogTest-compression 1 0 0 0 2.687
BatchlogEndpointFilterTest 5 0 0 0 0.448
BatchlogManagerTest 6 0 0 0 23.693
BatchlogTest 1 0 0 0 3.221
BatchlogEndpointFilterTest 5 0 0 0 0.517
BatchlogManagerTest 6 0 0 0 23.171
BatchlogTest 1 0 0 0 2.736
-------------------------------------------------------------------------------
org.apache.cassandra.cache
Name Tests Errors Failures Skipped Time(s)
AutoSavingCacheTest-cdc 2 0 0 0 3.506
CacheProviderTest-cdc 2 0 0 0 4.900
AutoSavingCacheTest-cdc 2 0 0 0 3.048
CacheProviderTest-cdc 2 0 0 0 4.757
AutoSavingCacheTest-compression 2 0 0 0 3.392
CacheProviderTest-compression 2 0 0 0 4.621
AutoSavingCacheTest-compression 2 0 0 0 2.955
CacheProviderTest-compression 2 0 0 0 3.940
AutoSavingCacheTest 2 0 0 0 3.526
CacheProviderTest 2 0 0 0 4.940
AutoSavingCacheTest 2 0 0 0 2.935
CacheProviderTest 2 0 0 0 4.471
-------------------------------------------------------------------------------
org.apache.cassandra.concurrent
Name Tests Errors Failures Skipped Time(s)
LongOpOrderTest 1 0 0 0 330.503
LongSharedExecutorPoolTest 1 0 0 0 480.449
LongOpOrderTest 1 0 0 0 330.761
LongSharedExecutorPoolTest 1 0 0 0 480.537
DebuggableScheduledThreadPoolExecutorTest- 1 0 0 0 15.306
cdc
DebuggableThreadPoolExecutorTest-cdc 4 0 0 0 1.436
SEPExecutorTest-cdc 2 0 0 0 5.169
WaitQueueTest-cdc 2 0 0 0 0.267
DebuggableScheduledThreadPoolExecutorTest- 1 0 0 0 14.564
cdc
DebuggableThreadPoolExecutorTest-cdc 4 0 0 0 1.660
SEPExecutorTest-cdc 2 0 0 0 5.672
WaitQueueTest-cdc 2 0 0 0 0.362
DebuggableScheduledThreadPoolExecutorTest- 1 0 0 0 15.140
compression
DebuggableThreadPoolExecutorTest- 4 0 0 0 1.370
compression
SEPExecutorTest-compression 2 0 0 0 5.041
WaitQueueTest-compression 2 0 0 0 0.233
DebuggableScheduledThreadPoolExecutorTest- 1 0 0 0 14.352
compression
DebuggableThreadPoolExecutorTest- 4 0 0 0 1.518
compression
SEPExecutorTest-compression 2 0 0 0 4.293
WaitQueueTest-compression 2 0 0 0 0.307
DebuggableScheduledThreadPoolExecutorTest 1 0 0 0 15.134
DebuggableThreadPoolExecutorTest 4 0 0 0 1.432
SEPExecutorTest 2 0 0 0 5.278
WaitQueueTest 2 0 0 0 0.248
DebuggableScheduledThreadPoolExecutorTest 1 0 0 0 14.515
DebuggableThreadPoolExecutorTest 4 0 0 0 1.621
SEPExecutorTest 2 0 0 0 5.442
WaitQueueTest 2 0 0 0 0.351
-------------------------------------------------------------------------------
org.apache.cassandra.config
Name Tests Errors Failures Skipped Time(s)
CassandraRelevantPropertiesTest-cdc 8 0 0 0 0.141
DatabaseDescriptorRefTest-cdc 1 0 0 0 1.370
DatabaseDescriptorTest-cdc 15 0 0 0 0.936
YamlConfigurationLoaderTest-cdc 1 0 0 0 0.328
CassandraRelevantPropertiesTest-cdc 8 0 0 0 0.271
DatabaseDescriptorRefTest-cdc 1 0 0 0 1.300
DatabaseDescriptorTest-cdc 15 0 0 0 1.075
YamlConfigurationLoaderTest-cdc 1 0 0 0 0.459
CassandraRelevantPropertiesTest- 8 0 0 0 0.137
compression
DatabaseDescriptorRefTest-compression 1 0 0 0 1.160
DatabaseDescriptorTest-compression 15 0 0 0 0.902
YamlConfigurationLoaderTest-compression 1 0 0 0 0.323
CassandraRelevantPropertiesTest- 8 0 0 0 0.204
compression
DatabaseDescriptorRefTest-compression 1 0 0 0 1.283
DatabaseDescriptorTest-compression 15 0 0 0 1.021
YamlConfigurationLoaderTest-compression 1 0 0 0 0.378
CassandraRelevantPropertiesTest 8 0 0 0 0.152
DatabaseDescriptorRefTest 1 0 0 0 1.316
DatabaseDescriptorTest 15 0 0 0 0.936
YamlConfigurationLoaderTest 1 0 0 0 0.337
CassandraRelevantPropertiesTest 8 0 0 0 0.217
DatabaseDescriptorRefTest 1 0 0 0 1.307
DatabaseDescriptorTest 15 0 0 0 1.078
YamlConfigurationLoaderTest 1 0 0 0 0.452
-------------------------------------------------------------------------------
org.apache.cassandra.cql.jdbc
Name Tests Errors Failures Skipped Time(s)
JdbcDecimalTest-cdc 1 0 0 0 0.071
JdbcDecimalTest-cdc 1 0 0 0 0.169
JdbcDecimalTest-compression 1 0 0 0 0.069
JdbcDecimalTest-compression 1 0 0 0 0.144
JdbcDecimalTest 1 0 0 0 0.070
JdbcDecimalTest 1 0 0 0 0.162
-------------------------------------------------------------------------------
org.apache.cassandra.cql3
Name Tests Errors Failures Skipped Time(s)
CorruptionTest 1 0 0 0 126.184
ManyRowsTest 2 0 0 0 7.102
ViewLongTest 5 0 0 0 100.806
CorruptionTest 1 0 0 0 125.524
ManyRowsTest 2 0 0 0 6.317
ViewLongTest 5 0 0 0 101.621
CDCStatementTest-cdc 3 0 0 0 4.466
CQL3TypeLiteralTest-cdc 6 0 0 0 0.915
ColumnIdentifierTest-cdc 4 0 0 0 0.409
CqlParserTest-cdc 3 0 0 0 0.428
CustomNowInSecondsTest-cdc 4 0 0 0 15.242
DeleteTest-cdc 1 0 0 0 16.116
DistinctQueryPagingTest-cdc 5 0 0 0 14.949
DurationTest-cdc 8 0 0 0 0.114
EmptyValuesTest-cdc 14 0 0 5 37.250
ErrorCollectorTest-cdc 6 0 0 0 0.071
GcCompactionTest-cdc 8 0 0 0 10.145
IndexQueryPagingTest-cdc 5 0 0 0 15.083
KeyCacheCqlTest-cdc 10 0 0 0 20.319
ListsTest-cdc 6 0 0 0 5.142
NonNativeTimestampTest-cdc 1 0 0 0 3.549
OutOfSpaceTest-cdc 3 0 0 0 4.417
PagingQueryTest-cdc 1 0 0 0 21.218
PagingTest-cdc 1 0 0 0 10.424
PreparedStatementsTest-cdc 10 0 0 0 20.615
PstmtPersistenceTest-cdc 2 0 0 0 14.133
QueryEventsTest-cdc 4 0 0 0 13.981
QueryWithIndexedSSTableTest-cdc 1 0 0 0 4.266
ReservedKeywordsTest-cdc 1 0 0 0 0.865
SerializationMirrorTest-cdc 1 0 0 0 3.630
SimpleQueryTest-cdc 18 0 0 0 9.196
TombstonesWithIndexedSSTableTest-cdc 2 0 0 0 5.427
TraceCqlTest-cdc 1 0 0 0 12.631
UDHelperTest-cdc 3 0 0 0 0.362
ViewComplexTest-cdc 32 0 0 1 100.627
ViewFilteringTest-cdc 25 0 0 3 41.954
ViewSchemaTest-cdc 7 0 0 0 23.094
ViewTest-cdc 41 0 0 0 56.801
CDCStatementTest-cdc 3 0 0 0 3.819
CQL3TypeLiteralTest-cdc 6 0 0 0 1.129
ColumnIdentifierTest-cdc 4 0 0 0 0.509
CqlParserTest-cdc 3 0 0 0 0.432
CustomNowInSecondsTest-cdc 4 0 0 0 13.897
DeleteTest-cdc 1 0 0 0 15.541
DistinctQueryPagingTest-cdc 5 0 0 0 13.997
DurationTest-cdc 8 0 0 0 0.198
EmptyValuesTest-cdc 14 0 0 5 38.065
ErrorCollectorTest-cdc 6 0 0 0 0.183
GcCompactionTest-cdc 8 0 0 0 9.363
IndexQueryPagingTest-cdc 5 0 0 0 13.958
KeyCacheCqlTest-cdc 10 0 0 0 19.897
ListsTest-cdc 6 0 0 0 4.451
NonNativeTimestampTest-cdc 1 0 0 0 3.010
OutOfSpaceTest-cdc 3 0 0 0 3.873
PagingQueryTest-cdc 1 0 0 0 20.723
PagingTest-cdc 1 0 0 0 9.519
PreparedStatementsTest-cdc 10 0 0 0 19.347
PstmtPersistenceTest-cdc 2 0 0 0 13.275
QueryEventsTest-cdc 4 0 0 0 13.137
QueryWithIndexedSSTableTest-cdc 1 0 0 0 3.720
ReservedKeywordsTest-cdc 1 0 0 0 0.881
SerializationMirrorTest-cdc 1 0 0 0 3.048
SimpleQueryTest-cdc 18 0 0 0 7.911
TombstonesWithIndexedSSTableTest-cdc 2 0 0 0 4.897
TraceCqlTest-cdc 1 0 0 0 12.107
UDHelperTest-cdc 3 0 0 0 0.438
ViewComplexTest-cdc 32 0 0 1 97.104
ViewFilteringTest-cdc 25 0 0 3 39.183
ViewSchemaTest-cdc 7 0 0 0 21.205
ViewTest-cdc 41 0 0 0 56.345
CDCStatementTest-compression 3 0 0 0 4.195
CQL3TypeLiteralTest-compression 6 0 0 0 0.905
ColumnIdentifierTest-compression 4 0 0 0 0.400
CqlParserTest-compression 3 0 0 0 0.420
CustomNowInSecondsTest-compression 4 0 0 0 14.645
DeleteTest-compression 1 0 0 0 16.049
DistinctQueryPagingTest-compression 5 0 0 0 14.715
DurationTest-compression 8 0 0 0 0.094
EmptyValuesTest-compression 14 0 0 5 36.344
ErrorCollectorTest-compression 6 0 0 0 0.069
GcCompactionTest-compression 8 0 0 0 10.005
IndexQueryPagingTest-compression 5 0 0 0 14.654
KeyCacheCqlTest-compression 10 0 0 0 20.559
ListsTest-compression 6 0 0 0 4.944
NonNativeTimestampTest-compression 1 0 0 0 3.400
OutOfSpaceTest-compression 3 0 0 0 4.308
PagingQueryTest-compression 1 0 0 0 21.659
PagingTest-compression 1 0 0 0 10.229
PreparedStatementsTest-compression 10 0 0 0 20.316
PstmtPersistenceTest-compression 2 0 0 0 14.026
QueryEventsTest-compression 4 0 0 0 13.919
QueryWithIndexedSSTableTest-compression 1 0 0 0 4.092
ReservedKeywordsTest-compression 1 0 0 0 0.883
SerializationMirrorTest-compression 1 0 0 0 3.429
SimpleQueryTest-compression 18 0 0 0 8.921
TombstonesWithIndexedSSTableTest- 2 0 0 0 5.355
compression
TraceCqlTest-compression 1 0 0 0 12.510
UDHelperTest-compression 3 0 0 0 0.356
ViewComplexTest-compression 32 0 0 1 99.979
ViewFilteringTest-compression 25 0 0 3 43.188
ViewSchemaTest-compression 7 0 0 0 22.742
ViewTest-compression 41 0 0 0 62.791
CDCStatementTest-compression 3 0 0 0 3.689
CQL3TypeLiteralTest-compression 6 0 0 0 0.904
ColumnIdentifierTest-compression 4 0 0 0 0.459
CqlParserTest-compression 3 0 0 0 0.397
CustomNowInSecondsTest-compression 4 0 0 0 13.472
DeleteTest-compression 1 0 0 0 14.130
DistinctQueryPagingTest-compression 5 0 0 0 13.445
DurationTest-compression 8 0 0 0 0.171
EmptyValuesTest-compression 14 0 0 5 35.732
ErrorCollectorTest-compression 6 0 0 0 0.143
GcCompactionTest-compression 8 0 0 0 9.000
IndexQueryPagingTest-compression 5 0 0 0 13.445
KeyCacheCqlTest-compression 10 0 0 0 18.644
ListsTest-compression 6 0 0 0 4.149
NonNativeTimestampTest-compression 1 0 0 0 2.858
OutOfSpaceTest-compression 3 0 0 0 3.664
PagingQueryTest-compression 1 0 0 0 19.155
PagingTest-compression 1 0 0 0 9.168
PreparedStatementsTest-compression 10 0 0 0 19.472
PstmtPersistenceTest-compression 2 0 0 0 12.818
QueryEventsTest-compression 4 0 0 0 13.655
QueryWithIndexedSSTableTest-compression 1 0 0 0 3.382
ReservedKeywordsTest-compression 1 0 0 0 0.866
SerializationMirrorTest-compression 1 0 0 0 2.913
SimpleQueryTest-compression 18 0 0 0 7.880
TombstonesWithIndexedSSTableTest- 2 0 0 0 4.438
compression
TraceCqlTest-compression 1 0 0 0 11.545
UDHelperTest-compression 3 0 0 0 0.371
ViewComplexTest-compression 32 0 0 1 100.065
ViewFilteringTest-compression 25 0 0 3 40.925
ViewSchemaTest-compression 7 0 0 0 20.741
ViewTest-compression 41 0 0 0 55.138
CDCStatementTest 3 0 0 0 5.392
CQL3TypeLiteralTest 6 0 0 0 0.959
ColumnIdentifierTest 4 0 0 0 0.406
CqlParserTest 3 0 0 0 0.412
CustomNowInSecondsTest 4 0 0 0 14.943
DeleteTest 1 0 0 0 16.329
DistinctQueryPagingTest 5 0 0 0 15.019
DurationTest 8 0 0 0 0.095
EmptyValuesTest 14 0 0 5 37.428
ErrorCollectorTest 6 0 0 0 0.076
GcCompactionTest 8 0 0 0 10.151
IndexQueryPagingTest 5 0 0 0 15.110
KeyCacheCqlTest 10 0 0 0 21.360
ListsTest 6 0 0 0 5.017
NonNativeTimestampTest 1 0 0 0 3.496
OutOfSpaceTest 3 0 0 0 4.401
PagingQueryTest 1 0 0 0 22.057
PagingTest 1 0 0 0 10.519
PreparedStatementsTest 10 0 0 0 20.671
PstmtPersistenceTest 2 0 0 0 14.177
QueryEventsTest 4 0 0 0 13.920
QueryWithIndexedSSTableTest 1 0 0 0 4.317
ReservedKeywordsTest 1 0 0 0 0.858
SerializationMirrorTest 1 0 0 0 3.615
SimpleQueryTest 18 0 0 0 9.458
TombstonesWithIndexedSSTableTest 2 0 0 0 5.543
TraceCqlTest 1 0 0 0 12.703
UDHelperTest 3 0 0 0 0.339
ViewComplexTest 32 0 0 1 101.099
ViewFilteringTest 25 0 0 3 43.074
ViewSchemaTest 7 0 0 0 22.853
ViewTest 41 0 0 0 61.942
CDCStatementTest 3 0 0 0 3.837
CQL3TypeLiteralTest 6 0 0 0 1.013
ColumnIdentifierTest 4 0 0 0 0.534
CqlParserTest 3 0 0 0 0.431
CustomNowInSecondsTest 4 0 0 0 13.818
DeleteTest 1 0 0 0 15.843
DistinctQueryPagingTest 5 0 0 0 13.929
DurationTest 8 0 0 0 0.177
EmptyValuesTest 14 0 0 5 37.374
ErrorCollectorTest 6 0 0 0 0.159
GcCompactionTest 8 0 0 0 9.318
IndexQueryPagingTest 5 0 0 0 14.151
KeyCacheCqlTest 10 0 0 0 19.847
ListsTest 6 0 0 0 4.478
NonNativeTimestampTest 1 0 0 0 2.995
OutOfSpaceTest 3 0 0 0 3.764
PagingQueryTest 1 0 0 0 21.423
PagingTest 1 0 0 0 9.594
PreparedStatementsTest 10 0 0 0 19.466
PstmtPersistenceTest 2 0 0 0 13.331
QueryEventsTest 4 0 0 0 13.094
QueryWithIndexedSSTableTest 1 0 0 0 3.846
ReservedKeywordsTest 1 0 0 0 0.921
SerializationMirrorTest 1 0 0 0 3.225
SimpleQueryTest 18 0 0 0 8.330
TombstonesWithIndexedSSTableTest 2 0 0 0 5.031
TraceCqlTest 1 0 0 0 11.936
UDHelperTest 3 0 0 0 0.451
ViewComplexTest 32 0 0 1 98.292
ViewFilteringTest 25 0 0 3 37.096
ViewSchemaTest 7 0 0 0 21.497
ViewTest 41 0 0 0 61.344
-------------------------------------------------------------------------------
org.apache.cassandra.cql3.conditions
Name Tests Errors Failures Skipped Time(s)
ColumnConditionTest-cdc 4 0 0 0 0.576
ColumnConditionTest-cdc 4 0 0 0 0.668
ColumnConditionTest-compression 4 0 0 0 0.566
ColumnConditionTest-compression 4 0 0 0 0.587
ColumnConditionTest 4 0 0 0 0.587
ColumnConditionTest 4 0 0 0 0.609
-------------------------------------------------------------------------------
org.apache.cassandra.cql3.functions
Name Tests Errors Failures Skipped Time(s)
CastFctsTest-cdc 7 0 0 0 6.653
OperationFctsTest-cdc 11 0 0 0 7.779
TimeFctsTest-cdc 13 0 0 0 0.538
CastFctsTest-cdc 7 0 0 0 5.529
OperationFctsTest-cdc 11 0 0 0 6.586
TimeFctsTest-cdc 13 0 0 0 0.662
CastFctsTest-compression 7 0 0 0 6.247
OperationFctsTest-compression 11 0 0 0 7.164
TimeFctsTest-compression 13 0 0 0 0.521
CastFctsTest-compression 7 0 0 0 5.162
OperationFctsTest-compression 11 0 0 0 6.120
TimeFctsTest-compression 13 0 0 0 0.540
CastFctsTest 7 0 0 0 6.250
OperationFctsTest 11 0 0 0 7.497
TimeFctsTest 13 0 0 0 0.544
CastFctsTest 7 0 0 0 5.472
OperationFctsTest 11 0 0 0 6.789
TimeFctsTest 13 0 0 0 0.603
-------------------------------------------------------------------------------
org.apache.cassandra.cql3.restrictions
Name Tests Errors Failures Skipped Time(s)
ClusteringColumnRestrictionsTest-cdc 23 0 0 0 1.009
ClusteringColumnRestrictionsTest-cdc 23 0 0 0 1.214
ClusteringColumnRestrictionsTest- 23 0 0 0 0.980
compression
ClusteringColumnRestrictionsTest- 23 0 0 0 1.093
compression
ClusteringColumnRestrictionsTest 23 0 0 0 1.068
ClusteringColumnRestrictionsTest 23 0 0 0 1.304
-------------------------------------------------------------------------------
org.apache.cassandra.cql3.selection
Name Tests Errors Failures Skipped Time(s)
SelectionColumnMappingTest-cdc 2 0 0 0 5.561
TermSelectionTest-cdc 8 0 0 0 8.041
SelectionColumnMappingTest-cdc 2 0 0 0 4.775
TermSelectionTest-cdc 8 0 0 0 6.677
SelectionColumnMappingTest-compression 2 0 0 0 5.400
TermSelectionTest-compression 8 0 0 0 7.493
SelectionColumnMappingTest-compression 2 0 0 0 4.502
TermSelectionTest-compression 8 0 0 0 6.164
SelectionColumnMappingTest 2 0 0 0 5.597
TermSelectionTest 8 0 0 0 7.730
SelectionColumnMappingTest 2 0 0 0 4.916
TermSelectionTest 8 0 0 0 6.544
-------------------------------------------------------------------------------
org.apache.cassandra.cql3.statements
Name Tests Errors Failures Skipped Time(s)
AlterRoleStatementTest-cdc 4 0 0 0 0.916
CreateRoleStatementTest-cdc 4 0 0 0 4.233
CreateUserStatementTest-cdc 1 0 0 0 0.891
DescribeStatementTest-cdc 12 0 0 0 18.633
PropertyDefinitionsTest-cdc 2 0 0 0 0.223
SelectStatementTest-cdc 1 0 0 0 3.377
AlterRoleStatementTest-cdc 4 0 0 0 0.858
CreateRoleStatementTest-cdc 4 0 0 0 3.408
CreateUserStatementTest-cdc 1 0 0 0 0.868
DescribeStatementTest-cdc 12 0 0 0 16.935
PropertyDefinitionsTest-cdc 2 0 0 0 0.323
SelectStatementTest-cdc 1 0 0 0 2.835
AlterRoleStatementTest-compression 4 0 0 0 0.861
CreateRoleStatementTest-compression 4 0 0 0 3.846
CreateUserStatementTest-compression 1 0 0 0 0.839
DescribeStatementTest-compression 12 0 0 0 17.970
PropertyDefinitionsTest-compression 2 0 0 0 0.213
SelectStatementTest-compression 1 0 0 0 3.256
AlterRoleStatementTest-compression 4 0 0 0 0.824
CreateRoleStatementTest-compression 4 0 0 0 3.227
CreateUserStatementTest-compression 1 0 0 0 0.827
DescribeStatementTest-compression 12 0 0 0 16.065
PropertyDefinitionsTest-compression 2 0 0 0 0.285
SelectStatementTest-compression 1 0 0 0 2.750
AlterRoleStatementTest 4 0 0 0 0.871
CreateRoleStatementTest 4 0 0 0 3.879
CreateUserStatementTest 1 0 0 0 0.847
DescribeStatementTest 12 0 0 0 18.233
PropertyDefinitionsTest 2 0 0 0 0.231
SelectStatementTest 1 0 0 0 3.321
AlterRoleStatementTest 4 0 0 0 0.867
CreateRoleStatementTest 4 0 0 0 3.369
CreateUserStatementTest 1 0 0 0 0.865
DescribeStatementTest 12 0 0 0 16.736
PropertyDefinitionsTest 2 0 0 0 0.305
SelectStatementTest 1 0 0 0 2.770
-------------------------------------------------------------------------------
org.apache.cassandra.cql3.validation.entities
Name Tests Errors Failures Skipped Time(s)
CollectionsTest-cdc 50 0 0 0 29.922
CountersTest-cdc 7 0 0 0 5.939
DateTypeTest-cdc 1 0 0 0 3.591
FrozenCollectionsTest-cdc 34 0 0 0 14.103
JsonTest-cdc 22 0 0 0 24.095
SecondaryIndexOnMapEntriesTest-cdc 11 0 0 0 8.094
SecondaryIndexOnStaticColumnTest-cdc 6 0 0 0 7.486
SecondaryIndexTest-cdc 49 0 0 0 32.978
StaticColumnsTest-cdc 7 0 0 0 7.904
TimestampTest-cdc 8 0 0 0 18.324
TimeuuidTest-cdc 2 0 0 0 4.120
TupleTypeTest-cdc 15 0 0 0 31.159
TypeTest-cdc 4 0 0 0 4.687
UFAuthTest-cdc 26 0 0 0 13.833
UFIdentificationTest-cdc 14 0 0 1 15.008
UFJavaTest-cdc 20 0 0 0 22.274
UFPureScriptTupleCollectionTest-cdc 1 0 0 0 13.387
UFScriptTest-cdc 12 0 0 0 18.493
UFSecurityTest-cdc 2 0 0 0 6.684
UFTest-cdc 24 0 0 0 23.149
UFTypesTest-cdc 7 0 0 0 19.406
UFVerifierTest-cdc 20 0 0 0 6.923
UserTypesTest-cdc 27 0 0 0 16.063
VirtualTableTest-cdc 5 0 0 0 13.829
CollectionsTest-cdc 50 0 0 0 26.525
CountersTest-cdc 7 0 0 0 5.141
DateTypeTest-cdc 1 0 0 0 3.042
FrozenCollectionsTest-cdc 34 0 0 0 11.670
JsonTest-cdc 22 0 0 0 20.997
SecondaryIndexOnMapEntriesTest-cdc 11 0 0 0 6.643
SecondaryIndexOnStaticColumnTest-cdc 6 0 0 0 6.252
SecondaryIndexTest-cdc 49 0 0 0 28.389
StaticColumnsTest-cdc 7 0 0 0 7.067
TimestampTest-cdc 8 0 0 0 17.512
TimeuuidTest-cdc 2 0 0 0 3.544
TupleTypeTest-cdc 15 0 0 0 27.616
TypeTest-cdc 4 0 0 0 4.144
UFAuthTest-cdc 26 0 0 0 11.856
UFIdentificationTest-cdc 14 0 0 1 12.529
UFJavaTest-cdc 20 0 0 0 20.356
UFPureScriptTupleCollectionTest-cdc 1 0 0 0 12.694
UFScriptTest-cdc 12 0 0 0 17.024
UFSecurityTest-cdc 2 0 0 0 5.895
UFTest-cdc 24 0 0 0 20.813
UFTypesTest-cdc 7 0 0 0 17.563
UFVerifierTest-cdc 20 0 0 0 5.981
UserTypesTest-cdc 27 0 0 0 13.454
VirtualTableTest-cdc 5 0 0 0 12.811
CollectionsTest-compression 50 0 0 0 27.906
CountersTest-compression 7 0 0 0 5.598
DateTypeTest-compression 1 0 0 0 3.365
FrozenCollectionsTest-compression 34 0 0 0 13.970
JsonTest-compression 22 0 0 0 22.179
SecondaryIndexOnMapEntriesTest- 11 0 0 0 7.551
compression
SecondaryIndexOnStaticColumnTest- 6 0 0 0 6.847
compression
SecondaryIndexTest-compression 49 0 0 0 31.367
StaticColumnsTest-compression 7 0 0 0 7.720
TimestampTest-compression 8 0 0 0 18.117
TimeuuidTest-compression 2 0 0 0 4.101
TupleTypeTest-compression 15 0 0 0 29.983
TypeTest-compression 4 0 0 0 4.699
UFAuthTest-compression 26 0 0 0 13.247
UFIdentificationTest-compression 14 0 0 1 15.068
UFJavaTest-compression 20 0 0 0 21.385
UFPureScriptTupleCollectionTest- 1 0 0 0 13.129
compression
UFScriptTest-compression 12 0 0 0 18.030
UFSecurityTest-compression 2 0 0 0 6.395
UFTest-compression 24 0 0 0 21.518
UFTypesTest-compression 7 0 0 0 18.748
UFVerifierTest-compression 20 0 0 0 6.649
UserTypesTest-compression 27 0 0 0 15.478
VirtualTableTest-compression 5 0 0 0 13.566
CollectionsTest-compression 50 0 0 0 26.690
CountersTest-compression 7 0 0 0 4.518
DateTypeTest-compression 1 0 0 0 2.859
FrozenCollectionsTest-compression 34 0 0 0 13.157
JsonTest-compression 22 0 0 0 20.439
SecondaryIndexOnMapEntriesTest- 11 0 0 0 6.200
compression
SecondaryIndexOnStaticColumnTest- 6 0 0 0 5.713
compression
SecondaryIndexTest-compression 49 0 0 0 28.511
StaticColumnsTest-compression 7 0 0 0 6.524
TimestampTest-compression 8 0 0 0 17.094
TimeuuidTest-compression 2 0 0 0 3.454
TupleTypeTest-compression 15 0 0 0 27.658
TypeTest-compression 4 0 0 0 4.935
UFAuthTest-compression 26 0 0 0 11.690
UFIdentificationTest-compression 14 0 0 1 12.981
UFJavaTest-compression 20 0 0 0 20.137
UFPureScriptTupleCollectionTest- 1 0 0 0 12.155
compression
UFScriptTest-compression 12 0 0 0 17.733
UFSecurityTest-compression 2 0 0 0 5.611
UFTest-compression 24 0 0 0 19.451
UFTypesTest-compression 7 0 0 0 16.736
UFVerifierTest-compression 20 0 0 0 5.679
UserTypesTest-compression 27 0 0 0 13.620
VirtualTableTest-compression 5 0 0 0 12.391
CollectionsTest 50 0 0 0 29.183
CountersTest 7 0 0 0 5.696
DateTypeTest 1 0 0 0 3.525
FrozenCollectionsTest 34 0 0 0 13.725
JsonTest 22 0 0 0 22.609
SecondaryIndexOnMapEntriesTest 11 0 0 0 7.726
SecondaryIndexOnStaticColumnTest 6 0 0 0 7.005
SecondaryIndexTest 49 0 0 0 32.808
StaticColumnsTest 7 0 0 0 7.894
TimestampTest 8 0 0 0 18.288
TimeuuidTest 2 0 0 0 4.147
TupleTypeTest 15 0 0 0 32.187
TypeTest 4 0 0 0 4.805
UFAuthTest 26 0 0 0 13.913
UFIdentificationTest 14 0 0 1 14.839
UFJavaTest 20 0 0 0 22.275
UFPureScriptTupleCollectionTest 1 0 0 0 13.307
UFScriptTest 12 0 0 0 18.241
UFSecurityTest 2 0 0 0 6.610
UFTest 24 0 0 0 21.986
UFTypesTest 7 0 0 0 19.222
UFVerifierTest 20 0 0 0 6.847
UserTypesTest 27 0 0 0 16.894
VirtualTableTest 5 0 0 0 13.636
CollectionsTest 50 0 0 0 26.568
CountersTest 7 0 0 0 5.066
DateTypeTest 1 0 0 0 3.090
FrozenCollectionsTest 34 0 0 0 12.610
JsonTest 22 0 0 0 20.643
SecondaryIndexOnMapEntriesTest 11 0 0 0 6.403
SecondaryIndexOnStaticColumnTest 6 0 0 0 6.023
SecondaryIndexTest 49 0 0 0 27.685
StaticColumnsTest 7 0 0 0 7.152
TimestampTest 8 0 0 0 17.536
TimeuuidTest 2 0 0 0 3.552
TupleTypeTest 15 0 0 0 26.988
TypeTest 4 0 0 0 4.087
UFAuthTest 26 0 0 0 11.710
UFIdentificationTest 14 0 0 1 12.463
UFJavaTest 20 0 0 0 20.411
UFPureScriptTupleCollectionTest 1 0 0 0 12.589
UFScriptTest 12 0 0 0 16.834
UFSecurityTest 2 0 0 0 5.885
UFTest 24 0 0 0 19.698
UFTypesTest 7 0 0 0 17.748
UFVerifierTest 20 0 0 0 5.963
UserTypesTest 27 0 0 0 13.138
VirtualTableTest 5 0 0 0 12.784
-------------------------------------------------------------------------------
org.apache.cassandra.cql3.validation.miscellaneous
Name Tests Errors Failures Skipped Time(s)
CrcCheckChanceTest-cdc 3 0 0 0 6.322
OverflowTest-cdc 14 0 0 0 7.601
PgStringTest-cdc 3 0 0 0 4.745
RoleSyntaxTest-cdc 9 0 0 0 4.705
SSTableMetadataTrackingTest-cdc 7 0 0 0 5.930
SSTablesIteratedTest-cdc 14 0 0 0 10.374
TombstonesTest-cdc 6 0 0 0 7.904
CrcCheckChanceTest-cdc 3 0 0 0 5.459
OverflowTest-cdc 14 0 0 0 6.679
PgStringTest-cdc 3 0 0 0 4.041
RoleSyntaxTest-cdc 9 0 0 0 4.171
SSTableMetadataTrackingTest-cdc 7 0 0 0 6.184
SSTablesIteratedTest-cdc 14 0 0 0 9.361
TombstonesTest-cdc 6 0 0 0 7.113
CrcCheckChanceTest-compression 3 0 0 0 6.150
OverflowTest-compression 14 0 0 0 7.504
PgStringTest-compression 3 0 0 0 4.568
RoleSyntaxTest-compression 9 0 0 0 4.616
SSTableMetadataTrackingTest-compression 7 0 0 0 5.707
SSTablesIteratedTest-compression 14 0 0 0 10.253
TombstonesTest-compression 6 0 0 0 7.757
CrcCheckChanceTest-compression 3 0 0 0 5.199
OverflowTest-compression 14 0 0 0 7.519
PgStringTest-compression 3 0 0 0 3.778
RoleSyntaxTest-compression 9 0 0 0 3.897
SSTableMetadataTrackingTest-compression 7 0 0 0 4.837
SSTablesIteratedTest-compression 14 0 0 0 8.719
TombstonesTest-compression 6 0 0 0 6.815
CrcCheckChanceTest 3 0 0 0 6.313
OverflowTest 14 0 0 0 7.668
PgStringTest 3 0 0 0 4.728
RoleSyntaxTest 9 0 0 0 4.799
SSTableMetadataTrackingTest 7 0 0 0 5.909
SSTablesIteratedTest 14 0 0 0 10.433
TombstonesTest 6 0 0 0 7.857
CrcCheckChanceTest 3 0 0 0 5.316
OverflowTest 14 0 0 0 6.441
PgStringTest 3 0 0 0 3.997
RoleSyntaxTest 9 0 0 0 3.940
SSTableMetadataTrackingTest 7 0 0 0 5.072
SSTablesIteratedTest 14 0 0 0 9.355
TombstonesTest 6 0 0 0 7.233
-------------------------------------------------------------------------------
org.apache.cassandra.cql3.validation.operations
Name Tests Errors Failures Skipped Time(s)
AggregationTest-cdc 50 0 0 0 33.027
AlterTest-cdc 26 0 0 0 21.863
BatchTest-cdc 11 0 0 0 48.931
CreateTest-cdc 21 0 0 0 10.614
DeleteTest-cdc 33 0 0 0 18.654
DropRecreateAndRestoreTest-cdc 4 0 0 0 5.058
DropTest-cdc 2 0 0 0 4.086
InsertTest-cdc 8 0 0 0 6.621
InsertUpdateIfConditionTest-cdc 42 0 0 0 22.823
SelectGroupByTest-cdc 7 0 0 0 19.374
SelectLimitTest-cdc 7 0 0 0 16.075
SelectMultiColumnRelationTest-cdc 22 0 0 0 10.604
SelectOrderByTest-cdc 17 0 0 0 9.471
SelectOrderedPartitionerTest-cdc 20 0 0 0 10.050
SelectSingleColumnRelationTest-cdc 23 0 0 0 11.653
SelectTest-cdc 82 0 0 0 30.694
TTLTest-cdc 7 0 0 0 9.446
TruncateTest-cdc 1 0 0 0 3.748
TuplesWithNullsComparisonTest-cdc 3 0 0 0 4.876
UpdateTest-cdc 11 0 0 0 9.061
UseTest-cdc 1 0 0 0 3.386
AggregationTest-cdc 50 0 0 0 29.410
AlterTest-cdc 26 0 0 0 19.645
BatchTest-cdc 11 0 0 0 48.087
CreateTest-cdc 21 0 0 0 9.566
DeleteTest-cdc 33 0 0 0 17.521
DropRecreateAndRestoreTest-cdc 4 0 0 0 4.196
DropTest-cdc 2 0 0 0 3.591
InsertTest-cdc 8 0 0 0 5.575
InsertUpdateIfConditionTest-cdc 42 0 0 0 19.644
SelectGroupByTest-cdc 7 0 0 0 18.183
SelectLimitTest-cdc 7 0 0 0 15.203
SelectMultiColumnRelationTest-cdc 22 0 0 0 9.430
SelectOrderByTest-cdc 17 0 0 0 9.178
SelectOrderedPartitionerTest-cdc 20 0 0 0 8.544
SelectSingleColumnRelationTest-cdc 23 0 0 0 9.900
SelectTest-cdc 82 0 0 0 26.286
TTLTest-cdc 7 0 0 0 8.329
TruncateTest-cdc 1 0 0 0 3.276
TuplesWithNullsComparisonTest-cdc 3 0 0 0 4.293
UpdateTest-cdc 11 0 0 0 7.927
UseTest-cdc 1 0 0 0 2.982
AggregationTest-compression 50 0 0 0 32.346
AlterTest-compression 26 0 0 0 22.404
BatchTest-compression 11 0 0 0 49.191
CreateTest-compression 21 0 0 0 10.242
DeleteTest-compression 33 0 0 0 18.000
DropRecreateAndRestoreTest-compression 4 0 0 0 4.742
DropTest-compression 2 0 0 0 3.953
InsertTest-compression 8 0 0 0 6.319
InsertUpdateIfConditionTest-compression 42 0 0 0 21.596
SelectGroupByTest-compression 7 0 0 0 18.694
SelectLimitTest-compression 7 0 0 0 15.775
SelectMultiColumnRelationTest-compression 22 0 0 0 10.185
SelectOrderByTest-compression 17 0 0 0 9.032
SelectOrderedPartitionerTest-compression 20 0 0 0 9.583
SelectSingleColumnRelationTest- 23 0 0 0 11.180
compression
SelectTest-compression 82 0 0 0 29.898
TTLTest-compression 7 0 0 0 10.133
TruncateTest-compression 1 0 0 0 3.581
TuplesWithNullsComparisonTest-compression 3 0 0 0 4.719
UpdateTest-compression 11 0 0 0 8.914
UseTest-compression 1 0 0 0 3.256
AggregationTest-compression 50 0 0 0 29.743
AlterTest-compression 26 0 0 0 20.694
BatchTest-compression 11 0 0 0 47.856
CreateTest-compression 21 0 0 0 9.325
DeleteTest-compression 33 0 0 0 16.999
DropRecreateAndRestoreTest-compression 4 0 0 0 4.149
DropTest-compression 2 0 0 0 3.394
InsertTest-compression 8 0 0 0 5.483
InsertUpdateIfConditionTest-compression 42 0 0 0 19.976
SelectGroupByTest-compression 7 0 0 0 16.821
SelectLimitTest-compression 7 0 0 0 14.369
SelectMultiColumnRelationTest-compression 22 0 0 0 9.283
SelectOrderByTest-compression 17 0 0 0 8.175
SelectOrderedPartitionerTest-compression 20 0 0 0 8.561
SelectSingleColumnRelationTest- 23 0 0 0 10.074
compression
SelectTest-compression 82 0 0 0 29.331
TTLTest-compression 7 0 0 0 8.073
TruncateTest-compression 1 0 0 0 3.118
TuplesWithNullsComparisonTest-compression 3 0 0 0 4.054
UpdateTest-compression 11 0 0 0 8.807
UseTest-compression 1 0 0 0 2.804
AggregationTest 50 0 0 0 33.359
AlterTest 26 0 0 0 21.850
BatchTest 11 0 0 0 49.196
CreateTest 21 0 0 0 11.334
DeleteTest 33 0 0 0 19.794
DropRecreateAndRestoreTest 4 0 0 0 5.255
DropTest 2 0 0 0 4.309
InsertTest 8 0 0 0 6.811
InsertUpdateIfConditionTest 42 0 0 0 22.673
SelectGroupByTest 7 0 0 0 19.488
SelectLimitTest 7 0 0 0 16.076
SelectMultiColumnRelationTest 22 0 0 0 10.731
SelectOrderByTest 17 0 0 0 9.437
SelectOrderedPartitionerTest 20 0 0 0 10.009
SelectSingleColumnRelationTest 23 0 0 0 11.432
SelectTest 82 0 0 0 30.894
TTLTest 7 0 0 0 9.385
TruncateTest 1 0 0 0 3.703
TuplesWithNullsComparisonTest 3 0 0 0 4.852
UpdateTest 11 0 0 0 9.222
UseTest 1 0 0 0 3.380
AggregationTest 50 0 0 0 29.454
AlterTest 26 0 0 0 19.548
BatchTest 11 0 0 0 47.939
CreateTest 21 0 0 0 9.139
DeleteTest 33 0 0 0 16.850
DropRecreateAndRestoreTest 4 0 0 0 4.635
DropTest 2 0 0 0 3.666
InsertTest 8 0 0 0 5.708
InsertUpdateIfConditionTest 42 0 0 0 19.690
SelectGroupByTest 7 0 0 0 18.385
SelectLimitTest 7 0 0 0 14.688
SelectMultiColumnRelationTest 22 0 0 0 8.780
SelectOrderByTest 17 0 0 0 7.945
SelectOrderedPartitionerTest 20 0 0 0 8.604
SelectSingleColumnRelationTest 23 0 0 0 9.692
SelectTest 82 0 0 0 26.190
TTLTest 7 0 0 0 8.696
TruncateTest 1 0 0 0 3.378
TuplesWithNullsComparisonTest 3 0 0 0 4.293
UpdateTest 11 0 0 0 7.917
UseTest 1 0 0 0 2.968
-------------------------------------------------------------------------------
org.apache.cassandra.db
Name Tests Errors Failures Skipped Time(s)
CellTest-cdc 11 0 0 0 3.255
CleanupTest-cdc 8 0 0 0 17.924
CleanupTransientTest-cdc 1 0 0 0 3.743
ClusteringBoundTest-cdc 2 0 0 0 0.082
ColumnFamilyMetricTest-cdc 2 0 0 0 3.469
ColumnFamilyStoreTest-cdc 8 0 0 0 4.468
ColumnsTest-cdc 8 0 0 0 1.821
CounterCacheTest-cdc 5 0 0 0 3.610
CounterCellTest-cdc 5 0 0 0 3.345
CounterMutationTest-cdc 4 0 0 0 3.485
DeletePartitionTest-cdc 1 0 0 0 3.307
DigestTest-cdc 6 0 0 0 0.505
DirectoriesTest-cdc 13 0 0 0 1.108
DiskBoundaryManagerTest-cdc 4 0 0 0 4.874
ImportTest-cdc 14 0 0 0 8.781
KeyCacheTest-cdc 6 0 0 0 5.106
KeyspaceTest-cdc 11 0 0 0 7.901
LivenessInfoTest-cdc 2 0 0 0 0.400
MmapFileTest-cdc 1 0 0 0 0.302
MultiKeyspaceTest-cdc 1 0 0 0 3.734
MutationExceededMaxSizeExceptionTest-cdc 1 0 0 0 0.065
NameSortTest-cdc 3 0 0 0 3.753
NativeCellTest-cdc 1 0 0 0 0.880
PartitionRangeReadTest-cdc 7 0 0 0 3.944
PartitionTest-cdc 4 0 0 0 3.407
RangeTombstoneListTest-cdc 25 0 0 0 1.055
RangeTombstoneTest-cdc 14 0 0 0 4.362
ReadCommandTest-cdc 23 0 0 0 5.205
ReadCommandVerbHandlerTest-cdc 4 0 0 0 4.719
ReadMessageTest-cdc 3 0 0 0 3.448
ReadResponseTest-cdc 8 0 0 0 0.661
RecoveryManagerFlushedTest-cdc 6 0 0 0 3.480
RecoveryManagerMissingHeaderTest-cdc 6 0 0 0 3.106
RecoveryManagerTest-cdc 42 0 0 0 7.772
RecoveryManagerTruncateTest-cdc 6 0 0 0 3.317
RemoveCellTest-cdc 1 0 0 0 3.517
RepairedDataInfoTest-cdc 7 0 0 0 1.586
RepairedDataTombstonesTest-cdc 7 0 0 0 27.912
RowCacheCQLTest-cdc 3 0 0 0 4.410
RowCacheTest-cdc 11 0 0 0 5.069
RowIndexEntryTest-cdc 4 0 0 0 4.457
RowIterationTest-cdc 3 0 0 0 4.393
RowTest-cdc 4 0 0 0 3.282
SchemaCQLHelperTest-cdc 9 0 0 0 6.177
ScrubTest-cdc 17 0 0 0 7.356
SecondaryIndexTest-cdc 14 0 0 0 9.593
SerializationHeaderTest-cdc 1 0 0 0 1.456
SinglePartitionReadCommandCQLTest-cdc 1 0 0 0 3.580
SinglePartitionSliceCommandTest-cdc 10 0 0 0 4.561
SystemKeyspaceMigrator40Test-cdc 4 0 0 0 4.263
SystemKeyspaceTest-cdc 4 0 0 0 2.533
TimeSortTest-cdc 2 0 0 0 4.769
TransformerTest-cdc 1 0 0 0 1.024
VerifyTest-cdc 23 0 0 0 4.285
CellTest-cdc 11 0 0 0 2.796
CleanupTest-cdc 8 0 0 0 17.295
CleanupTransientTest-cdc 1 0 0 0 3.421
ClusteringBoundTest-cdc 2 0 0 0 0.174
ColumnFamilyMetricTest-cdc 2 0 0 0 2.994
ColumnFamilyStoreTest-cdc 8 0 0 0 3.950
ColumnsTest-cdc 8 0 0 0 1.824
CounterCacheTest-cdc 5 0 0 0 3.003
CounterCellTest-cdc 5 0 0 0 2.833
CounterMutationTest-cdc 4 0 0 0 3.001
DeletePartitionTest-cdc 1 0 0 0 2.819
DigestTest-cdc 6 0 0 0 0.551
DirectoriesTest-cdc 13 0 0 0 1.223
DiskBoundaryManagerTest-cdc 4 0 0 0 4.105
ImportTest-cdc 14 0 0 0 7.617
KeyCacheTest-cdc 6 0 0 0 3.671
KeyspaceTest-cdc 11 0 0 0 6.757
LivenessInfoTest-cdc 2 0 0 0 0.507
MmapFileTest-cdc 1 0 0 0 0.472
MultiKeyspaceTest-cdc 1 0 0 0 3.213
MutationExceededMaxSizeExceptionTest-cdc 1 0 0 0 0.174
NameSortTest-cdc 3 0 0 0 3.417
NativeCellTest-cdc 1 0 0 0 1.107
PartitionRangeReadTest-cdc 7 0 0 0 3.712
PartitionTest-cdc 4 0 0 0 3.971
RangeTombstoneListTest-cdc 25 0 0 0 1.322
RangeTombstoneTest-cdc 14 0 0 0 3.842
ReadCommandTest-cdc 23 0 0 0 4.640
ReadCommandVerbHandlerTest-cdc 4 0 0 0 4.527
ReadMessageTest-cdc 3 0 0 0 3.242
ReadResponseTest-cdc 8 0 0 0 0.820
RecoveryManagerFlushedTest-cdc 6 0 0 0 3.392
RecoveryManagerMissingHeaderTest-cdc 6 0 0 0 3.000
RecoveryManagerTest-cdc 42 0 0 0 7.493
RecoveryManagerTruncateTest-cdc 6 0 0 0 2.785
RemoveCellTest-cdc 1 0 0 0 3.033
RepairedDataInfoTest-cdc 7 0 0 0 1.678
RepairedDataTombstonesTest-cdc 7 0 0 0 27.377
RowCacheCQLTest-cdc 3 0 0 0 3.840
RowCacheTest-cdc 11 0 0 0 4.843
RowIndexEntryTest-cdc 4 0 0 0 4.003
RowIterationTest-cdc 3 0 0 0 3.901
RowTest-cdc 4 0 0 0 2.867
SchemaCQLHelperTest-cdc 9 0 0 0 5.556
ScrubTest-cdc 17 0 0 0 7.386
SecondaryIndexTest-cdc 14 0 0 0 8.892
SerializationHeaderTest-cdc 1 0 0 0 1.640
SinglePartitionReadCommandCQLTest-cdc 1 0 0 0 3.116
SinglePartitionSliceCommandTest-cdc 10 0 0 0 4.065
SystemKeyspaceMigrator40Test-cdc 4 0 0 0 3.591
SystemKeyspaceTest-cdc 4 0 0 0 2.560
TimeSortTest-cdc 2 0 0 0 4.321
TransformerTest-cdc 1 0 0 0 1.129
VerifyTest-cdc 23 0 0 0 3.673
CellTest-compression 11 0 0 0 3.187
CleanupTest-compression 8 0 0 0 17.681
CleanupTransientTest-compression 1 0 0 0 3.927
ClusteringBoundTest-compression 2 0 0 0 0.074
ColumnFamilyMetricTest-compression 2 0 0 0 3.356
ColumnFamilyStoreTest-compression 8 0 0 0 4.483
ColumnsTest-compression 8 0 0 0 1.692
CounterCacheTest-compression 5 0 0 0 3.573
CounterCellTest-compression 5 0 0 0 3.240
CounterMutationTest-compression 4 0 0 0 3.414
DeletePartitionTest-compression 1 0 0 0 3.351
DigestTest-compression 6 0 0 0 0.473
DirectoriesTest-compression 13 0 0 0 1.052
DiskBoundaryManagerTest-compression 4 0 0 0 4.694
ImportTest-compression 14 0 0 0 8.414
KeyCacheTest-compression 6 0 0 0 4.074
KeyspaceTest-compression 11 0 0 0 7.837
LivenessInfoTest-compression 2 0 0 0 0.370
MmapFileTest-compression 1 0 0 0 0.299
MultiKeyspaceTest-compression 1 0 0 0 3.562
MutationExceededMaxSizeExceptionTest- 1 0 0 0 0.070
compression
NameSortTest-compression 3 0 0 0 3.752
NativeCellTest-compression 1 0 0 0 0.899
PartitionRangeReadTest-compression 7 0 0 0 3.857
PartitionTest-compression 4 0 0 0 3.326
RangeTombstoneListTest-compression 25 0 0 0 1.055
RangeTombstoneTest-compression 14 0 0 0 4.290
ReadCommandTest-compression 23 0 0 0 5.086
ReadCommandVerbHandlerTest-compression 4 0 0 0 6.189
ReadMessageTest-compression 3 0 0 0 3.307
ReadResponseTest-compression 8 0 0 0 0.627
RecoveryManagerFlushedTest-compression 6 0 0 0 3.493
RecoveryManagerMissingHeaderTest- 6 0 0 0 3.133
compression
RecoveryManagerTest-compression 42 0 0 0 7.622
RecoveryManagerTruncateTest-compression 6 0 0 0 3.413
RemoveCellTest-compression 1 0 0 0 3.523
RepairedDataInfoTest-compression 7 0 0 0 1.492
RepairedDataTombstonesTest-compression 7 0 0 0 27.756
RowCacheCQLTest-compression 3 0 0 0 4.241
RowCacheTest-compression 11 0 0 0 4.915
RowIndexEntryTest-compression 4 0 0 0 4.222
RowIterationTest-compression 3 0 0 0 4.262
RowTest-compression 4 0 0 0 3.188
SchemaCQLHelperTest-compression 9 0 0 0 5.919
ScrubTest-compression 17 0 0 2 7.477
SecondaryIndexTest-compression 14 0 0 0 9.294
SerializationHeaderTest-compression 1 0 0 0 1.438
SinglePartitionReadCommandCQLTest- 1 0 0 0 3.458
compression
SinglePartitionSliceCommandTest- 10 0 0 0 4.451
compression
SystemKeyspaceMigrator40Test-compression 4 0 0 0 4.101
SystemKeyspaceTest-compression 4 0 0 0 2.452
TimeSortTest-compression 2 0 0 0 4.613
TransformerTest-compression 1 0 0 0 0.950
VerifyTest-compression 23 0 0 0 4.079
CellTest-compression 11 0 0 0 2.676
CleanupTest-compression 8 0 0 0 17.016
CleanupTransientTest-compression 1 0 0 0 3.242
ClusteringBoundTest-compression 2 0 0 0 0.154
ColumnFamilyMetricTest-compression 2 0 0 0 2.793
ColumnFamilyStoreTest-compression 8 0 0 0 3.695
ColumnsTest-compression 8 0 0 0 1.627
CounterCacheTest-compression 5 0 0 0 3.002
CounterCellTest-compression 5 0 0 0 2.700
CounterMutationTest-compression 4 0 0 0 2.960
DeletePartitionTest-compression 1 0 0 0 2.807
DigestTest-compression 6 0 0 0 0.501
DirectoriesTest-compression 13 0 0 0 1.190
DiskBoundaryManagerTest-compression 4 0 0 0 3.944
ImportTest-compression 14 0 0 0 7.407
KeyCacheTest-compression 6 0 0 0 3.426
KeyspaceTest-compression 11 0 0 0 7.465
LivenessInfoTest-compression 2 0 0 0 0.417
MmapFileTest-compression 1 0 0 0 0.414
MultiKeyspaceTest-compression 1 0 0 0 2.958
MutationExceededMaxSizeExceptionTest- 1 0 0 0 0.141
compression
NameSortTest-compression 3 0 0 0 3.006
NativeCellTest-compression 1 0 0 0 0.983
PartitionRangeReadTest-compression 7 0 0 0 3.218
PartitionTest-compression 4 0 0 0 2.838
RangeTombstoneListTest-compression 25 0 0 0 1.148
RangeTombstoneTest-compression 14 0 0 0 3.653
ReadCommandTest-compression 23 0 0 0 5.469
ReadCommandVerbHandlerTest-compression 4 0 0 0 5.132
ReadMessageTest-compression 3 0 0 0 2.849
ReadResponseTest-compression 8 0 0 0 0.674
RecoveryManagerFlushedTest-compression 6 0 0 0 2.950
RecoveryManagerMissingHeaderTest- 6 0 0 0 2.589
compression
RecoveryManagerTest-compression 42 0 0 0 6.072
RecoveryManagerTruncateTest-compression 6 0 0 0 2.712
RemoveCellTest-compression 1 0 0 0 2.961
RepairedDataInfoTest-compression 7 0 0 0 1.582
RepairedDataTombstonesTest-compression 7 0 0 0 27.020
RowCacheCQLTest-compression 3 0 0 0 3.728
RowCacheTest-compression 11 0 0 0 4.154
RowIndexEntryTest-compression 4 0 0 0 3.750
RowIterationTest-compression 3 0 0 0 3.684
RowTest-compression 4 0 0 0 2.693
SchemaCQLHelperTest-compression 9 0 0 0 4.986
ScrubTest-compression 17 0 0 2 6.175
SecondaryIndexTest-compression 14 0 0 0 8.696
SerializationHeaderTest-compression 1 0 0 0 1.534
SinglePartitionReadCommandCQLTest- 1 0 0 0 2.939
compression
SinglePartitionSliceCommandTest- 10 0 0 0 3.877
compression
SystemKeyspaceMigrator40Test-compression 4 0 0 0 3.493
SystemKeyspaceTest-compression 4 0 0 0 2.348
TimeSortTest-compression 2 0 0 0 3.924
TransformerTest-compression 1 0 0 0 1.083
VerifyTest-compression 23 0 0 0 3.410
CellTest 11 0 0 0 3.216
CleanupTest 8 0 0 0 17.938
CleanupTransientTest 1 0 0 0 3.862
ClusteringBoundTest 2 0 0 0 0.078
ColumnFamilyMetricTest 2 0 0 0 3.399
ColumnFamilyStoreTest 8 0 0 0 4.559
ColumnsTest 8 0 0 0 1.696
CounterCacheTest 5 0 0 0 3.514
CounterCellTest 5 0 0 0 3.393
CounterMutationTest 4 0 0 0 3.449
DeletePartitionTest 1 0 0 0 3.383
DigestTest 6 0 0 0 0.477
DirectoriesTest 13 0 0 0 1.099
DiskBoundaryManagerTest 4 0 0 0 4.807
ImportTest 14 0 0 0 9.197
KeyCacheTest 6 0 0 0 4.120
KeyspaceTest 11 0 0 0 7.840
LivenessInfoTest 2 0 0 0 0.384
MmapFileTest 1 0 0 0 0.313
MultiKeyspaceTest 1 0 0 0 3.658
MutationExceededMaxSizeExceptionTest 1 0 0 0 0.066
NameSortTest 3 0 0 0 3.755
NativeCellTest 1 0 0 0 0.908
PartitionRangeReadTest 7 0 0 0 3.885
PartitionTest 4 0 0 0 3.411
RangeTombstoneListTest 25 0 0 0 1.095
RangeTombstoneTest 14 0 0 0 4.267
ReadCommandTest 23 0 0 0 5.314
ReadCommandVerbHandlerTest 4 0 0 0 4.755
ReadMessageTest 3 0 0 0 3.482
ReadResponseTest 8 0 0 0 0.642
RecoveryManagerFlushedTest 6 0 0 0 3.595
RecoveryManagerMissingHeaderTest 6 0 0 0 3.122
RecoveryManagerTest 42 0 0 0 6.695
RecoveryManagerTruncateTest 6 0 0 0 3.245
RemoveCellTest 1 0 0 0 3.527
RepairedDataInfoTest 7 0 0 0 1.566
RepairedDataTombstonesTest 7 0 0 0 27.900
RowCacheCQLTest 3 0 0 0 5.501
RowCacheTest 11 0 0 0 4.978
RowIndexEntryTest 4 0 0 0 4.469
RowIterationTest 3 0 0 0 4.371
RowTest 4 0 0 0 3.332
SchemaCQLHelperTest 9 0 0 0 6.289
ScrubTest 17 0 0 0 7.313
SecondaryIndexTest 14 0 0 0 9.474
SerializationHeaderTest 1 0 0 0 1.477
SinglePartitionReadCommandCQLTest 1 0 0 0 3.541
SinglePartitionSliceCommandTest 10 0 0 0 4.619
SystemKeyspaceMigrator40Test 4 0 0 0 4.257
SystemKeyspaceTest 4 0 0 0 2.634
TimeSortTest 2 0 0 0 4.769
TransformerTest 1 0 0 0 1.016
VerifyTest 23 0 0 0 4.151
CellTest 11 0 0 0 2.784
CleanupTest 8 0 0 0 17.214
CleanupTransientTest 1 0 0 0 3.441
ClusteringBoundTest 2 0 0 0 0.181
ColumnFamilyMetricTest 2 0 0 0 3.053
ColumnFamilyStoreTest 8 0 0 0 4.019
ColumnsTest 8 0 0 0 1.899
CounterCacheTest 5 0 0 0 3.079
CounterCellTest 5 0 0 0 2.848
CounterMutationTest 4 0 0 0 3.057
DeletePartitionTest 1 0 0 0 2.952
DigestTest 6 0 0 0 0.551
DirectoriesTest 13 0 0 0 1.333
DiskBoundaryManagerTest 4 0 0 0 4.493
ImportTest 14 0 0 0 8.011
KeyCacheTest 6 0 0 0 3.594
KeyspaceTest 11 0 0 0 6.818
LivenessInfoTest 2 0 0 0 0.453
MmapFileTest 1 0 0 0 0.448
MultiKeyspaceTest 1 0 0 0 3.180
MutationExceededMaxSizeExceptionTest 1 0 0 0 0.148
NameSortTest 3 0 0 0 3.202
NativeCellTest 1 0 0 0 1.053
PartitionRangeReadTest 7 0 0 0 3.302
PartitionTest 4 0 0 0 2.842
RangeTombstoneListTest 25 0 0 0 1.261
RangeTombstoneTest 14 0 0 0 3.793
ReadCommandTest 23 0 0 0 4.622
ReadCommandVerbHandlerTest 4 0 0 0 4.298
ReadMessageTest 3 0 0 0 3.017
ReadResponseTest 8 0 0 0 0.734
RecoveryManagerFlushedTest 6 0 0 0 3.109
RecoveryManagerMissingHeaderTest 6 0 0 0 2.933
RecoveryManagerTest 42 0 0 0 8.246
RecoveryManagerTruncateTest 6 0 0 0 3.017
RemoveCellTest 1 0 0 0 3.235
RepairedDataInfoTest 7 0 0 0 1.828
RepairedDataTombstonesTest 7 0 0 0 27.157
RowCacheCQLTest 3 0 0 0 3.921
RowCacheTest 11 0 0 0 4.457
RowIndexEntryTest 4 0 0 0 4.083
RowIterationTest 3 0 0 0 3.947
RowTest 4 0 0 0 2.945
SchemaCQLHelperTest 9 0 0 0 5.636
ScrubTest 17 0 0 0 6.881
SecondaryIndexTest 14 0 0 0 9.080
SerializationHeaderTest 1 0 0 0 1.648
SinglePartitionReadCommandCQLTest 1 0 0 0 3.315
SinglePartitionSliceCommandTest 10 0 0 0 4.292
SystemKeyspaceMigrator40Test 4 0 0 0 3.875
SystemKeyspaceTest 4 0 0 0 2.537
TimeSortTest 2 0 0 0 4.423
TransformerTest 1 0 0 0 1.179
VerifyTest 23 0 0 0 3.678
-------------------------------------------------------------------------------
org.apache.cassandra.db.aggregation
Name Tests Errors Failures Skipped Time(s)
GroupMakerTest-cdc 6 0 0 0 0.878
GroupMakerTest-cdc 6 0 0 0 1.090
GroupMakerTest-compression 6 0 0 0 0.827
GroupMakerTest-compression 6 0 0 0 0.975
GroupMakerTest 6 0 0 0 0.873
GroupMakerTest 6 0 0 0 1.116
-------------------------------------------------------------------------------
org.apache.cassandra.db.columniterator
Name Tests Errors Failures Skipped Time(s)
SSTableReverseIteratorTest-cdc 1 0 0 0 3.562
SSTableReverseIteratorTest-cdc 1 0 0 0 3.129
SSTableReverseIteratorTest-compression 1 0 0 0 3.322
SSTableReverseIteratorTest-compression 1 0 0 0 2.898
SSTableReverseIteratorTest 1 0 0 0 3.527
SSTableReverseIteratorTest 1 0 0 0 3.073
-------------------------------------------------------------------------------
org.apache.cassandra.db.commitlog
Name Tests Errors Failures Skipped Time(s)
BatchCommitLogStressTest 15 0 0 0 193.168
CommitLogStressTest 1 0 0 1 0.058
GroupCommitLogStressTest 15 0 0 0 185.067
PeriodicCommitLogStressTest 15 0 0 0 241.829
BatchCommitLogStressTest 15 0 0 0 192.891
CommitLogStressTest 1 0 0 1 0.148
GroupCommitLogStressTest 15 0 0 0 185.546
PeriodicCommitLogStressTest 15 0 0 0 240.805
AbstractCommitLogServiceTest-cdc 9 0 0 0 1.215
BatchCommitLogTest-cdc 174 0 0 0 7.696
CommitLogCQLTest-cdc 1 0 0 0 3.667
CommitLogChainedMarkersTest-cdc 1 0 0 0 4.140
CommitLogDescriptorTest-cdc 14 0 0 0 13.237
CommitLogFailurePolicyTest-cdc 4 0 0 0 5.932
CommitLogInitWithExceptionTest-cdc 1 0 0 0 1.523
CommitLogReaderTest-cdc 5 0 0 0 6.239
CommitLogSegmentBackpressureTest-cdc 1 0 0 0 4.872
CommitLogSegmentManagerCDCTest-cdc 7 0 0 0 8.938
CommitLogTest-cdc 1 0 0 1 0.065
CommitLogUpgradeTest-cdc 1 0 0 0 3.576
CommitlogShutdownTest-cdc 1 0 0 0 3.952
GroupCommitLogTest-cdc 162 0 0 0 13.717
SegmentReaderTest-cdc 6 0 0 0 1.244
SnapshotDeletingTest-cdc 1 0 0 1 3.299
AbstractCommitLogServiceTest-cdc 9 0 0 0 1.413
BatchCommitLogTest-cdc 174 0 0 0 6.931
CommitLogCQLTest-cdc 1 0 0 0 3.241
CommitLogChainedMarkersTest-cdc 1 0 0 0 3.542
CommitLogDescriptorTest-cdc 14 0 0 0 7.445
CommitLogFailurePolicyTest-cdc 4 0 0 0 5.342
CommitLogInitWithExceptionTest-cdc 1 0 0 0 1.613
CommitLogReaderTest-cdc 5 0 0 0 5.726
CommitLogSegmentBackpressureTest-cdc 1 0 0 0 4.265
CommitLogSegmentManagerCDCTest-cdc 7 0 0 0 9.250
CommitLogTest-cdc 1 0 0 1 0.167
CommitLogUpgradeTest-cdc 1 0 0 0 3.256
CommitlogShutdownTest-cdc 1 0 0 0 3.260
GroupCommitLogTest-cdc 162 0 0 0 12.927
SegmentReaderTest-cdc 6 0 0 0 1.347
SnapshotDeletingTest-cdc 1 0 0 1 2.870
AbstractCommitLogServiceTest-compression 9 0 0 0 1.193
BatchCommitLogTest-compression 174 0 0 0 7.369
CommitLogCQLTest-compression 1 0 0 0 3.531
CommitLogChainedMarkersTest-compression 1 0 0 0 4.053
CommitLogDescriptorTest-compression 14 0 0 0 13.676
CommitLogFailurePolicyTest-compression 4 0 0 0 5.857
CommitLogInitWithExceptionTest- 1 0 0 0 1.463
compression
CommitLogReaderTest-compression 5 0 0 0 6.256
CommitLogSegmentBackpressureTest- 1 0 0 0 4.675
compression
CommitLogSegmentManagerCDCTest- 7 0 0 0 8.656
compression
CommitLogTest-compression 1 0 0 1 0.066
CommitLogUpgradeTest-compression 1 0 0 0 3.699
CommitlogShutdownTest-compression 1 0 0 0 3.775
GroupCommitLogTest-compression 162 0 0 0 13.570
SegmentReaderTest-compression 6 0 0 0 1.376
SnapshotDeletingTest-compression 1 0 0 1 3.198
AbstractCommitLogServiceTest-compression 9 0 0 0 1.256
BatchCommitLogTest-compression 174 0 0 0 6.399
CommitLogCQLTest-compression 1 0 0 0 2.956
CommitLogChainedMarkersTest-compression 1 0 0 0 3.493
CommitLogDescriptorTest-compression 14 0 0 0 7.268
CommitLogFailurePolicyTest-compression 4 0 0 0 5.167
CommitLogInitWithExceptionTest- 1 0 0 0 1.594
compression
CommitLogReaderTest-compression 5 0 0 0 5.277
CommitLogSegmentBackpressureTest- 1 0 0 0 4.195
compression
CommitLogSegmentManagerCDCTest- 7 0 0 0 8.116
compression
CommitLogTest-compression 1 0 0 1 0.150
CommitLogUpgradeTest-compression 1 0 0 0 2.990
CommitlogShutdownTest-compression 1 0 0 0 3.238
GroupCommitLogTest-compression 162 0 0 0 12.292
SegmentReaderTest-compression 6 0 0 0 1.262
SnapshotDeletingTest-compression 1 0 0 1 2.696
AbstractCommitLogServiceTest 9 0 0 0 1.208
BatchCommitLogTest 174 0 0 0 7.493
CommitLogCQLTest 1 0 0 0 3.693
CommitLogChainedMarkersTest 1 0 0 0 4.128
CommitLogDescriptorTest 14 0 0 0 13.344
CommitLogFailurePolicyTest 4 0 0 0 6.017
CommitLogInitWithExceptionTest 1 0 0 0 1.499
CommitLogReaderTest 5 0 0 0 6.276
CommitLogSegmentBackpressureTest 1 0 0 0 4.770
CommitLogSegmentManagerCDCTest 7 0 0 0 8.884
CommitLogTest 1 0 0 1 0.060
CommitLogUpgradeTest 1 0 0 0 3.620
CommitlogShutdownTest 1 0 0 0 3.959
GroupCommitLogTest 162 0 0 0 13.549
SegmentReaderTest 6 0 0 0 1.277
SnapshotDeletingTest 1 0 0 1 3.335
AbstractCommitLogServiceTest 9 0 0 0 1.358
BatchCommitLogTest 174 0 0 0 6.886
CommitLogCQLTest 1 0 0 0 3.280
CommitLogChainedMarkersTest 1 0 0 0 3.714
CommitLogDescriptorTest 14 0 0 0 7.323
CommitLogFailurePolicyTest 4 0 0 0 5.500
CommitLogInitWithExceptionTest 1 0 0 0 1.636
CommitLogReaderTest 5 0 0 0 5.731
CommitLogSegmentBackpressureTest 1 0 0 0 4.371
CommitLogSegmentManagerCDCTest 7 0 0 0 8.388
CommitLogTest 1 0 0 1 0.177
CommitLogUpgradeTest 1 0 0 0 3.352
CommitlogShutdownTest 1 0 0 0 3.575
GroupCommitLogTest 162 0 0 0 12.845
SegmentReaderTest 6 0 0 0 1.373
SnapshotDeletingTest 1 0 0 1 2.900
-------------------------------------------------------------------------------
org.apache.cassandra.db.compaction
Name Tests Errors Failures Skipped Time(s)
LongCompactionsTest 4 0 0 0 19.030
LongLeveledCompactionStrategyCQLTest 1 0 0 0 303.786
LongLeveledCompactionStrategyTest 3 0 0 0 17.829
LongCompactionsTest 4 0 0 0 18.697
LongLeveledCompactionStrategyCQLTest 1 0 0 0 303.640
LongLeveledCompactionStrategyTest 3 0 0 0 16.190
AbstractCompactionStrategyTest-cdc 4 0 0 0 3.851
AbstractPendingRepairTest-cdc 1 0 0 1 0.059
ActiveCompactionsTest-cdc 6 0 0 0 6.142
AntiCompactionBytemanTest-cdc 1 0 0 0 6.411
AntiCompactionTest-cdc 15 0 0 0 28.775
CancelCompactionsTest-cdc 8 0 0 0 9.666
CompactionAwareWriterTest-cdc 4 0 0 0 82.698
CompactionControllerTest-cdc 2 0 0 0 3.849
CompactionExecutorTest-cdc 3 0 0 0 0.917
CompactionInfoTest-cdc 2 0 0 0 3.558
CompactionIteratorTest-cdc 12 0 0 0 7.317
CompactionStrategyManagerPendingRepairTest- 9 0 0 0 4.153
cdc
CompactionStrategyManagerTest-cdc 5 0 0 0 5.866
CompactionTaskTest-cdc 2 0 0 0 3.536
CompactionsBytemanTest-cdc 6 0 0 0 13.459
CompactionsCQLTest-cdc 24 0 0 0 35.856
CompactionsPurgeTest-cdc 10 0 0 0 4.212
CompactionsTest-cdc 6 0 0 1 16.988
CorruptedSSTablesCompactionsTest-cdc 2 0 0 0 5.255
DateTieredCompactionStrategyTest-cdc 7 0 0 0 7.281
LeveledCompactionStrategyTest-cdc 11 0 0 0 24.944
LeveledGenerationsTest-cdc 4 0 0 0 4.155
NeverPurgeTest-cdc 4 0 0 0 9.147
OneCompactionTest-cdc 2 0 0 0 3.481
PendingRepairManagerTest-cdc 16 0 0 0 4.747
SingleSSTableLCSTaskTest-cdc 4 0 0 0 69.699
SizeTieredCompactionStrategyTest-cdc 3 0 0 0 3.336
TTLExpiryTest-cdc 5 0 0 0 10.161
TimeWindowCompactionStrategyTest-cdc 5 0 0 0 8.914
ValidationExecutorTest-cdc 2 0 0 0 0.603
AbstractCompactionStrategyTest-cdc 4 0 0 0 3.448
AbstractPendingRepairTest-cdc 1 0 0 1 0.161
ActiveCompactionsTest-cdc 6 0 0 0 5.207
AntiCompactionBytemanTest-cdc 1 0 0 0 5.886
AntiCompactionTest-cdc 15 0 0 0 26.717
CancelCompactionsTest-cdc 8 0 0 0 8.882
CompactionAwareWriterTest-cdc 4 0 0 0 56.320
CompactionControllerTest-cdc 2 0 0 0 3.366
CompactionExecutorTest-cdc 3 0 0 0 1.066
CompactionInfoTest-cdc 2 0 0 0 3.153
CompactionIteratorTest-cdc 12 0 0 0 6.453
CompactionStrategyManagerPendingRepairTest- 9 0 0 0 3.685
cdc
CompactionStrategyManagerTest-cdc 5 0 0 0 4.959
CompactionTaskTest-cdc 2 0 0 0 3.077
CompactionsBytemanTest-cdc 6 0 0 0 12.621
CompactionsCQLTest-cdc 24 0 0 0 33.609
CompactionsPurgeTest-cdc 10 0 0 0 3.586
CompactionsTest-cdc 6 0 0 1 16.505
CorruptedSSTablesCompactionsTest-cdc 2 0 0 0 4.643
DateTieredCompactionStrategyTest-cdc 7 0 0 0 6.800
LeveledCompactionStrategyTest-cdc 11 0 0 0 20.256
LeveledGenerationsTest-cdc 4 0 0 0 3.608
NeverPurgeTest-cdc 4 0 0 0 8.697
OneCompactionTest-cdc 2 0 0 0 3.057
PendingRepairManagerTest-cdc 16 0 0 0 4.072
SingleSSTableLCSTaskTest-cdc 4 0 0 0 54.098
SizeTieredCompactionStrategyTest-cdc 3 0 0 0 2.995
TTLExpiryTest-cdc 5 0 0 0 9.619
TimeWindowCompactionStrategyTest-cdc 5 0 0 0 8.417
ValidationExecutorTest-cdc 2 0 0 0 0.738
AbstractCompactionStrategyTest-compression 4 0 0 0 3.851
AbstractPendingRepairTest-compression 1 0 0 1 0.059
ActiveCompactionsTest-compression 6 0 0 0 5.872
AntiCompactionBytemanTest-compression 1 0 0 0 6.213
AntiCompactionTest-compression 15 0 0 0 30.923
CancelCompactionsTest-compression 8 0 0 0 9.556
CompactionAwareWriterTest-compression 4 0 0 0 82.264
CompactionControllerTest-compression 2 0 0 0 3.771
CompactionExecutorTest-compression 3 0 0 0 0.888
CompactionInfoTest-compression 2 0 0 0 3.487
CompactionIteratorTest-compression 12 0 0 0 7.110
CompactionStrategyManagerPendingRepairTest- 9 0 0 0 4.082
compression
CompactionStrategyManagerTest-compression 5 0 0 0 5.736
CompactionTaskTest-compression 2 0 0 0 3.390
CompactionsBytemanTest-compression 6 0 0 0 13.261
CompactionsCQLTest-compression 24 0 0 0 35.954
CompactionsPurgeTest-compression 10 0 0 0 4.065
CompactionsTest-compression 6 0 0 1 16.974
CorruptedSSTablesCompactionsTest- 2 0 0 0 5.075
compression
DateTieredCompactionStrategyTest- 7 0 0 0 7.132
compression
LeveledCompactionStrategyTest-compression 11 0 0 0 27.413
LeveledGenerationsTest-compression 4 0 0 0 3.972
NeverPurgeTest-compression 4 0 0 0 9.249
OneCompactionTest-compression 2 0 0 0 3.545
PendingRepairManagerTest-compression 16 0 0 0 4.504
SingleSSTableLCSTaskTest-compression 4 0 0 0 88.998
SizeTieredCompactionStrategyTest- 3 0 0 0 3.335
compression
TTLExpiryTest-compression 5 0 0 0 10.032
TimeWindowCompactionStrategyTest- 5 0 0 0 8.745
compression
ValidationExecutorTest-compression 2 0 0 0 0.602
AbstractCompactionStrategyTest-compression 4 0 0 0 3.253
AbstractPendingRepairTest-compression 1 0 0 1 0.152
ActiveCompactionsTest-compression 6 0 0 0 4.948
AntiCompactionBytemanTest-compression 1 0 0 0 5.543
AntiCompactionTest-compression 15 0 0 0 22.840
CancelCompactionsTest-compression 8 0 0 0 8.659
CompactionAwareWriterTest-compression 4 0 0 0 59.383
CompactionControllerTest-compression 2 0 0 0 3.219
CompactionExecutorTest-compression 3 0 0 0 1.012
CompactionInfoTest-compression 2 0 0 0 3.058
CompactionIteratorTest-compression 12 0 0 0 6.376
CompactionStrategyManagerPendingRepairTest- 9 0 0 0 3.691
compression
CompactionStrategyManagerTest-compression 5 0 0 0 5.441
CompactionTaskTest-compression 2 0 0 0 2.899
CompactionsBytemanTest-compression 6 0 0 0 12.469
CompactionsCQLTest-compression 24 0 0 0 35.161
CompactionsPurgeTest-compression 10 0 0 0 3.460
CompactionsTest-compression 6 0 0 1 16.429
CorruptedSSTablesCompactionsTest- 2 0 0 0 4.427
compression
DateTieredCompactionStrategyTest- 7 0 0 0 6.801
compression
LeveledCompactionStrategyTest-compression 11 0 0 0 20.990
LeveledGenerationsTest-compression 4 0 0 0 3.427
NeverPurgeTest-compression 4 0 0 0 8.405
OneCompactionTest-compression 2 0 0 0 2.866
PendingRepairManagerTest-compression 16 0 0 0 3.936
SingleSSTableLCSTaskTest-compression 4 0 0 0 64.367
SizeTieredCompactionStrategyTest- 3 0 0 0 2.839
compression
TTLExpiryTest-compression 5 0 0 0 9.423
TimeWindowCompactionStrategyTest- 5 0 0 0 8.339
compression
ValidationExecutorTest-compression 2 0 0 0 0.702
AbstractCompactionStrategyTest 4 0 0 0 3.872
AbstractPendingRepairTest 1 0 0 1 0.059
ActiveCompactionsTest 6 0 0 0 6.048
AntiCompactionBytemanTest 1 0 0 0 6.474
AntiCompactionTest 15 0 0 0 28.801
CancelCompactionsTest 8 0 0 0 9.696
CompactionAwareWriterTest 4 0 0 0 82.571
CompactionControllerTest 2 0 0 0 3.842
CompactionExecutorTest 3 0 0 0 0.903
CompactionInfoTest 2 0 0 0 3.566
CompactionIteratorTest 12 0 0 0 7.358
CompactionStrategyManagerPendingRepairTest 9 0 0 0 4.237
CompactionStrategyManagerTest 5 0 0 0 5.980
CompactionTaskTest 2 0 0 0 3.557
CompactionsBytemanTest 6 0 0 0 13.483
CompactionsCQLTest 24 0 0 0 36.463
CompactionsPurgeTest 10 0 0 0 4.114
CompactionsTest 6 0 0 1 16.963
CorruptedSSTablesCompactionsTest 2 0 0 0 5.370
DateTieredCompactionStrategyTest 7 0 0 0 7.206
LeveledCompactionStrategyTest 11 0 0 0 25.168
LeveledGenerationsTest 4 0 0 0 4.186
NeverPurgeTest 4 0 0 0 9.455
OneCompactionTest 2 0 0 0 3.505
PendingRepairManagerTest 16 0 0 0 4.747
SingleSSTableLCSTaskTest 4 0 0 0 89.927
SizeTieredCompactionStrategyTest 3 0 0 0 3.353
TTLExpiryTest 5 0 0 0 10.172
TimeWindowCompactionStrategyTest 5 0 0 0 8.863
ValidationExecutorTest 2 0 0 0 0.595
AbstractCompactionStrategyTest 4 0 0 0 3.422
AbstractPendingRepairTest 1 0 0 1 0.148
ActiveCompactionsTest 6 0 0 0 5.391
AntiCompactionBytemanTest 1 0 0 0 5.966
AntiCompactionTest 15 0 0 0 27.775
CancelCompactionsTest 8 0 0 0 9.107
CompactionAwareWriterTest 4 0 0 0 55.731
CompactionControllerTest 2 0 0 0 3.434
CompactionExecutorTest 3 0 0 0 1.123
CompactionInfoTest 2 0 0 0 3.120
CompactionIteratorTest 12 0 0 0 6.726
CompactionStrategyManagerPendingRepairTest 9 0 0 0 3.830
CompactionStrategyManagerTest 5 0 0 0 5.128
CompactionTaskTest 2 0 0 0 3.135
CompactionsBytemanTest 6 0 0 0 13.173
CompactionsCQLTest 24 0 0 0 34.548
CompactionsPurgeTest 10 0 0 0 3.757
CompactionsTest 6 0 0 1 16.473
CorruptedSSTablesCompactionsTest 2 0 0 0 4.720
DateTieredCompactionStrategyTest 7 0 0 0 7.050
LeveledCompactionStrategyTest 11 0 0 0 19.861
LeveledGenerationsTest 4 0 0 0 3.775
NeverPurgeTest 4 0 0 0 8.623
OneCompactionTest 2 0 0 0 2.971
PendingRepairManagerTest 16 0 0 0 4.034
SingleSSTableLCSTaskTest 4 0 0 0 71.943
SizeTieredCompactionStrategyTest 3 0 0 0 2.812
TTLExpiryTest 5 0 0 0 9.458
TimeWindowCompactionStrategyTest 5 0 0 0 8.312
ValidationExecutorTest 2 0 0 0 0.744
-------------------------------------------------------------------------------
org.apache.cassandra.db.composites
Name Tests Errors Failures Skipped Time(s)
CTypeTest-cdc 3 0 0 0 0.508
CTypeTest-cdc 3 0 0 0 0.604
CTypeTest-compression 3 0 0 0 0.515
CTypeTest-compression 3 0 0 0 0.527
CTypeTest 3 0 0 0 0.512
CTypeTest 3 0 0 0 0.578
-------------------------------------------------------------------------------
org.apache.cassandra.db.context
Name Tests Errors Failures Skipped Time(s)
CounterContextTest-cdc 8 0 0 0 2.083
CounterContextTest-cdc 8 0 0 0 2.065
CounterContextTest-compression 8 0 0 0 2.044
CounterContextTest-compression 8 0 0 0 1.919
CounterContextTest 8 0 0 0 1.996
CounterContextTest 8 0 0 0 2.082
-------------------------------------------------------------------------------
org.apache.cassandra.db.filter
Name Tests Errors Failures Skipped Time(s)
ColumnFilterTest-cdc 3 0 0 0 0.625
RowFilterTest-cdc 1 0 0 0 0.607
SliceTest-cdc 4 0 0 0 0.118
ColumnFilterTest-cdc 3 0 0 0 0.757
RowFilterTest-cdc 1 0 0 0 0.684
SliceTest-cdc 4 0 0 0 0.210
ColumnFilterTest-compression 3 0 0 0 0.614
RowFilterTest-compression 1 0 0 0 0.596
SliceTest-compression 4 0 0 0 0.122
ColumnFilterTest-compression 3 0 0 0 0.657
RowFilterTest-compression 1 0 0 0 0.665
SliceTest-compression 4 0 0 0 0.189
ColumnFilterTest 3 0 0 0 0.645
RowFilterTest 1 0 0 0 0.630
SliceTest 4 0 0 0 0.117
ColumnFilterTest 3 0 0 0 0.635
RowFilterTest 1 0 0 0 0.646
SliceTest 4 0 0 0 0.200
-------------------------------------------------------------------------------
org.apache.cassandra.db.lifecycle
Name Tests Errors Failures Skipped Time(s)
HelpersTest-cdc 8 0 0 0 14.324
LifecycleTransactionTest-cdc 8 0 0 0 2.584
LogTransactionTest-cdc 39 0 0 0 2.937
RealTransactionsTest-cdc 3 0 0 0 4.303
TrackerTest-cdc 7 0 0 0 2.352
ViewTest-cdc 3 0 0 0 2.090
HelpersTest-cdc 8 0 0 0 13.609
LifecycleTransactionTest-cdc 8 0 0 0 2.700
LogTransactionTest-cdc 39 0 0 0 3.186
RealTransactionsTest-cdc 3 0 0 0 3.766
TrackerTest-cdc 7 0 0 0 2.394
ViewTest-cdc 3 0 0 0 2.291
HelpersTest-compression 8 0 0 0 14.712
LifecycleTransactionTest-compression 8 0 0 0 2.580
LogTransactionTest-compression 39 0 0 0 2.783
RealTransactionsTest-compression 3 0 0 0 4.097
TrackerTest-compression 7 0 0 0 2.278
ViewTest-compression 3 0 0 0 2.036
HelpersTest-compression 8 0 0 0 13.162
LifecycleTransactionTest-compression 8 0 0 0 2.408
LogTransactionTest-compression 39 0 0 0 2.973
RealTransactionsTest-compression 3 0 0 0 3.552
TrackerTest-compression 7 0 0 0 2.164
ViewTest-compression 3 0 0 0 1.994
HelpersTest 8 0 0 0 14.321
LifecycleTransactionTest 8 0 0 0 2.666
LogTransactionTest 39 0 0 0 2.978
RealTransactionsTest 3 0 0 0 4.343
TrackerTest 7 0 0 0 2.413
ViewTest 3 0 0 0 2.148
HelpersTest 8 0 0 0 13.028
LifecycleTransactionTest 8 0 0 0 2.608
LogTransactionTest 39 0 0 0 2.952
RealTransactionsTest 3 0 0 0 3.640
TrackerTest 7 0 0 0 2.394
ViewTest 3 0 0 0 2.104
-------------------------------------------------------------------------------
org.apache.cassandra.db.marshal
Name Tests Errors Failures Skipped Time(s)
AbstractCompositeTypeTest-cdc 2 0 0 0 0.069
ByteBufferAccessorTest-cdc 2 0 0 0 0.105
BytesTypeTest-cdc 2 0 0 0 0.236
CollectionTypeTest-cdc 6 0 0 0 0.159
CollectionTypesTest-cdc 3 0 0 0 5.674
CompositeAndTupleTypesTest-cdc 3 0 0 0 8.264
CompositeTypeTest-cdc 9 0 0 0 3.303
DecimalTypeTest-cdc 3 0 0 0 0.081
DynamicCompositeTypeTest-cdc 8 0 0 0 3.263
EmptyTypeTest-cdc 7 0 0 0 0.863
IntegerTypeTest-cdc 10 0 0 0 0.115
JsonConversionTest-cdc 30 0 0 0 0.694
ReversedTypeTest-cdc 1 0 0 0 0.097
RoundTripTest-cdc 8 0 0 0 0.554
SimpleDateTypeTest-cdc 1 0 0 0 0.125
TimeTypeTest-cdc 2 0 0 0 3.725
TimeUUIDTypeTest-cdc 6 0 0 0 7.520
TimestampTypeTest-cdc 1 0 0 0 0.565
TypeCompareTest-cdc 6 0 0 0 0.282
TypeParserTest-cdc 3 0 0 0 0.924
TypeValidationTest-cdc 18 0 0 0 3.382
UUIDTypeTest-cdc 6 0 0 0 3.869
ValueAccessorTest-cdc 4 0 0 0 0.489
AbstractCompositeTypeTest-cdc 2 0 0 0 0.175
ByteBufferAccessorTest-cdc 2 0 0 0 0.226
BytesTypeTest-cdc 2 0 0 0 0.311
CollectionTypeTest-cdc 6 0 0 0 0.245
CollectionTypesTest-cdc 3 0 0 0 5.761
CompositeAndTupleTypesTest-cdc 3 0 0 0 7.759
CompositeTypeTest-cdc 9 0 0 0 2.911
DecimalTypeTest-cdc 3 0 0 0 0.187
DynamicCompositeTypeTest-cdc 8 0 0 0 2.867
EmptyTypeTest-cdc 7 0 0 0 0.862
IntegerTypeTest-cdc 10 0 0 0 0.226
JsonConversionTest-cdc 30 0 0 0 0.829
ReversedTypeTest-cdc 1 0 0 0 0.200
RoundTripTest-cdc 8 0 0 0 0.626
SimpleDateTypeTest-cdc 1 0 0 0 0.236
TimeTypeTest-cdc 2 0 0 0 3.209
TimeUUIDTypeTest-cdc 6 0 0 0 4.694
TimestampTypeTest-cdc 1 0 0 0 0.630
TypeCompareTest-cdc 6 0 0 0 0.379
TypeParserTest-cdc 3 0 0 0 1.058
TypeValidationTest-cdc 18 0 0 0 3.520
UUIDTypeTest-cdc 6 0 0 0 2.707
ValueAccessorTest-cdc 4 0 0 0 0.576
AbstractCompositeTypeTest-compression 2 0 0 0 0.070
ByteBufferAccessorTest-compression 2 0 0 0 0.100
BytesTypeTest-compression 2 0 0 0 0.230
CollectionTypeTest-compression 6 0 0 0 0.150
CollectionTypesTest-compression 3 0 0 0 5.784
CompositeAndTupleTypesTest-compression 3 0 0 0 8.220
CompositeTypeTest-compression 9 0 0 0 3.202
DecimalTypeTest-compression 3 0 0 0 0.077
DynamicCompositeTypeTest-compression 8 0 0 0 3.259
EmptyTypeTest-compression 7 0 0 0 0.815
IntegerTypeTest-compression 10 0 0 0 0.130
JsonConversionTest-compression 30 0 0 0 0.679
ReversedTypeTest-compression 1 0 0 0 0.094
RoundTripTest-compression 8 0 0 0 0.482
SimpleDateTypeTest-compression 1 0 0 0 0.116
TimeTypeTest-compression 2 0 0 0 3.557
TimeUUIDTypeTest-compression 6 0 0 0 8.377
TimestampTypeTest-compression 1 0 0 0 0.564
TypeCompareTest-compression 6 0 0 0 0.271
TypeParserTest-compression 3 0 0 0 0.834
TypeValidationTest-compression 18 0 0 0 3.414
UUIDTypeTest-compression 6 0 0 0 3.897
ValueAccessorTest-compression 4 0 0 0 0.473
AbstractCompositeTypeTest-compression 2 0 0 0 0.148
ByteBufferAccessorTest-compression 2 0 0 0 0.179
BytesTypeTest-compression 2 0 0 0 0.285
CollectionTypeTest-compression 6 0 0 0 0.220
CollectionTypesTest-compression 3 0 0 0 5.481
CompositeAndTupleTypesTest-compression 3 0 0 0 7.635
CompositeTypeTest-compression 9 0 0 0 2.750
DecimalTypeTest-compression 3 0 0 0 0.158
DynamicCompositeTypeTest-compression 8 0 0 0 2.735
EmptyTypeTest-compression 7 0 0 0 0.818
IntegerTypeTest-compression 10 0 0 0 0.190
JsonConversionTest-compression 30 0 0 0 0.749
ReversedTypeTest-compression 1 0 0 0 0.167
RoundTripTest-compression 8 0 0 0 0.532
SimpleDateTypeTest-compression 1 0 0 0 0.183
TimeTypeTest-compression 2 0 0 0 3.067
TimeUUIDTypeTest-compression 6 0 0 0 4.530
TimestampTypeTest-compression 1 0 0 0 0.553
TypeCompareTest-compression 6 0 0 0 0.337
TypeParserTest-compression 3 0 0 0 0.959
TypeValidationTest-compression 18 0 0 0 3.357
UUIDTypeTest-compression 6 0 0 0 2.609
ValueAccessorTest-compression 4 0 0 0 0.486
AbstractCompositeTypeTest 2 0 0 0 0.069
ByteBufferAccessorTest 2 0 0 0 0.107
BytesTypeTest 2 0 0 0 0.247
CollectionTypeTest 6 0 0 0 0.159
CollectionTypesTest 3 0 0 0 5.678
CompositeAndTupleTypesTest 3 0 0 0 8.207
CompositeTypeTest 9 0 0 0 3.273
DecimalTypeTest 3 0 0 0 0.080
DynamicCompositeTypeTest 8 0 0 0 3.310
EmptyTypeTest 7 0 0 0 0.838
IntegerTypeTest 10 0 0 0 0.117
JsonConversionTest 30 0 0 0 0.686
ReversedTypeTest 1 0 0 0 0.101
RoundTripTest 8 0 0 0 0.504
SimpleDateTypeTest 1 0 0 0 0.126
TimeTypeTest 2 0 0 0 3.709
TimeUUIDTypeTest 6 0 0 0 7.775
TimestampTypeTest 1 0 0 0 0.563
TypeCompareTest 6 0 0 0 0.282
TypeParserTest 3 0 0 0 0.883
TypeValidationTest 18 0 0 0 3.322
UUIDTypeTest 6 0 0 0 3.758
ValueAccessorTest 4 0 0 0 0.482
AbstractCompositeTypeTest 2 0 0 0 0.155
ByteBufferAccessorTest 2 0 0 0 0.185
BytesTypeTest 2 0 0 0 0.296
CollectionTypeTest 6 0 0 0 0.243
CollectionTypesTest 3 0 0 0 5.566
CompositeAndTupleTypesTest 3 0 0 0 7.823
CompositeTypeTest 9 0 0 0 3.119
DecimalTypeTest 3 0 0 0 0.173
DynamicCompositeTypeTest 8 0 0 0 2.951
EmptyTypeTest 7 0 0 0 0.843
IntegerTypeTest 10 0 0 0 0.227
JsonConversionTest 30 0 0 0 0.785
ReversedTypeTest 1 0 0 0 0.179
RoundTripTest 8 0 0 0 0.537
SimpleDateTypeTest 1 0 0 0 0.194
TimeTypeTest 2 0 0 0 3.105
TimeUUIDTypeTest 6 0 0 0 4.794
TimestampTypeTest 1 0 0 0 0.595
TypeCompareTest 6 0 0 0 0.380
TypeParserTest 3 0 0 0 1.067
TypeValidationTest 18 0 0 0 3.413
UUIDTypeTest 6 0 0 0 2.692
ValueAccessorTest 4 0 0 0 0.571
-------------------------------------------------------------------------------
org.apache.cassandra.db.monitoring
Name Tests Errors Failures Skipped Time(s)
MonitoringTaskTest-cdc 15 0 0 0 5.397
MonitoringTaskTest-cdc 15 0 0 0 5.499
MonitoringTaskTest-compression 15 0 0 0 5.411
MonitoringTaskTest-compression 15 0 0 0 5.497
MonitoringTaskTest 15 0 0 0 5.384
MonitoringTaskTest 15 0 0 0 5.470
-------------------------------------------------------------------------------
org.apache.cassandra.db.partition
Name Tests Errors Failures Skipped Time(s)
PartitionImplementationTest-cdc 7 0 0 0 63.828
PartitionUpdateTest-cdc 3 0 0 0 4.746
PartitionImplementationTest-cdc 7 0 0 0 55.787
PartitionUpdateTest-cdc 3 0 0 0 3.842
PartitionImplementationTest-compression 7 0 0 0 63.353
PartitionUpdateTest-compression 3 0 0 0 4.130
PartitionImplementationTest-compression 7 0 0 0 52.002
PartitionUpdateTest-compression 3 0 0 0 3.588
PartitionImplementationTest 7 0 0 0 63.343
PartitionUpdateTest 3 0 0 0 4.341
PartitionImplementationTest 7 0 0 0 59.168
PartitionUpdateTest 3 0 0 0 3.740
-------------------------------------------------------------------------------
org.apache.cassandra.db.partitions
Name Tests Errors Failures Skipped Time(s)
PurgeFunctionTest-cdc 8 0 0 0 0.671
PurgeFunctionTest-cdc 8 0 0 0 0.724
PurgeFunctionTest-compression 8 0 0 0 0.610
PurgeFunctionTest-compression 8 0 0 0 0.603
PurgeFunctionTest 8 0 0 0 0.600
PurgeFunctionTest 8 0 0 0 0.645
-------------------------------------------------------------------------------
org.apache.cassandra.db.repair
Name Tests Errors Failures Skipped Time
(s)
AbstractPendingAntiCompactionTest-cdc 1 0 0 1 0.066
CompactionManagerGetSSTablesForValidationTest- 3 0 0 0 3.754
cdc
PendingAntiCompactionBytemanTest-cdc 1 0 0 0 4.288
PendingAntiCompactionTest-cdc 18 0 0 0 12.808
AbstractPendingAntiCompactionTest-cdc 1 0 0 1 0.164
CompactionManagerGetSSTablesForValidationTest- 3 0 0 0 3.189
cdc
PendingAntiCompactionBytemanTest-cdc 1 0 0 0 3.624
PendingAntiCompactionTest-cdc 18 0 0 0 12.138
AbstractPendingAntiCompactionTest-compression 1 0 0 1 0.059
CompactionManagerGetSSTablesForValidationTest- 3 0 0 0 3.431
compression
PendingAntiCompactionBytemanTest-compression 1 0 0 0 4.006
PendingAntiCompactionTest-compression 18 0 0 0 12.620
AbstractPendingAntiCompactionTest-compression 1 0 0 1 0.146
CompactionManagerGetSSTablesForValidationTest- 3 0 0 0 2.946
compression
PendingAntiCompactionBytemanTest-compression 1 0 0 0 3.346
PendingAntiCompactionTest-compression 18 0 0 0 11.826
AbstractPendingAntiCompactionTest 1 0 0 1 0.066
CompactionManagerGetSSTablesForValidationTest 3 0 0 0 3.544
PendingAntiCompactionBytemanTest 1 0 0 0 4.140
PendingAntiCompactionTest 18 0 0 0 12.806
AbstractPendingAntiCompactionTest 1 0 0 1 0.152
CompactionManagerGetSSTablesForValidationTest 3 0 0 0 2.984
PendingAntiCompactionBytemanTest 1 0 0 0 3.531
PendingAntiCompactionTest 18 0 0 0 11.866
-------------------------------------------------------------------------------
org.apache.cassandra.db.rows
Name Tests Errors Failures Skipped Time(s)
ColumnMetadataVersionComparatorTest-cdc 10 0 0 0 0.364
EncodingStatsTest-cdc 10 0 0 0 0.153
PartitionSerializationExceptionTest-cdc 2 0 0 0 1.123
RowAndDeletionMergeIteratorTest-cdc 10 0 0 0 3.568
RowsTest-cdc 9 0 0 0 1.059
ThrottledUnfilteredIteratorTest-cdc 7 0 0 0 10.367
UnfilteredRowIteratorsMergeTest-cdc 5 0 0 0 27.244
UnfilteredRowIteratorsTest-cdc 1 0 0 0 0.638
ColumnMetadataVersionComparatorTest-cdc 10 0 0 0 0.390
EncodingStatsTest-cdc 10 0 0 0 0.247
PartitionSerializationExceptionTest-cdc 2 0 0 0 1.199
RowAndDeletionMergeIteratorTest-cdc 10 0 0 0 2.826
RowsTest-cdc 9 0 0 0 1.184
ThrottledUnfilteredIteratorTest-cdc 7 0 0 0 9.558
UnfilteredRowIteratorsMergeTest-cdc 5 0 0 0 25.791
UnfilteredRowIteratorsTest-cdc 1 0 0 0 0.804
ColumnMetadataVersionComparatorTest- 10 0 0 0 0.317
compression
EncodingStatsTest-compression 10 0 0 0 0.140
PartitionSerializationExceptionTest- 2 0 0 0 1.098
compression
RowAndDeletionMergeIteratorTest- 10 0 0 0 3.226
compression
RowsTest-compression 9 0 0 0 0.999
ThrottledUnfilteredIteratorTest- 7 0 0 0 10.404
compression
UnfilteredRowIteratorsMergeTest- 5 0 0 0 27.212
compression
UnfilteredRowIteratorsTest-compression 1 0 0 0 0.627
ColumnMetadataVersionComparatorTest- 10 0 0 0 0.366
compression
EncodingStatsTest-compression 10 0 0 0 0.197
PartitionSerializationExceptionTest- 2 0 0 0 1.077
compression
RowAndDeletionMergeIteratorTest- 10 0 0 0 2.737
compression
RowsTest-compression 9 0 0 0 1.107
ThrottledUnfilteredIteratorTest- 7 0 0 0 8.256
compression
UnfilteredRowIteratorsMergeTest- 5 0 0 0 25.371
compression
UnfilteredRowIteratorsTest-compression 1 0 0 0 0.691
ColumnMetadataVersionComparatorTest 10 0 0 0 0.336
EncodingStatsTest 10 0 0 0 0.149
PartitionSerializationExceptionTest 2 0 0 0 1.116
RowAndDeletionMergeIteratorTest 10 0 0 0 3.244
RowsTest 9 0 0 0 1.004
ThrottledUnfilteredIteratorTest 7 0 0 0 10.172
UnfilteredRowIteratorsMergeTest 5 0 0 0 27.253
UnfilteredRowIteratorsTest 1 0 0 0 0.655
ColumnMetadataVersionComparatorTest 10 0 0 0 0.422
EncodingStatsTest 10 0 0 0 0.234
PartitionSerializationExceptionTest 2 0 0 0 1.082
RowAndDeletionMergeIteratorTest 10 0 0 0 2.662
RowsTest 9 0 0 0 1.110
ThrottledUnfilteredIteratorTest 7 0 0 0 9.509
UnfilteredRowIteratorsMergeTest 5 0 0 0 26.085
UnfilteredRowIteratorsTest 1 0 0 0 0.733
-------------------------------------------------------------------------------
org.apache.cassandra.db.streaming
Name Tests Errors Failures Skipped Time
(s)
CassandraEntireSSTableStreamWriterTest-cdc 2 0 0 0 3.712
CassandraOutgoingFileTest-cdc 3 0 0 0 3.537
CassandraStreamHeaderTest-cdc 5 0 0 0 3.356
CassandraStreamManagerTest-cdc 2 0 0 0 3.745
ComponentManifestTest-cdc 2 0 0 0 0.289
EntireSSTableStreamConcurrentComponentMutationTest- 3 0 0 0 14.492
cdc
StreamRequestTest-cdc 1 0 0 0 0.879
CassandraEntireSSTableStreamWriterTest-cdc 2 0 0 0 3.043
CassandraOutgoingFileTest-cdc 3 0 0 0 3.009
CassandraStreamHeaderTest-cdc 5 0 0 0 2.899
CassandraStreamManagerTest-cdc 2 0 0 0 3.206
ComponentManifestTest-cdc 2 0 0 0 0.383
EntireSSTableStreamConcurrentComponentMutationTest- 3 0 0 0 13.756
cdc
StreamRequestTest-cdc 1 0 0 0 1.036
CassandraEntireSSTableStreamWriterTest-compression 2 0 0 0 3.578
CassandraOutgoingFileTest-compression 3 0 0 0 3.482
CassandraStreamHeaderTest-compression 5 0 0 0 3.338
CassandraStreamManagerTest-compression 2 0 0 0 3.434
ComponentManifestTest-compression 2 0 0 0 0.274
EntireSSTableStreamConcurrentComponentMutationTest- 3 0 0 0 14.293
compression
StreamRequestTest-compression 1 0 0 0 0.856
CassandraEntireSSTableStreamWriterTest-compression 2 0 0 0 3.044
CassandraOutgoingFileTest-compression 3 0 0 0 2.866
CassandraStreamHeaderTest-compression 5 0 0 0 2.808
CassandraStreamManagerTest-compression 2 0 0 0 2.941
ComponentManifestTest-compression 2 0 0 0 0.325
EntireSSTableStreamConcurrentComponentMutationTest- 3 0 0 0 13.622
compression
StreamRequestTest-compression 1 0 0 0 0.981
CassandraEntireSSTableStreamWriterTest 2 0 0 0 3.680
CassandraOutgoingFileTest 3 0 0 0 3.553
CassandraStreamHeaderTest 5 0 0 0 3.462
CassandraStreamManagerTest 2 0 0 0 3.772
ComponentManifestTest 2 0 0 0 0.283
EntireSSTableStreamConcurrentComponentMutationTest 3 0 0 0 14.427
StreamRequestTest 1 0 0 0 0.908
CassandraEntireSSTableStreamWriterTest 2 0 0 0 3.188
CassandraOutgoingFileTest 3 0 0 0 3.206
CassandraStreamHeaderTest 5 0 0 0 2.946
CassandraStreamManagerTest 2 0 0 0 3.150
ComponentManifestTest 2 0 0 0 0.367
EntireSSTableStreamConcurrentComponentMutationTest 3 0 0 0 13.798
StreamRequestTest 1 0 0 0 0.996
-------------------------------------------------------------------------------
org.apache.cassandra.db.transform
Name Tests Errors Failures Skipped Time(s)
DuplicateRowCheckerTest-cdc 7 0 0 0 6.043
RTTransformationsTest-cdc 15 0 0 0 0.620
DuplicateRowCheckerTest-cdc 7 0 0 0 5.116
RTTransformationsTest-cdc 15 0 0 0 0.715
DuplicateRowCheckerTest-compression 7 0 0 0 5.823
RTTransformationsTest-compression 15 0 0 0 0.619
DuplicateRowCheckerTest-compression 7 0 0 0 4.904
RTTransformationsTest-compression 15 0 0 0 0.680
DuplicateRowCheckerTest 7 0 0 0 5.986
RTTransformationsTest 15 0 0 0 0.619
DuplicateRowCheckerTest 7 0 0 0 5.077
RTTransformationsTest 15 0 0 0 0.674
-------------------------------------------------------------------------------
org.apache.cassandra.db.view
Name Tests Errors Failures Skipped Time(s)
ViewBuilderTaskTest-cdc 1 0 0 0 23.956
ViewUtilsTest-cdc 3 0 0 0 1.367
ViewBuilderTaskTest-cdc 1 0 0 0 17.332
ViewUtilsTest-cdc 3 0 0 0 1.511
ViewBuilderTaskTest-compression 1 0 0 0 21.541
ViewUtilsTest-compression 3 0 0 0 1.384
ViewBuilderTaskTest-compression 1 0 0 0 20.780
ViewUtilsTest-compression 3 0 0 0 1.351
ViewBuilderTaskTest 1 0 0 0 16.363
ViewUtilsTest 3 0 0 0 1.407
ViewBuilderTaskTest 1 0 0 0 20.324
ViewUtilsTest 3 0 0 0 1.410
-------------------------------------------------------------------------------
org.apache.cassandra.db.virtual
Name Tests Errors Failures Skipped Time(s)
SettingsTableTest-cdc 7 0 0 0 13.854
SystemPropertiesTableTest-cdc 6 0 0 0 13.272
SettingsTableTest-cdc 7 0 0 0 13.126
SystemPropertiesTableTest-cdc 6 0 0 0 12.648
SettingsTableTest-compression 7 0 0 0 13.764
SystemPropertiesTableTest-compression 6 0 0 0 13.107
SettingsTableTest-compression 7 0 0 0 12.642
SystemPropertiesTableTest-compression 6 0 0 0 12.155
SettingsTableTest 7 0 0 0 13.829
SystemPropertiesTableTest 6 0 0 0 13.418
SettingsTableTest 7 0 0 0 13.000
SystemPropertiesTableTest 6 0 0 0 12.571
-------------------------------------------------------------------------------
org.apache.cassandra.dht
Name Tests Errors Failures Skipped Time(s)
BootStrapperTest-cdc 10 0 0 0 5.887
BoundsTest-cdc 1 0 0 0 0.104
ByteOrderedPartitionerTest-cdc 6 0 0 0 2.055
KeyCollisionTest-cdc 1 0 0 0 3.298
Murmur3PartitionerTest-cdc 10 0 0 0 1.700
OrderPreservingPartitionerTest-cdc 7 0 0 0 2.244
RandomPartitionerTest-cdc 9 0 0 0 2.104
RangeFetchMapCalculatorTest-cdc 13 0 0 0 0.983
RangeTest-cdc 32 0 0 0 12.846
SplitterTest-cdc 14 0 0 0 19.504
StreamStateStoreTest-cdc 1 0 0 0 2.137
BootStrapperTest-cdc 10 0 0 0 5.398
BoundsTest-cdc 1 0 0 0 0.207
ByteOrderedPartitionerTest-cdc 6 0 0 0 2.223
KeyCollisionTest-cdc 1 0 0 0 2.829
Murmur3PartitionerTest-cdc 10 0 0 0 1.989
OrderPreservingPartitionerTest-cdc 7 0 0 0 2.217
RandomPartitionerTest-cdc 9 0 0 0 2.150
RangeFetchMapCalculatorTest-cdc 13 0 0 0 1.158
RangeTest-cdc 32 0 0 0 12.750
SplitterTest-cdc 14 0 0 0 18.082
StreamStateStoreTest-cdc 1 0 0 0 2.157
BootStrapperTest-compression 10 0 0 0 7.044
BoundsTest-compression 1 0 0 0 0.100
ByteOrderedPartitionerTest-compression 6 0 0 0 2.000
KeyCollisionTest-compression 1 0 0 0 3.184
Murmur3PartitionerTest-compression 10 0 0 0 1.694
OrderPreservingPartitionerTest- 7 0 0 0 2.193
compression
RandomPartitionerTest-compression 9 0 0 0 2.042
RangeFetchMapCalculatorTest-compression 13 0 0 0 0.897
RangeTest-compression 32 0 0 0 13.225
SplitterTest-compression 14 0 0 0 19.785
StreamStateStoreTest-compression 1 0 0 0 1.989
BootStrapperTest-compression 10 0 0 0 6.077
BoundsTest-compression 1 0 0 0 0.173
ByteOrderedPartitionerTest-compression 6 0 0 0 2.066
KeyCollisionTest-compression 1 0 0 0 2.750
Murmur3PartitionerTest-compression 10 0 0 0 1.690
OrderPreservingPartitionerTest- 7 0 0 0 2.050
compression
RandomPartitionerTest-compression 9 0 0 0 1.955
RangeFetchMapCalculatorTest-compression 13 0 0 0 1.045
RangeTest-compression 32 0 0 0 13.211
SplitterTest-compression 14 0 0 0 17.452
StreamStateStoreTest-compression 1 0 0 0 1.989
BootStrapperTest 10 0 0 0 5.896
BoundsTest 1 0 0 0 0.103
ByteOrderedPartitionerTest 6 0 0 0 2.151
KeyCollisionTest 1 0 0 0 3.277
Murmur3PartitionerTest 10 0 0 0 1.778
OrderPreservingPartitionerTest 7 0 0 0 2.198
RandomPartitionerTest 9 0 0 0 2.046
RangeFetchMapCalculatorTest 13 0 0 0 0.989
RangeTest 32 0 0 0 13.506
SplitterTest 14 0 0 0 19.283
StreamStateStoreTest 1 0 0 0 2.106
BootStrapperTest 10 0 0 0 5.344
BoundsTest 1 0 0 0 0.211
ByteOrderedPartitionerTest 6 0 0 0 2.269
KeyCollisionTest 1 0 0 0 2.771
Murmur3PartitionerTest 10 0 0 0 1.857
OrderPreservingPartitionerTest 7 0 0 0 2.216
RandomPartitionerTest 9 0 0 0 2.128
RangeFetchMapCalculatorTest 13 0 0 0 1.059
RangeTest 32 0 0 0 12.836
SplitterTest 14 0 0 0 17.757
StreamStateStoreTest 1 0 0 0 1.995
-------------------------------------------------------------------------------
org.apache.cassandra.dht.tokenallocator
Name Tests Errors Failures Skipped Time(s)
AbstractReplicationAwareTokenAllocatorTest 1 0 0 1 0.062
Murmur3ReplicationAwareTokenAllocatorTest 2 0 0 0 151.363
NoReplicationTokenAllocatorTest 4 0 0 0 6.621
RandomReplicationAwareTokenAllocatorTest 2 0 0 0 62.943
AbstractReplicationAwareTokenAllocatorTest 1 0 0 1 0.149
Murmur3ReplicationAwareTokenAllocatorTest 2 0 0 0 150.520
NoReplicationTokenAllocatorTest 4 0 0 0 6.345
RandomReplicationAwareTokenAllocatorTest 2 0 0 0 61.626
-------------------------------------------------------------------------------
org.apache.cassandra.diag
Name Tests Errors Failures Skipped Time(s)
DiagnosticEventServiceTest-cdc 6 0 0 0 0.904
DiagnosticEventServiceTest-cdc 6 0 0 0 1.044
DiagnosticEventServiceTest-compression 6 0 0 0 0.854
DiagnosticEventServiceTest-compression 6 0 0 0 0.960
DiagnosticEventServiceTest 6 0 0 0 0.915
DiagnosticEventServiceTest 6 0 0 0 1.001
-------------------------------------------------------------------------------
org.apache.cassandra.diag.store
Name Tests Errors Failures Skipped Time(s)
DiagnosticEventMemoryStoreTest-cdc 6 0 0 0 0.084
DiagnosticEventMemoryStoreTest-cdc 6 0 0 0 0.172
DiagnosticEventMemoryStoreTest- 6 0 0 0 0.069
compression
DiagnosticEventMemoryStoreTest- 6 0 0 0 0.145
compression
DiagnosticEventMemoryStoreTest 6 0 0 0 0.074
DiagnosticEventMemoryStoreTest 6 0 0 0 0.150
-------------------------------------------------------------------------------
org.apache.cassandra.distributed.test
Name Tests Errors Failures Skipped Time(s)
BootstrapBinaryDisabledTest 1 0 0 0 72.764
CasWriteTest 9 0 0 0 28.420
ClientNetworkStopStartTest 1 0 0 0 23.593
FailingRepairTest 6 0 0 0 32.334
FqlReplayDDLExclusionTest 1 0 0 0 30.335
FrozenUDTTest 4 0 0 0 29.069
FullRepairCoordinatorFastTest 66 0 0 2 79.685
FullRepairCoordinatorNeighbourDownTest 12 0 0 0 229.931
FullRepairCoordinatorTimeoutTest 6 0 0 0 95.167
GossipSettlesTest 1 0 0 0 34.783
GossipShutdownTest 1 0 0 0 39.063
GossipTest 1 1 0 0 0.000
IncRepairTruncationTest 1 0 0 0 30.374
IncrementalRepairCoordinatorFastTest 66 0 0 6 75.789
IncrementalRepairCoordinatorNeighbourDownTest 12 0 0 0 244.593
IncrementalRepairCoordinatorTimeoutTest 6 0 0 0 95.283
JVMDTestTest 4 0 0 0 111.451
JVMStabilityInspectorCorruptSSTableExceptionTest 2 0 0 0 83.292
LargeColumnTest 1 0 0 0 14.013
MessageFiltersTest 5 0 0 0 60.552
MessageForwardingTest 1 0 0 0 14.602
NativeProtocolTest 2 0 0 0 71.447
NetstatsBootstrapWithEntireSSTablesCompressionStreamingTest 2 0 0 0 217.217
NetstatsBootstrapWithoutEntireSSTablesCompressionStreamingTest 2 0 0 0 207.517
NetstatsRepairStreamingTest 2 0 0 0 279.267
NetworkTopologyTest 6 0 0 0 6.879
NodeToolEnableDisableBinaryTest 2 0 0 0 29.702
NodeToolRingTest 6 0 0 0 12.693
NodeToolTest 2 0 0 0 14.785
PreviewRepairCoordinatorFastTest 66 0 0 2 89.436
PreviewRepairCoordinatorNeighbourDownTest 12 0 0 0 238.156
PreviewRepairCoordinatorTimeoutTest 6 0 0 0 96.190
PreviewRepairTest 5 0 0 0 157.879
QueryReplayerEndToEndTest 1 0 0 0 57.540
ReadRepairEmptyRangeTombstonesTest 119 0 0 0 59.328
ReadRepairQueryTypesTest 306 0 0 0 249.198
ReadRepairTest 10 0 0 0 146.401
RepairBoundaryTest 2 0 0 0 47.670
RepairCoordinatorFailingMessageTest 1 0 0 1 0.079
RepairDigestTrackingTest 5 0 0 0 53.927
RepairOperationalTest 5 0 0 0 76.772
RepairTest 7 0 0 0 123.057
ReplicaFilteringProtectionTest 3 0 0 0 14.622
ResourceLeakTest 1 0 0 1 0.094
SchemaTest 3 0 0 0 29.945
ShortReadProtectionTest 2 0 0 0 20.358
SimpleReadWriteTest 14 0 0 0 147.235
StreamPrepareFailTest 1 0 0 0 32.211
StreamingTest 1 0 0 0 16.037
TableEstimatesTest 2 0 0 0 9.636
TopologyChangeTest 4 0 0 0 207.594
BootstrapBinaryDisabledTest 1 0 0 0 74.045
CasWriteTest 9 0 0 0 28.124
ClientNetworkStopStartTest 1 0 0 0 23.542
FailingRepairTest 6 0 0 0 32.728
FqlReplayDDLExclusionTest 1 0 0 0 30.047
FrozenUDTTest 4 0 0 0 28.337
FullRepairCoordinatorFastTest 66 0 0 2 85.133
FullRepairCoordinatorNeighbourDownTest 12 0 0 0 230.660
FullRepairCoordinatorTimeoutTest 6 0 0 0 95.958
GossipSettlesTest 1 0 0 0 34.337
GossipShutdownTest 1 0 0 0 39.330
GossipTest 1 1 0 0 0.000
IncRepairTruncationTest 1 0 0 0 30.772
IncrementalRepairCoordinatorFastTest 66 0 0 6 82.069
IncrementalRepairCoordinatorNeighbourDownTest 12 0 0 0 231.190
IncrementalRepairCoordinatorTimeoutTest 6 0 0 0 96.056
JVMDTestTest 4 0 0 0 110.445
JVMStabilityInspectorCorruptSSTableExceptionTest 2 0 0 0 83.805
LargeColumnTest 1 0 0 0 13.606
MessageFiltersTest 5 0 0 0 59.546
MessageForwardingTest 1 0 0 0 13.595
NativeProtocolTest 2 0 0 0 70.365
NetstatsBootstrapWithEntireSSTablesCompressionStreamingTest 2 0 0 0 211.756
NetstatsBootstrapWithoutEntireSSTablesCompressionStreamingTest 2 0 0 0 200.569
NetstatsRepairStreamingTest 2 0 0 0 314.844
NetworkTopologyTest 6 0 0 0 5.814
NodeToolEnableDisableBinaryTest 2 0 0 0 32.022
NodeToolRingTest 6 0 0 0 8.746
NodeToolTest 2 0 0 0 13.872
PreviewRepairCoordinatorFastTest 66 0 0 2 85.948
PreviewRepairCoordinatorNeighbourDownTest 12 0 0 0 232.697
PreviewRepairCoordinatorTimeoutTest 6 0 0 0 95.275
PreviewRepairTest 5 0 0 0 152.018
QueryReplayerEndToEndTest 1 0 0 0 49.870
ReadRepairEmptyRangeTombstonesTest 119 0 0 0 73.075
ReadRepairQueryTypesTest 306 0 0 0 476.850
ReadRepairTest 10 0 0 0 140.339
RepairBoundaryTest 2 0 0 0 45.989
RepairCoordinatorFailingMessageTest 1 0 0 1 0.220
RepairDigestTrackingTest 5 0 0 0 47.195
RepairOperationalTest 5 0 0 0 70.587
RepairTest 7 0 0 0 113.294
ReplicaFilteringProtectionTest 3 0 0 0 13.208
ResourceLeakTest 1 0 0 1 0.201
SchemaTest 3 0 0 0 27.522
ShortReadProtectionTest 2 0 0 0 18.490
SimpleReadWriteTest 14 0 0 0 137.520
StreamPrepareFailTest 1 0 0 0 32.319
StreamingTest 1 0 0 0 15.358
TableEstimatesTest 2 0 0 0 8.910
TopologyChangeTest 4 0 0 0 204.345
-------------------------------------------------------------------------------
org.apache.cassandra.distributed.test.ring
Name Tests Errors Failures Skipped Time(s)
BootstrapTest 2 0 0 0 102.145
CommunicationDuringDecommissionTest 1 0 0 0 63.264
NodeNotInRingTest 1 0 0 0 31.021
PendingWritesTest 1 0 0 0 52.286
BootstrapTest 2 0 0 0 98.743
CommunicationDuringDecommissionTest 1 0 0 0 60.893
NodeNotInRingTest 1 0 0 0 31.689
PendingWritesTest 1 0 0 0 51.804
-------------------------------------------------------------------------------
org.apache.cassandra.distributed.upgrade
Name Tests Errors Failures Skipped Time(s)
CompactStorage3to4UpgradeTest 3 0 0 0 34.155
MixedModeReadRepairTest 5 1 0 0 205.025
MixedModeReadTest 1 0 0 0 24.333
PagingTest 1 0 0 0 98.868
UpgradeTest 2 0 0 0 84.322
-------------------------------------------------------------------------------
org.apache.cassandra.fql
Name Tests Errors Failures Skipped Time(s)
FullQueryLoggerTest-cdc 35 0 0 0 9.061
FullQueryLoggerTest-cdc 35 0 0 0 7.805
FullQueryLoggerTest-compression 35 0 0 0 8.763
FullQueryLoggerTest-compression 35 0 0 0 7.641
FullQueryLoggerTest 35 0 0 0 9.176
FullQueryLoggerTest 35 0 0 0 7.797
-------------------------------------------------------------------------------
org.apache.cassandra.fqltool
Name Tests Errors Failures Skipped Time(s)
FQLCompareTest 3 0 0 0 2.405
FQLReplayTest 22 0 0 0 2.129
FQLCompareTest 3 0 0 0 2.451
FQLReplayTest 22 0 0 0 2.233
-------------------------------------------------------------------------------
org.apache.cassandra.gms
Name Tests Errors Failures Skipped Time(s)
ArrayBackedBoundedStatsTest-cdc 2 0 0 0 0.068
ArrivalWindowTest-cdc 1 0 0 0 0.473
EndpointStateTest-cdc 2 0 0 0 1.285
ExpireEndpointTest-cdc 1 0 0 0 0.916
FailureDetectorTest-cdc 1 0 0 0 2.447
GossipDigestTest-cdc 1 0 0 0 0.266
GossiperTest-cdc 4 0 0 0 2.355
PendingRangeCalculatorServiceTest-cdc 1 0 0 0 4.549
SerializationsTest-cdc 2 0 0 0 0.878
ShadowRoundTest-cdc 1 0 0 0 5.735
ArrayBackedBoundedStatsTest-cdc 2 0 0 0 0.167
ArrivalWindowTest-cdc 1 0 0 0 0.556
EndpointStateTest-cdc 2 0 0 0 1.421
ExpireEndpointTest-cdc 1 0 0 0 1.055
FailureDetectorTest-cdc 1 0 0 0 2.480
GossipDigestTest-cdc 1 0 0 0 0.345
GossiperTest-cdc 4 0 0 0 2.256
PendingRangeCalculatorServiceTest-cdc 1 0 0 0 3.934
SerializationsTest-cdc 2 0 0 0 1.051
ShadowRoundTest-cdc 1 0 0 0 5.638
ArrayBackedBoundedStatsTest-compression 2 0 0 0 0.063
ArrivalWindowTest-compression 1 0 0 0 0.468
EndpointStateTest-compression 2 0 0 0 1.211
ExpireEndpointTest-compression 1 0 0 0 0.894
FailureDetectorTest-compression 1 0 0 0 2.385
GossipDigestTest-compression 1 0 0 0 0.250
GossiperTest-compression 4 0 0 0 2.233
PendingRangeCalculatorServiceTest- 1 0 0 0 4.462
compression
SerializationsTest-compression 2 0 0 0 0.810
ShadowRoundTest-compression 1 0 0 0 5.693
ArrayBackedBoundedStatsTest-compression 2 0 0 0 0.146
ArrivalWindowTest-compression 1 0 0 0 0.522
EndpointStateTest-compression 2 0 0 0 1.373
ExpireEndpointTest-compression 1 0 0 0 1.016
FailureDetectorTest-compression 1 0 0 0 2.229
GossipDigestTest-compression 1 0 0 0 0.323
GossiperTest-compression 4 0 0 0 2.123
PendingRangeCalculatorServiceTest- 1 0 0 0 3.633
compression
SerializationsTest-compression 2 0 0 0 0.970
ShadowRoundTest-compression 1 0 0 0 5.536
ArrayBackedBoundedStatsTest 2 0 0 0 0.066
ArrivalWindowTest 1 0 0 0 0.462
EndpointStateTest 2 0 0 0 1.262
ExpireEndpointTest 1 0 0 0 0.911
FailureDetectorTest 1 0 0 0 2.382
GossipDigestTest 1 0 0 0 0.267
GossiperTest 4 0 0 0 2.297
PendingRangeCalculatorServiceTest 1 0 0 0 4.474
SerializationsTest 2 0 0 0 0.842
ShadowRoundTest 1 0 0 0 5.723
ArrayBackedBoundedStatsTest 2 0 0 0 0.152
ArrivalWindowTest 1 0 0 0 0.584
EndpointStateTest 2 0 0 0 1.431
ExpireEndpointTest 1 0 0 0 1.049
FailureDetectorTest 1 0 0 0 2.430
GossipDigestTest 1 0 0 0 0.352
GossiperTest 4 0 0 0 2.203
PendingRangeCalculatorServiceTest 1 0 0 0 3.974
SerializationsTest 2 0 0 0 1.087
ShadowRoundTest 1 0 0 0 5.826
-------------------------------------------------------------------------------
org.apache.cassandra.hints
Name Tests Errors Failures Skipped Time(s)
HintsWriteThenReadTest 1 0 1 0 59.033
HintsWriteThenReadTest 1 0 1 0 58.607
ChecksummedDataInputTest-cdc 3 0 0 0 0.860
HintMessageTest-cdc 1 0 0 0 3.311
HintTest-cdc 7 0 0 0 4.691
HintWriteTTLTest-cdc 4 0 0 0 3.370
HintsBufferPoolTest-cdc 1 0 0 0 3.895
HintsBufferTest-cdc 2 0 0 0 6.139
HintsCatalogTest-cdc 3 0 0 0 3.330
HintsCompressionTest-cdc 4 0 0 0 7.290
HintsDescriptorTest-cdc 5 0 0 0 0.508
HintsEncryptionTest-cdc 1 0 0 0 4.850
HintsReaderTest-cdc 2 0 0 0 3.697
HintsServiceTest-cdc 4 0 0 0 176.026
ChecksummedDataInputTest-cdc 3 0 0 0 1.115
HintMessageTest-cdc 1 0 0 0 2.770
HintTest-cdc 7 0 0 0 4.028
HintWriteTTLTest-cdc 4 0 0 0 2.825
HintsBufferPoolTest-cdc 1 0 0 0 3.396
HintsBufferTest-cdc 2 0 0 0 5.539
HintsCatalogTest-cdc 3 0 0 0 2.860
HintsCompressionTest-cdc 4 0 0 0 5.658
HintsDescriptorTest-cdc 5 0 0 0 0.546
HintsEncryptionTest-cdc 1 0 0 0 4.144
HintsReaderTest-cdc 2 0 0 0 3.176
HintsServiceTest-cdc 4 0 0 0 175.508
ChecksummedDataInputTest-compression 3 0 0 0 0.826
HintMessageTest-compression 1 0 0 0 3.166
HintTest-compression 7 0 0 0 4.586
HintWriteTTLTest-compression 4 0 0 0 3.184
HintsBufferPoolTest-compression 1 0 0 0 3.859
HintsBufferTest-compression 2 0 0 0 6.253
HintsCatalogTest-compression 3 0 0 0 3.250
HintsCompressionTest-compression 4 0 0 0 7.174
HintsDescriptorTest-compression 5 0 0 0 0.496
HintsEncryptionTest-compression 1 0 0 0 4.890
HintsReaderTest-compression 2 0 0 0 3.594
HintsServiceTest-compression 4 0 0 0 185.894
ChecksummedDataInputTest-compression 3 0 0 0 0.951
HintMessageTest-compression 1 0 0 0 2.709
HintTest-compression 7 0 0 0 3.914
HintWriteTTLTest-compression 4 0 0 0 2.711
HintsBufferPoolTest-compression 1 0 0 0 3.202
HintsBufferTest-compression 2 0 0 0 4.597
HintsCatalogTest-compression 3 0 0 0 2.796
HintsCompressionTest-compression 4 0 0 0 5.816
HintsDescriptorTest-compression 5 0 0 0 0.534
HintsEncryptionTest-compression 1 0 0 0 4.230
HintsReaderTest-compression 2 0 0 0 3.139
HintsServiceTest-compression 4 0 0 0 175.319
ChecksummedDataInputTest 3 0 0 0 0.867
HintMessageTest 1 0 0 0 3.246
HintTest 7 0 0 0 4.784
HintWriteTTLTest 4 0 0 0 3.275
HintsBufferPoolTest 1 0 0 0 3.894
HintsBufferTest 2 0 0 0 5.811
HintsCatalogTest 3 0 0 0 3.396
HintsCompressionTest 4 0 0 0 7.448
HintsDescriptorTest 5 0 0 0 0.567
HintsEncryptionTest 1 0 0 0 5.593
HintsReaderTest 2 0 0 0 4.490
HintsServiceTest 4 0 0 0 177.427
ChecksummedDataInputTest 3 0 0 0 1.066
HintMessageTest 1 0 0 0 2.741
HintTest 7 0 0 0 4.100
HintWriteTTLTest 4 0 0 0 2.715
HintsBufferPoolTest 1 0 0 0 3.344
HintsBufferTest 2 0 0 0 5.666
HintsCatalogTest 3 0 0 0 2.797
HintsCompressionTest 4 0 0 0 5.568
HintsDescriptorTest 5 0 0 0 0.536
HintsEncryptionTest 1 0 0 0 4.068
HintsReaderTest 2 0 0 0 3.248
HintsServiceTest 4 0 0 0 175.537
-------------------------------------------------------------------------------
org.apache.cassandra.index
Name Tests Errors Failures Skipped Time(s)
CustomIndexTest-cdc 29 0 0 0 25.945
SecondaryIndexManagerTest-cdc 16 0 0 0 30.301
CustomIndexTest-cdc 29 0 0 0 23.504
SecondaryIndexManagerTest-cdc 16 0 0 0 26.391
CustomIndexTest-compression 29 0 0 0 31.726
SecondaryIndexManagerTest-compression 16 0 0 0 31.611
CustomIndexTest-compression 29 0 0 0 23.253
SecondaryIndexManagerTest-compression 16 0 0 0 26.685
CustomIndexTest 1 1 0 0 0.000
SecondaryIndexManagerTest 16 0 0 0 32.066
CustomIndexTest 29 0 0 0 23.827
SecondaryIndexManagerTest 16 0 0 0 26.792
-------------------------------------------------------------------------------
org.apache.cassandra.index.internal
Name Tests Errors Failures Skipped Time(s)
CassandraIndexTest-cdc 27 0 0 0 23.050
CassandraIndexTest-cdc 27 0 0 0 18.901
CassandraIndexTest-compression 27 0 0 0 25.095
CassandraIndexTest-compression 27 0 0 0 18.955
CassandraIndexTest 27 0 0 0 24.762
CassandraIndexTest 27 0 0 0 19.090
-------------------------------------------------------------------------------
org.apache.cassandra.index.sasi
Name Tests Errors Failures Skipped Time(s)
SASICQLTest-cdc 9 0 0 0 20.510
SASIIndexTest-cdc 32 0 0 0 20.590
SASICQLTest-cdc 9 0 0 0 21.292
SASIIndexTest-cdc 32 0 0 0 26.793
SASICQLTest-compression 9 0 0 0 21.287
SASIIndexTest-compression 32 0 0 0 20.573
SASICQLTest-compression 9 0 0 0 18.527
SASIIndexTest-compression 32 0 1 0 14.389
SASICQLTest 9 0 0 0 23.735
SASIIndexTest 32 0 0 0 22.546
SASICQLTest 9 0 0 0 23.939
SASIIndexTest 32 0 0 0 27.681
-------------------------------------------------------------------------------
org.apache.cassandra.index.sasi.analyzer
Name Tests Errors Failures Skipped Time(s)
DelimiterAnalyzerTest-cdc 12 0 0 0 0.426
NonTokenizingAnalyzerTest-cdc 3 0 0 0 0.289
StandardAnalyzerTest-cdc 10 0 0 0 0.611
DelimiterAnalyzerTest-cdc 12 0 0 0 0.781
NonTokenizingAnalyzerTest-cdc 3 0 0 0 0.505
StandardAnalyzerTest-cdc 10 0 0 0 1.114
DelimiterAnalyzerTest-compression 12 0 0 0 0.457
NonTokenizingAnalyzerTest-compression 3 0 0 0 0.249
StandardAnalyzerTest-compression 10 0 0 0 0.633
DelimiterAnalyzerTest-compression 12 0 0 0 0.449
NonTokenizingAnalyzerTest-compression 3 0 0 0 0.309
StandardAnalyzerTest-compression 10 0 0 0 0.575
DelimiterAnalyzerTest 12 0 0 0 0.500
NonTokenizingAnalyzerTest 3 0 0 0 0.366
StandardAnalyzerTest 10 0 0 0 0.845
DelimiterAnalyzerTest 12 0 0 0 0.767
NonTokenizingAnalyzerTest 3 0 0 0 0.459
StandardAnalyzerTest 10 0 0 0 0.924
-------------------------------------------------------------------------------
org.apache.cassandra.index.sasi.conf
Name Tests Errors Failures Skipped Time(s)
IndexModeTest-cdc 14 0 0 0 0.991
IndexModeTest-cdc 14 0 0 0 1.690
IndexModeTest-compression 14 0 0 0 0.958
IndexModeTest-compression 14 0 0 0 1.056
IndexModeTest 14 0 0 0 1.521
IndexModeTest 14 0 0 0 1.567
-------------------------------------------------------------------------------
org.apache.cassandra.index.sasi.disk
Name Tests Errors Failures Skipped Time(s)
OnDiskIndexTest-cdc 12 0 0 0 17.338
PerSSTableIndexWriterTest-cdc 2 0 0 0 6.735
TokenTreeTest-cdc 14 0 0 0 13.992
OnDiskIndexTest-cdc 12 0 0 0 16.133
PerSSTableIndexWriterTest-cdc 2 0 0 0 6.376
TokenTreeTest-cdc 14 0 0 0 14.633
OnDiskIndexTest-compression 12 0 0 0 17.272
PerSSTableIndexWriterTest-compression 2 0 0 0 7.104
TokenTreeTest-compression 14 0 0 0 18.343
OnDiskIndexTest-compression 12 0 0 0 13.910
PerSSTableIndexWriterTest-compression 2 0 0 0 5.317
TokenTreeTest-compression 14 0 0 0 13.210
OnDiskIndexTest 12 0 0 0 17.253
PerSSTableIndexWriterTest 2 0 0 0 6.866
TokenTreeTest 14 0 0 0 14.703
OnDiskIndexTest 12 0 0 0 16.480
PerSSTableIndexWriterTest 2 0 0 0 6.548
TokenTreeTest 14 0 0 0 14.794
-------------------------------------------------------------------------------
org.apache.cassandra.index.sasi.plan
Name Tests Errors Failures Skipped Time(s)
ExpressionTest-cdc 2 0 0 0 0.083
OperationTest-cdc 6 0 0 0 4.702
ExpressionTest-cdc 2 0 0 0 0.194
OperationTest-cdc 6 0 0 0 4.277
ExpressionTest-compression 2 0 0 0 0.080
OperationTest-compression 6 0 0 0 4.618
ExpressionTest-compression 2 0 0 0 0.151
OperationTest-compression 6 0 0 0 4.196
ExpressionTest 2 0 0 0 0.123
OperationTest 6 0 0 0 7.564
ExpressionTest 2 0 0 0 0.198
OperationTest 6 0 0 0 4.681
-------------------------------------------------------------------------------
org.apache.cassandra.index.sasi.utils
Name Tests Errors Failures Skipped Time(s)
LongIteratorTest-cdc 2 0 0 0 0.073
MappedBufferTest-cdc 26 0 0 0 2.291
RangeIntersectionIteratorTest-cdc 11 0 0 0 0.337
RangeUnionIteratorTest-cdc 13 0 0 0 0.295
LongIteratorTest-cdc 2 0 0 0 0.171
MappedBufferTest-cdc 26 0 0 0 2.457
RangeIntersectionIteratorTest-cdc 11 0 0 0 0.401
RangeUnionIteratorTest-cdc 13 0 0 0 0.436
LongIteratorTest-compression 2 0 0 0 0.088
MappedBufferTest-compression 26 0 0 0 2.307
RangeIntersectionIteratorTest-compression 11 0 0 0 0.325
RangeUnionIteratorTest-compression 13 0 0 0 0.305
LongIteratorTest-compression 2 0 0 0 0.144
MappedBufferTest-compression 26 0 0 0 2.867
RangeIntersectionIteratorTest-compression 11 0 0 0 0.349
RangeUnionIteratorTest-compression 13 0 0 0 0.346
LongIteratorTest 2 0 0 0 0.072
MappedBufferTest 26 0 0 0 2.272
RangeIntersectionIteratorTest 11 0 0 0 0.339
RangeUnionIteratorTest 13 0 0 0 0.318
LongIteratorTest 2 0 0 0 0.197
MappedBufferTest 26 0 0 0 2.604
RangeIntersectionIteratorTest 11 0 0 0 0.454
RangeUnionIteratorTest 13 0 0 0 0.456
-------------------------------------------------------------------------------
org.apache.cassandra.io
Name Tests Errors Failures Skipped Time(s)
BloomFilterTrackerTest-cdc 3 0 0 0 0.069
DiskSpaceMetricsTest-cdc 2 0 0 0 22.970
BloomFilterTrackerTest-cdc 3 0 0 0 0.186
DiskSpaceMetricsTest-cdc 2 0 0 0 12.942
BloomFilterTrackerTest-compression 3 0 0 0 0.066
DiskSpaceMetricsTest-compression 2 0 0 0 20.478
BloomFilterTrackerTest-compression 3 0 0 0 0.152
DiskSpaceMetricsTest-compression 2 0 0 0 11.259
BloomFilterTrackerTest 3 0 0 0 0.066
DiskSpaceMetricsTest 2 0 0 0 19.812
BloomFilterTrackerTest 3 0 0 0 0.190
DiskSpaceMetricsTest 2 0 0 0 14.223
-------------------------------------------------------------------------------
org.apache.cassandra.io.compress
Name Tests Errors Failures Skipped Time(s)
CQLCompressionTest-cdc 11 0 0 0 7.602
CompressedRandomAccessReaderTest-cdc 8 0 0 0 1.462
CompressedSequentialWriterReopenTest-cdc 4 0 0 0 8.287
CompressedSequentialWriterTest-cdc 14 0 0 0 2.553
CompressorTest-cdc 6 0 0 0 0.936
ZstdCompressorTest-cdc 3 0 0 0 0.327
CQLCompressionTest-cdc 11 0 0 0 7.565
CompressedRandomAccessReaderTest-cdc 8 0 0 0 1.351
CompressedSequentialWriterReopenTest-cdc 4 0 0 0 7.401
CompressedSequentialWriterTest-cdc 14 0 0 0 1.924
CompressorTest-cdc 6 0 0 0 0.951
ZstdCompressorTest-cdc 3 0 0 0 0.372
CQLCompressionTest-compression 11 0 0 0 7.968
CompressedRandomAccessReaderTest- 8 0 0 0 1.333
compression
CompressedSequentialWriterReopenTest- 4 0 0 0 9.137
compression
CompressedSequentialWriterTest- 14 0 0 0 1.815
compression
CompressorTest-compression 6 0 0 0 0.809
ZstdCompressorTest-compression 3 0 0 0 0.247
CQLCompressionTest-compression 11 0 0 0 7.351
CompressedRandomAccessReaderTest- 8 0 0 0 1.453
compression
CompressedSequentialWriterReopenTest- 4 0 0 0 8.466
compression
CompressedSequentialWriterTest- 14 0 0 0 1.983
compression
CompressorTest-compression 6 0 0 0 0.976
ZstdCompressorTest-compression 3 0 0 0 0.373
CQLCompressionTest 11 0 0 0 8.203
CompressedRandomAccessReaderTest 8 0 0 0 1.421
CompressedSequentialWriterReopenTest 4 0 0 0 9.637
CompressedSequentialWriterTest 14 0 0 0 1.926
CompressorTest 6 0 0 0 1.022
ZstdCompressorTest 3 0 0 0 0.282
CQLCompressionTest 11 0 0 0 8.848
CompressedRandomAccessReaderTest 8 0 0 0 2.367
CompressedSequentialWriterReopenTest 4 0 0 0 14.500
CompressedSequentialWriterTest 14 0 0 0 3.266
CompressorTest 6 0 0 0 1.721
ZstdCompressorTest 3 0 0 0 0.627
-------------------------------------------------------------------------------
org.apache.cassandra.io.sstable
Name Tests Errors Failures Skipped Time(s)
CQLSSTableWriterLongTest 1 0 0 0 5.982
CQLSSTableWriterLongTest 1 0 0 0 5.817
BigTableWriterTest-cdc 5 0 0 0 4.102
CQLSSTableWriterClientTest-cdc 1 0 0 0 1.911
CQLSSTableWriterTest-cdc 11 0 0 0 27.050
DescriptorTest-cdc 7 0 0 0 1.144
IndexSummaryManagerTest-cdc 8 0 0 0 6.840
IndexSummaryRedistributionTest-cdc 1 0 0 0 4.550
IndexSummaryTest-cdc 12 0 0 0 32.757
LargePartitionsTest-cdc 1 0 0 1 0.062
LegacySSTableTest-cdc 11 0 0 1 57.491
SSTableCorruptionDetectionTest-cdc 2 0 0 0 53.484
SSTableHeaderFixTest-cdc 14 0 0 0 2.082
SSTableLoaderTest-cdc 4 0 0 0 28.447
SSTableMetadataTest-cdc 3 0 0 0 3.950
SSTableReaderTest-cdc 19 0 0 0 9.007
SSTableRewriterTest-cdc 20 0 0 0 13.818
SSTableScannerTest-cdc 3 0 0 0 4.143
SSTableWriterTest-cdc 5 0 0 0 61.304
BigTableWriterTest-cdc 5 0 0 0 3.166
CQLSSTableWriterClientTest-cdc 1 0 0 0 1.884
CQLSSTableWriterTest-cdc 11 0 0 0 26.178
DescriptorTest-cdc 7 0 0 0 1.111
IndexSummaryManagerTest-cdc 8 0 0 0 5.617
IndexSummaryRedistributionTest-cdc 1 0 0 0 3.984
IndexSummaryTest-cdc 12 0 0 0 32.799
LargePartitionsTest-cdc 1 0 0 1 0.174
LegacySSTableTest-cdc 11 0 0 1 54.170
SSTableCorruptionDetectionTest-cdc 2 0 0 0 56.769
SSTableHeaderFixTest-cdc 14 0 0 0 1.523
SSTableLoaderTest-cdc 4 0 0 0 23.669
SSTableMetadataTest-cdc 3 0 0 0 3.597
SSTableReaderTest-cdc 19 0 0 0 8.682
SSTableRewriterTest-cdc 20 0 0 0 18.826
SSTableScannerTest-cdc 3 0 0 0 3.826
SSTableWriterTest-cdc 5 0 0 0 65.653
BigTableWriterTest-compression 5 0 0 0 3.567
CQLSSTableWriterClientTest-compression 1 0 0 0 1.828
CQLSSTableWriterTest-compression 11 0 0 0 26.771
DescriptorTest-compression 7 0 0 0 0.952
IndexSummaryManagerTest-compression 8 0 0 0 6.142
IndexSummaryRedistributionTest- 1 0 0 0 4.220
compression
IndexSummaryTest-compression 12 0 0 0 33.153
LargePartitionsTest-compression 1 0 0 1 0.072
LegacySSTableTest-compression 11 0 0 1 55.620
SSTableCorruptionDetectionTest- 2 0 0 0 55.026
compression
SSTableHeaderFixTest-compression 14 0 0 0 1.566
SSTableLoaderTest-compression 4 0 0 0 23.945
SSTableMetadataTest-compression 3 0 0 0 3.903
SSTableReaderTest-compression 19 0 0 0 9.077
SSTableRewriterTest-compression 20 0 0 0 26.835
SSTableScannerTest-compression 3 0 0 0 3.614
SSTableWriterTest-compression 5 0 0 0 35.771
BigTableWriterTest-compression 5 0 0 0 3.401
CQLSSTableWriterClientTest-compression 1 0 0 0 1.977
CQLSSTableWriterTest-compression 11 0 0 0 25.554
DescriptorTest-compression 7 0 0 0 1.094
IndexSummaryManagerTest-compression 8 0 0 0 5.315
IndexSummaryRedistributionTest- 1 0 0 0 3.577
compression
IndexSummaryTest-compression 12 0 0 0 31.284
LargePartitionsTest-compression 1 0 0 1 0.148
LegacySSTableTest-compression 11 0 0 1 55.168
SSTableCorruptionDetectionTest- 2 0 0 0 53.913
compression
SSTableHeaderFixTest-compression 14 0 0 0 1.338
SSTableLoaderTest-compression 4 0 0 0 20.654
SSTableMetadataTest-compression 3 0 0 0 3.323
SSTableReaderTest-compression 19 0 0 0 8.236
SSTableRewriterTest-compression 20 0 0 0 14.637
SSTableScannerTest-compression 3 0 0 0 2.862
SSTableWriterTest-compression 5 0 0 0 28.390
BigTableWriterTest 5 0 0 0 3.968
CQLSSTableWriterClientTest 1 0 0 0 1.940
CQLSSTableWriterTest 11 0 0 0 26.993
DescriptorTest 7 0 0 0 1.119
IndexSummaryManagerTest 8 0 0 0 7.523
IndexSummaryRedistributionTest 1 0 0 0 7.594
IndexSummaryTest 12 0 0 0 33.262
LargePartitionsTest 1 0 0 1 0.059
LegacySSTableTest 11 0 0 1 55.290
SSTableCorruptionDetectionTest 2 0 0 0 63.139
SSTableHeaderFixTest 14 0 0 0 1.374
SSTableLoaderTest 4 0 0 0 23.651
SSTableMetadataTest 3 0 0 0 3.863
SSTableReaderTest 19 0 0 0 9.802
SSTableRewriterTest 20 0 0 0 14.335
SSTableScannerTest 3 0 0 0 3.703
SSTableWriterTest 5 0 0 0 61.697
BigTableWriterTest 5 0 0 0 4.800
CQLSSTableWriterClientTest 1 0 0 0 3.009
CQLSSTableWriterTest 11 0 0 0 28.019
DescriptorTest 7 0 0 0 1.121
IndexSummaryManagerTest 8 0 0 0 6.808
IndexSummaryRedistributionTest 1 0 0 0 5.272
IndexSummaryTest 12 0 0 0 32.942
LargePartitionsTest 1 0 0 1 0.182
LegacySSTableTest 11 0 0 1 55.413
SSTableCorruptionDetectionTest 2 0 0 0 67.126
SSTableHeaderFixTest 14 0 0 0 1.374
SSTableLoaderTest 4 0 0 0 26.515
SSTableMetadataTest 3 0 0 0 4.565
SSTableReaderTest 19 0 0 0 8.144
SSTableRewriterTest 20 0 0 0 17.422
SSTableScannerTest 3 0 0 0 3.372
SSTableWriterTest 5 0 0 0 62.460
-------------------------------------------------------------------------------
org.apache.cassandra.io.sstable.format
Name Tests Errors Failures Skipped Time(s)
SSTableFlushObserverTest-cdc 1 0 0 0 2.309
SSTableFlushObserverTest-cdc 1 0 0 0 2.262
SSTableFlushObserverTest-compression 1 0 0 0 2.815
SSTableFlushObserverTest-compression 1 0 0 0 2.099
SSTableFlushObserverTest 1 0 0 0 2.282
SSTableFlushObserverTest 1 0 0 0 2.532
-------------------------------------------------------------------------------
org.apache.cassandra.io.sstable.format.big
Name Tests Errors Failures Skipped Time(s)
BigTableZeroCopyWriterTest-cdc 2 0 0 0 5.839
BigTableZeroCopyWriterTest-cdc 2 0 0 0 3.768
BigTableZeroCopyWriterTest-compression 2 0 0 0 4.127
BigTableZeroCopyWriterTest-compression 2 0 0 0 3.144
BigTableZeroCopyWriterTest 2 0 0 0 4.174
BigTableZeroCopyWriterTest 2 0 0 0 3.696
-------------------------------------------------------------------------------
org.apache.cassandra.io.sstable.metadata
Name Tests Errors Failures Skipped Time(s)
MetadataSerializerTest-cdc 10 0 0 0 2.021
MetadataSerializerTest-cdc 10 0 0 0 1.625
MetadataSerializerTest-compression 10 0 0 0 1.345
MetadataSerializerTest-compression 10 0 0 0 1.258
MetadataSerializerTest 10 0 0 0 1.354
MetadataSerializerTest 10 0 0 0 1.554
-------------------------------------------------------------------------------
org.apache.cassandra.io.util
Name Tests Errors Failures Skipped Time(s)
BufferedDataOutputStreamTest-cdc 16 0 0 0 27.327
BufferedRandomAccessFileTest-cdc 17 0 0 0 2.024
ChecksummedRandomAccessReaderTest-cdc 3 0 0 0 1.049
ChecksummedSequentialWriterTest-cdc 7 0 0 0 1.011
DataOutputTest-cdc 15 0 0 0 1.107
DiskOptimizationStrategyTest-cdc 5 0 0 0 0.088
FileSegmentInputStreamTest-cdc 7 0 0 0 0.104
FileUtilsTest-cdc 4 0 0 0 1.012
MemoryTest-cdc 2 0 0 0 0.344
MmappedRegionsTest-cdc 12 0 0 0 1.218
NIODataInputStreamTest-cdc 17 0 0 0 9.216
RandomAccessReaderTest-cdc 11 0 0 0 1.348
RewindableDataInputStreamPlusTest-cdc 8 0 0 0 0.245
SafeMemoryWriterTest-cdc 2 0 0 0 2.611
SequentialWriterTest-cdc 7 0 0 0 0.950
BufferedDataOutputStreamTest-cdc 16 0 0 0 27.767
BufferedRandomAccessFileTest-cdc 17 0 0 0 1.726
ChecksummedRandomAccessReaderTest-cdc 3 0 0 0 1.449
ChecksummedSequentialWriterTest-cdc 7 0 0 0 2.186
DataOutputTest-cdc 15 0 0 0 2.140
DiskOptimizationStrategyTest-cdc 5 0 0 0 0.305
FileSegmentInputStreamTest-cdc 7 0 0 0 0.376
FileUtilsTest-cdc 4 0 0 0 1.950
MemoryTest-cdc 2 0 0 0 0.737
MmappedRegionsTest-cdc 12 0 0 0 2.126
NIODataInputStreamTest-cdc 17 0 0 0 11.755
RandomAccessReaderTest-cdc 11 0 0 0 2.267
RewindableDataInputStreamPlusTest-cdc 8 0 0 0 0.482
SafeMemoryWriterTest-cdc 2 0 0 0 2.803
SequentialWriterTest-cdc 7 0 0 0 1.308
BufferedDataOutputStreamTest-compression 16 0 0 0 25.797
BufferedRandomAccessFileTest-compression 17 0 0 0 1.126
ChecksummedRandomAccessReaderTest- 3 0 0 0 0.904
compression
ChecksummedSequentialWriterTest- 7 0 0 0 0.880
compression
DataOutputTest-compression 15 0 0 0 0.956
DiskOptimizationStrategyTest-compression 5 0 0 0 0.077
FileSegmentInputStreamTest-compression 7 0 0 0 0.096
FileUtilsTest-compression 4 0 0 0 0.880
MemoryTest-compression 2 0 0 0 0.291
MmappedRegionsTest-compression 12 0 0 0 1.017
NIODataInputStreamTest-compression 17 0 0 0 9.094
RandomAccessReaderTest-compression 11 0 0 0 1.335
RewindableDataInputStreamPlusTest- 8 0 0 0 0.249
compression
SafeMemoryWriterTest-compression 2 0 0 0 2.489
SequentialWriterTest-compression 7 0 0 0 0.858
BufferedDataOutputStreamTest-compression 16 0 0 0 22.890
BufferedRandomAccessFileTest-compression 17 0 0 0 1.269
ChecksummedRandomAccessReaderTest- 3 0 0 0 1.012
compression
ChecksummedSequentialWriterTest- 7 0 0 0 1.022
compression
DataOutputTest-compression 15 0 0 0 1.047
DiskOptimizationStrategyTest-compression 5 0 0 0 0.146
FileSegmentInputStreamTest-compression 7 0 0 0 0.183
FileUtilsTest-compression 4 0 0 0 0.978
MemoryTest-compression 2 0 0 0 0.351
MmappedRegionsTest-compression 12 0 0 0 1.162
NIODataInputStreamTest-compression 17 0 0 0 6.974
RandomAccessReaderTest-compression 11 0 0 0 1.615
RewindableDataInputStreamPlusTest- 8 0 0 0 0.298
compression
SafeMemoryWriterTest-compression 2 0 0 0 2.417
SequentialWriterTest-compression 7 0 0 0 0.968
BufferedDataOutputStreamTest 16 0 0 0 25.677
BufferedRandomAccessFileTest 17 0 0 0 1.161
ChecksummedRandomAccessReaderTest 3 0 0 0 0.905
ChecksummedSequentialWriterTest 7 0 0 0 0.944
DataOutputTest 15 0 0 0 0.914
DiskOptimizationStrategyTest 5 0 0 0 0.073
FileSegmentInputStreamTest 7 0 0 0 0.099
FileUtilsTest 4 0 0 0 0.895
MemoryTest 2 0 0 0 0.315
MmappedRegionsTest 12 0 0 0 1.095
NIODataInputStreamTest 17 0 0 0 9.297
RandomAccessReaderTest 11 0 0 0 1.627
RewindableDataInputStreamPlusTest 8 0 0 0 0.293
SafeMemoryWriterTest 2 0 0 0 2.563
SequentialWriterTest 7 0 0 0 0.879
BufferedDataOutputStreamTest 16 0 0 0 24.222
BufferedRandomAccessFileTest 17 0 0 0 1.494
ChecksummedRandomAccessReaderTest 3 0 0 0 1.328
ChecksummedSequentialWriterTest 7 0 0 0 1.252
DataOutputTest 15 0 0 0 1.222
DiskOptimizationStrategyTest 5 0 0 0 0.186
FileSegmentInputStreamTest 7 0 0 0 0.243
FileUtilsTest 4 0 0 0 1.407
MemoryTest 2 0 0 0 0.523
MmappedRegionsTest 12 0 0 0 1.158
NIODataInputStreamTest 17 0 0 0 7.124
RandomAccessReaderTest 11 0 0 0 1.911
RewindableDataInputStreamPlusTest 8 0 0 0 0.411
SafeMemoryWriterTest 2 0 0 0 2.954
SequentialWriterTest 7 0 0 0 1.116
-------------------------------------------------------------------------------
org.apache.cassandra.locator
Name Tests Errors Failures Skipped Time(s)
DynamicEndpointSnitchLongTest 1 0 0 0 22.814
DynamicEndpointSnitchLongTest 1 0 0 0 27.432
AlibabaCloudSnitchTest-cdc 2 0 0 0 10.697
CloudstackSnitchTest-cdc 2 0 0 0 11.179
DynamicEndpointSnitchTest-cdc 1 0 0 0 2.606
EC2SnitchTest-cdc 13 0 0 0 11.699
GoogleCloudSnitchTest-cdc 2 0 0 0 11.946
GossipingPropertyFileSnitchTest-cdc 1 0 0 0 1.075
InetAddressAndPortSerializerTest-cdc 1 0 0 0 0.387
InetAddressAndPortTest-cdc 5 0 0 0 0.194
NetworkTopologyStrategyTest-cdc 5 0 0 0 4.457
PendingRangeMapsTest-cdc 2 0 0 0 0.504
PendingRangesTest-cdc 5 0 0 0 29.293
PropertyFileSnitchTest-cdc 5 0 0 0 16.196
ReconnectableSnitchHelperTest-cdc 1 0 0 0 1.197
ReplicaCollectionTest-cdc 6 0 0 0 1.023
ReplicaLayoutTest-cdc 1 0 0 0 0.535
ReplicaPlansTest-cdc 1 0 0 0 1.426
ReplicationFactorTest-cdc 2 0 0 0 0.998
ReplicationStrategyEndpointCacheTest-cdc 2 0 0 0 3.686
SimpleStrategyTest-cdc 7 0 0 0 3.579
TokenMetadataTest-cdc 6 0 0 0 0.904
AlibabaCloudSnitchTest-cdc 2 0 0 0 12.016
CloudstackSnitchTest-cdc 2 0 0 0 10.962
DynamicEndpointSnitchTest-cdc 1 0 0 0 2.737
EC2SnitchTest-cdc 13 0 0 0 10.800
GoogleCloudSnitchTest-cdc 2 0 0 0 11.233
GossipingPropertyFileSnitchTest-cdc 1 0 0 0 1.215
InetAddressAndPortSerializerTest-cdc 1 0 0 0 0.402
InetAddressAndPortTest-cdc 5 0 0 0 0.365
NetworkTopologyStrategyTest-cdc 5 0 0 0 4.637
PendingRangeMapsTest-cdc 2 0 0 0 0.588
PendingRangesTest-cdc 5 0 0 0 34.556
PropertyFileSnitchTest-cdc 5 0 0 0 16.291
ReconnectableSnitchHelperTest-cdc 1 0 0 0 1.198
ReplicaCollectionTest-cdc 6 0 0 0 0.885
ReplicaLayoutTest-cdc 1 0 0 0 0.593
ReplicaPlansTest-cdc 1 0 0 0 1.440
ReplicationFactorTest-cdc 2 0 0 0 1.049
ReplicationStrategyEndpointCacheTest-cdc 2 0 0 0 2.930
SimpleStrategyTest-cdc 7 0 0 0 2.906
TokenMetadataTest-cdc 6 0 0 0 1.120
AlibabaCloudSnitchTest-compression 2 0 0 0 10.641
CloudstackSnitchTest-compression 2 0 0 0 10.557
DynamicEndpointSnitchTest-compression 1 0 0 0 2.164
EC2SnitchTest-compression 13 0 0 0 10.623
GoogleCloudSnitchTest-compression 2 0 0 0 10.523
GossipingPropertyFileSnitchTest- 1 0 0 0 0.801
compression
InetAddressAndPortSerializerTest- 1 0 0 0 0.257
compression
InetAddressAndPortTest-compression 5 0 0 0 0.220
NetworkTopologyStrategyTest-compression 5 0 0 0 3.078
PendingRangeMapsTest-compression 2 0 0 0 0.416
PendingRangesTest-compression 5 0 0 0 29.755
PropertyFileSnitchTest-compression 5 0 0 0 15.991
ReconnectableSnitchHelperTest-compression 1 0 0 0 1.193
ReplicaCollectionTest-compression 6 0 0 0 0.882
ReplicaLayoutTest-compression 1 0 0 0 0.431
ReplicaPlansTest-compression 1 0 0 0 1.364
ReplicationFactorTest-compression 2 0 0 0 0.897
ReplicationStrategyEndpointCacheTest- 2 0 0 0 3.780
compression
SimpleStrategyTest-compression 7 0 0 0 3.393
TokenMetadataTest-compression 6 0 0 0 0.869
AlibabaCloudSnitchTest-compression 2 0 0 0 10.492
CloudstackSnitchTest-compression 2 0 0 0 10.530
DynamicEndpointSnitchTest-compression 1 0 0 0 2.266
EC2SnitchTest-compression 13 0 0 0 10.504
GoogleCloudSnitchTest-compression 2 0 0 0 10.505
GossipingPropertyFileSnitchTest- 1 0 0 0 0.970
compression
InetAddressAndPortSerializerTest- 1 0 0 0 0.322
compression
InetAddressAndPortTest-compression 5 0 0 0 0.232
NetworkTopologyStrategyTest-compression 5 0 0 0 2.918
PendingRangeMapsTest-compression 2 0 0 0 0.458
PendingRangesTest-compression 5 0 0 0 29.647
PropertyFileSnitchTest-compression 5 0 0 0 16.269
ReconnectableSnitchHelperTest-compression 1 0 0 0 1.258
ReplicaCollectionTest-compression 6 0 0 0 0.819
ReplicaLayoutTest-compression 1 0 0 0 0.483
ReplicaPlansTest-compression 1 0 0 0 1.368
ReplicationFactorTest-compression 2 0 0 0 0.991
ReplicationStrategyEndpointCacheTest- 2 0 0 0 2.690
compression
SimpleStrategyTest-compression 7 0 0 0 2.742
TokenMetadataTest-compression 6 0 0 0 0.950
AlibabaCloudSnitchTest 2 0 0 0 10.678
CloudstackSnitchTest 2 0 0 0 10.668
DynamicEndpointSnitchTest 1 0 0 0 2.234
EC2SnitchTest 13 0 0 0 10.754
GoogleCloudSnitchTest 2 0 0 0 10.969
GossipingPropertyFileSnitchTest 1 0 0 0 0.873
InetAddressAndPortSerializerTest 1 0 0 0 0.285
InetAddressAndPortTest 5 0 0 0 0.151
NetworkTopologyStrategyTest 5 0 0 0 3.346
PendingRangeMapsTest 2 0 0 0 0.527
PendingRangesTest 5 0 0 0 31.839
PropertyFileSnitchTest 5 0 0 0 15.943
ReconnectableSnitchHelperTest 1 0 0 0 1.073
ReplicaCollectionTest 6 0 0 0 0.787
ReplicaLayoutTest 1 0 0 0 0.466
ReplicaPlansTest 1 0 0 0 1.502
ReplicationFactorTest 2 0 0 0 0.978
ReplicationStrategyEndpointCacheTest 2 0 0 0 3.535
SimpleStrategyTest 7 0 0 0 3.715
TokenMetadataTest 6 0 0 0 1.032
AlibabaCloudSnitchTest 2 0 0 0 10.707
CloudstackSnitchTest 2 0 0 0 11.322
DynamicEndpointSnitchTest 1 0 0 0 2.426
EC2SnitchTest 13 0 0 0 10.682
GoogleCloudSnitchTest 2 0 0 0 11.553
GossipingPropertyFileSnitchTest 1 0 0 0 0.998
InetAddressAndPortSerializerTest 1 0 0 0 0.333
InetAddressAndPortTest 5 0 0 0 0.308
NetworkTopologyStrategyTest 5 0 0 0 3.775
PendingRangeMapsTest 2 0 0 0 0.478
PendingRangesTest 5 0 0 0 33.043
PropertyFileSnitchTest 5 0 0 0 16.242
ReconnectableSnitchHelperTest 1 0 0 0 1.300
ReplicaCollectionTest 6 0 0 0 0.978
ReplicaLayoutTest 1 0 0 0 0.561
ReplicaPlansTest 1 0 0 0 1.640
ReplicationFactorTest 2 0 0 0 1.373
ReplicationStrategyEndpointCacheTest 2 0 0 0 3.196
SimpleStrategyTest 7 0 0 0 3.173
TokenMetadataTest 6 0 0 0 1.342
-------------------------------------------------------------------------------
org.apache.cassandra.metrics
Name Tests Errors Failures Skipped Time(s)
BatchMetricsTest-cdc 3 0 0 0 11.005
BufferPoolMetricsTest-cdc 7 0 0 0 1.033
CQLMetricsTest-cdc 4 0 0 0 6.789
CacheMetricsTest-cdc 1 0 0 0 0.307
CassandraMetricsRegistryTest-cdc 5 0 0 0 0.317
ClientRequestSizeMetricsTest-cdc 1 0 0 0 12.915
DecayingEstimatedHistogramReservoirTest- 15 0 0 1 12.114
cdc
HintedHandOffMetricsTest-cdc 1 0 0 0 2.119
KeyspaceMetricsTest-cdc 1 0 0 0 6.207
LatencyMetricsTest-cdc 3 0 0 0 0.316
MaxSamplerTest-cdc 8 0 0 0 5.150
SamplerTest-cdc 5 0 0 0 1.179
TableMetricsTest-cdc 9 0 0 0 10.056
TopFrequencySamplerTest-cdc 6 0 0 0 2.102
BatchMetricsTest-cdc 3 0 0 0 9.539
BufferPoolMetricsTest-cdc 7 0 0 0 1.195
CQLMetricsTest-cdc 4 0 0 0 6.116
CacheMetricsTest-cdc 1 0 0 0 0.441
CassandraMetricsRegistryTest-cdc 5 0 0 0 0.448
ClientRequestSizeMetricsTest-cdc 1 0 0 0 11.999
DecayingEstimatedHistogramReservoirTest- 15 0 0 1 12.274
cdc
HintedHandOffMetricsTest-cdc 1 0 0 0 2.856
KeyspaceMetricsTest-cdc 1 0 0 0 6.300
LatencyMetricsTest-cdc 3 0 0 0 0.457
MaxSamplerTest-cdc 8 0 0 0 5.425
SamplerTest-cdc 5 0 0 0 1.318
TableMetricsTest-cdc 9 0 0 0 9.473
TopFrequencySamplerTest-cdc 6 0 0 0 2.426
BatchMetricsTest-compression 3 0 0 0 11.410
BufferPoolMetricsTest-compression 7 0 0 0 1.763
CQLMetricsTest-compression 4 0 0 0 7.538
CacheMetricsTest-compression 1 0 0 0 0.371
CassandraMetricsRegistryTest-compression 5 0 0 0 0.354
ClientRequestSizeMetricsTest-compression 1 0 0 0 13.289
DecayingEstimatedHistogramReservoirTest- 15 0 0 1 13.797
compression
HintedHandOffMetricsTest-compression 1 0 0 0 2.211
KeyspaceMetricsTest-compression 1 0 0 0 7.099
LatencyMetricsTest-compression 3 0 0 0 0.342
MaxSamplerTest-compression 8 0 0 0 5.232
SamplerTest-compression 5 0 0 0 1.215
TableMetricsTest-compression 9 0 0 0 10.833
TopFrequencySamplerTest-compression 6 0 0 0 2.584
BatchMetricsTest-compression 3 0 0 0 11.388
BufferPoolMetricsTest-compression 7 0 0 0 1.092
CQLMetricsTest-compression 4 0 0 0 5.996
CacheMetricsTest-compression 1 0 0 0 0.394
CassandraMetricsRegistryTest-compression 5 0 0 0 0.420
ClientRequestSizeMetricsTest-compression 1 0 0 0 11.813
DecayingEstimatedHistogramReservoirTest- 15 0 0 1 9.519
compression
HintedHandOffMetricsTest-compression 1 0 0 0 2.143
KeyspaceMetricsTest-compression 1 0 0 0 5.017
LatencyMetricsTest-compression 3 0 0 0 0.400
MaxSamplerTest-compression 8 0 0 0 5.326
SamplerTest-compression 5 0 0 0 1.351
TableMetricsTest-compression 9 0 0 0 9.398
TopFrequencySamplerTest-compression 6 0 0 0 2.195
BatchMetricsTest 3 0 0 0 11.583
BufferPoolMetricsTest 7 0 0 0 1.127
CQLMetricsTest 4 0 0 0 7.760
CacheMetricsTest 1 0 0 0 0.422
CassandraMetricsRegistryTest 5 0 0 0 0.422
ClientRequestSizeMetricsTest 1 0 0 0 15.140
DecayingEstimatedHistogramReservoirTest 15 0 0 1 15.047
HintedHandOffMetricsTest 1 0 0 0 2.321
KeyspaceMetricsTest 1 0 0 0 6.730
LatencyMetricsTest 3 0 0 0 0.328
MaxSamplerTest 8 0 0 0 5.256
SamplerTest 5 0 0 0 1.203
TableMetricsTest 9 0 0 0 14.351
TopFrequencySamplerTest 6 0 0 0 2.085
BatchMetricsTest 3 0 0 0 15.806
BufferPoolMetricsTest 7 0 0 0 1.103
CQLMetricsTest 4 0 0 0 9.107
CacheMetricsTest 1 0 0 0 0.420
CassandraMetricsRegistryTest 5 0 0 0 0.508
ClientRequestSizeMetricsTest 1 0 0 0 14.136
DecayingEstimatedHistogramReservoirTest 15 0 0 1 10.574
HintedHandOffMetricsTest 1 0 0 0 2.012
KeyspaceMetricsTest 1 0 0 0 5.081
LatencyMetricsTest 3 0 0 0 0.434
MaxSamplerTest 8 0 0 0 5.399
SamplerTest 5 0 0 0 1.424
TableMetricsTest 9 0 0 0 10.528
TopFrequencySamplerTest 6 0 0 0 2.299
-------------------------------------------------------------------------------
org.apache.cassandra.net
Name Tests Errors Failures Skipped Time(s)
ConnectionBurnTest 1 0 0 0 123.664
ConnectionBurnTest 1 0 0 0 123.633
AsyncChannelPromiseTest-cdc 4 0 0 0 0.466
AsyncMessageOutputPlusTest-cdc 1 0 0 0 1.131
AsyncOneResponseTest-cdc 2 0 0 0 4.292
AsyncPromiseTest-cdc 4 0 0 0 0.372
AsyncStreamingInputPlusTest-cdc 13 0 0 0 1.467
AsyncStreamingOutputPlusTest-cdc 3 0 0 0 1.014
ChunkedInputPlusTest-cdc 5 0 0 0 0.563
ConnectionTest-cdc 13 0 0 0 77.653
ForwardingInfoTest-cdc 2 0 0 0 0.468
FramingTest-cdc 5 0 0 0 32.227
HandshakeTest-cdc 13 0 0 0 2.774
ManyToOneConcurrentLinkedQueueTest-cdc 22 0 0 0 1.587
MessageSerializationPropertyTest-cdc 2 0 0 0 9.439
MessageTest-cdc 7 0 0 0 1.982
MessagingServiceTest-cdc 14 0 0 0 3.429
MockMessagingServiceTest-cdc 1 0 0 0 5.241
OutboundConnectionSettingsTest-cdc 9 0 0 0 2.820
OutboundConnectionsTest-cdc 6 0 0 0 3.083
OutboundMessageQueueTest-cdc 3 0 0 0 1.236
ProxyHandlerConnectionsTest-cdc 5 0 0 0 36.662
PrunableArrayQueueTest-cdc 9 0 0 0 0.097
ResourceLimitsTest-cdc 4 0 0 0 0.165
StartupClusterConnectivityCheckerTest-cdc 7 0 0 0 1.543
VerbTest-cdc 1 0 0 0 0.202
WriteCallbackInfoTest-cdc 1 0 0 0 1.998
AsyncChannelPromiseTest-cdc 4 0 0 0 0.699
AsyncMessageOutputPlusTest-cdc 1 0 0 0 1.324
AsyncOneResponseTest-cdc 2 0 0 0 4.497
AsyncPromiseTest-cdc 4 0 0 0 0.765
AsyncStreamingInputPlusTest-cdc 13 0 0 0 1.774
AsyncStreamingOutputPlusTest-cdc 3 0 0 0 1.660
ChunkedInputPlusTest-cdc 5 0 0 0 0.921
ConnectionTest-cdc 13 0 0 0 76.114
ForwardingInfoTest-cdc 2 0 0 0 0.476
FramingTest-cdc 5 0 0 0 24.872
HandshakeTest-cdc 13 0 0 0 3.502
ManyToOneConcurrentLinkedQueueTest-cdc 22 0 0 0 1.772
MessageSerializationPropertyTest-cdc 2 0 0 0 7.596
MessageTest-cdc 7 0 0 0 1.464
MessagingServiceTest-cdc 14 0 0 0 3.078
MockMessagingServiceTest-cdc 1 0 0 0 3.774
OutboundConnectionSettingsTest-cdc 9 0 0 0 2.226
OutboundConnectionsTest-cdc 6 0 0 0 2.304
OutboundMessageQueueTest-cdc 3 0 0 0 1.136
ProxyHandlerConnectionsTest-cdc 5 0 0 0 36.206
PrunableArrayQueueTest-cdc 9 0 0 0 0.217
ResourceLimitsTest-cdc 4 0 0 0 0.260
StartupClusterConnectivityCheckerTest-cdc 7 0 0 0 1.273
VerbTest-cdc 1 0 0 0 0.278
WriteCallbackInfoTest-cdc 1 0 0 0 1.788
AsyncChannelPromiseTest-compression 4 0 0 0 0.454
AsyncMessageOutputPlusTest-compression 1 0 0 0 0.931
AsyncOneResponseTest-compression 2 0 0 0 4.268
AsyncPromiseTest-compression 4 0 0 0 0.376
AsyncStreamingInputPlusTest-compression 13 0 0 0 1.468
AsyncStreamingOutputPlusTest-compression 3 0 0 0 0.982
ChunkedInputPlusTest-compression 5 0 0 0 0.525
ConnectionTest-compression 13 0 0 0 75.776
ForwardingInfoTest-compression 2 0 0 0 0.283
FramingTest-compression 5 0 0 0 23.678
HandshakeTest-compression 13 0 0 0 2.359
ManyToOneConcurrentLinkedQueueTest- 22 0 0 0 1.711
compression
MessageSerializationPropertyTest- 2 0 0 0 6.913
compression
MessageTest-compression 7 0 0 0 1.665
MessagingServiceTest-compression 14 0 0 0 2.613
MockMessagingServiceTest-compression 1 0 0 0 3.981
OutboundConnectionSettingsTest- 9 0 0 0 2.541
compression
OutboundConnectionsTest-compression 6 0 0 0 2.566
OutboundMessageQueueTest-compression 3 0 0 0 1.010
ProxyHandlerConnectionsTest-compression 5 0 0 0 36.673
PrunableArrayQueueTest-compression 9 0 0 0 0.082
ResourceLimitsTest-compression 4 0 0 0 0.131
StartupClusterConnectivityCheckerTest- 7 0 0 0 1.389
compression
VerbTest-compression 1 0 0 0 0.184
WriteCallbackInfoTest-compression 1 0 0 0 1.622
AsyncChannelPromiseTest-compression 4 0 0 0 0.516
AsyncMessageOutputPlusTest-compression 1 0 0 0 1.055
AsyncOneResponseTest-compression 2 0 0 0 4.307
AsyncPromiseTest-compression 4 0 0 0 0.553
AsyncStreamingInputPlusTest-compression 13 0 0 0 1.582
AsyncStreamingOutputPlusTest-compression 3 0 0 0 1.108
ChunkedInputPlusTest-compression 5 0 0 0 0.585
ConnectionTest-compression 13 0 1 0 89.403
ForwardingInfoTest-compression 2 0 0 0 0.330
FramingTest-compression 5 0 0 0 22.466
HandshakeTest-compression 13 0 0 0 2.227
ManyToOneConcurrentLinkedQueueTest- 22 0 0 0 1.857
compression
MessageSerializationPropertyTest- 2 0 0 0 5.894
compression
MessageTest-compression 7 0 0 0 1.387
MessagingServiceTest-compression 14 0 0 0 2.363
MockMessagingServiceTest-compression 1 0 0 0 3.234
OutboundConnectionSettingsTest- 9 0 0 0 1.981
compression
OutboundConnectionsTest-compression 6 0 0 0 2.112
OutboundMessageQueueTest-compression 3 0 0 0 1.011
ProxyHandlerConnectionsTest-compression 5 0 0 0 35.954
PrunableArrayQueueTest-compression 9 0 0 0 0.190
ResourceLimitsTest-compression 4 0 0 0 0.234
StartupClusterConnectivityCheckerTest- 7 0 0 0 1.282
compression
VerbTest-compression 1 0 0 0 0.222
WriteCallbackInfoTest-compression 1 0 0 0 1.601
AsyncChannelPromiseTest 4 0 0 0 0.459
AsyncMessageOutputPlusTest 1 0 0 0 0.983
AsyncOneResponseTest 2 0 0 0 4.363
AsyncPromiseTest 4 0 0 0 0.475
AsyncStreamingInputPlusTest 13 0 0 0 1.484
AsyncStreamingOutputPlusTest 3 0 0 0 1.004
ChunkedInputPlusTest 5 0 0 0 0.532
ConnectionTest 13 0 0 0 76.104
ForwardingInfoTest 2 0 0 0 0.270
FramingTest 5 0 0 0 23.966
HandshakeTest 13 0 0 0 2.339
ManyToOneConcurrentLinkedQueueTest 22 0 0 0 1.603
MessageSerializationPropertyTest 2 0 0 0 6.523
MessageTest 7 0 0 0 1.452
MessagingServiceTest 14 0 0 0 2.455
MockMessagingServiceTest 1 0 0 0 3.992
OutboundConnectionSettingsTest 9 0 0 0 2.422
OutboundConnectionsTest 6 0 0 0 2.759
OutboundMessageQueueTest 3 0 0 0 1.145
ProxyHandlerConnectionsTest 5 0 0 0 36.255
PrunableArrayQueueTest 9 0 0 0 0.076
ResourceLimitsTest 4 0 0 0 0.133
StartupClusterConnectivityCheckerTest 7 0 0 0 1.138
VerbTest 1 0 0 0 0.171
WriteCallbackInfoTest 1 0 0 0 1.628
AsyncChannelPromiseTest 4 0 0 0 0.583
AsyncMessageOutputPlusTest 1 0 0 0 1.216
AsyncOneResponseTest 2 0 0 0 4.356
AsyncPromiseTest 4 0 0 0 0.494
AsyncStreamingInputPlusTest 13 0 0 0 1.554
AsyncStreamingOutputPlusTest 3 0 0 0 1.162
ChunkedInputPlusTest 5 0 0 0 0.785
ConnectionTest 13 0 0 0 77.778
ForwardingInfoTest 2 0 0 0 0.377
FramingTest 5 0 0 0 24.676
HandshakeTest 13 0 0 0 3.917
ManyToOneConcurrentLinkedQueueTest 22 0 0 0 1.765
MessageSerializationPropertyTest 2 0 0 0 7.245
MessageTest 7 0 0 0 1.780
MessagingServiceTest 14 0 0 0 3.221
MockMessagingServiceTest 1 0 0 0 4.173
OutboundConnectionSettingsTest 9 0 0 0 2.240
OutboundConnectionsTest 6 0 0 0 2.270
OutboundMessageQueueTest 3 0 0 0 1.073
ProxyHandlerConnectionsTest 5 0 0 0 36.348
PrunableArrayQueueTest 9 0 0 0 0.172
ResourceLimitsTest 4 0 0 0 0.250
StartupClusterConnectivityCheckerTest 7 0 0 0 1.240
VerbTest 1 0 0 0 0.214
WriteCallbackInfoTest 1 0 0 0 1.587
-------------------------------------------------------------------------------
org.apache.cassandra.net.proxy
Name Tests Errors Failures Skipped Time(s)
ProxyHandlerTest-cdc 3 0 0 0 0.914
ProxyHandlerTest-cdc 3 0 0 0 0.917
ProxyHandlerTest-compression 3 0 0 0 0.804
ProxyHandlerTest-compression 3 0 0 0 0.869
ProxyHandlerTest 3 0 0 0 0.858
ProxyHandlerTest 3 0 0 0 0.863
-------------------------------------------------------------------------------
org.apache.cassandra.repair
Name Tests Errors Failures Skipped Time(s)
AbstractRepairTest-cdc 1 0 0 1 0.080
LocalSyncTaskTest-cdc 6 0 0 0 5.563
NeighborsAndRangesTest-cdc 2 0 0 0 1.014
RepairJobTest-cdc 16 0 0 0 6.972
RepairSessionTest-cdc 1 0 0 0 1.475
StreamingRepairTaskTest-cdc 2 0 0 0 3.410
SymmetricRemoteSyncTaskTest-cdc 1 0 0 0 0.935
ValidatorTest-cdc 6 0 0 0 31.733
AbstractRepairTest-cdc 1 0 0 1 0.241
LocalSyncTaskTest-cdc 6 0 0 0 4.373
NeighborsAndRangesTest-cdc 2 0 0 0 1.067
RepairJobTest-cdc 16 0 0 0 4.316
RepairSessionTest-cdc 1 0 0 0 1.165
StreamingRepairTaskTest-cdc 2 0 0 0 3.312
SymmetricRemoteSyncTaskTest-cdc 1 0 0 0 1.217
ValidatorTest-cdc 6 0 0 0 30.907
AbstractRepairTest-compression 1 0 0 1 0.065
LocalSyncTaskTest-compression 6 0 0 0 4.620
NeighborsAndRangesTest-compression 2 0 0 0 0.890
RepairJobTest-compression 16 0 0 0 4.576
RepairSessionTest-compression 1 0 0 0 0.978
StreamingRepairTaskTest-compression 2 0 0 0 3.364
SymmetricRemoteSyncTaskTest-compression 1 0 0 0 0.935
ValidatorTest-compression 6 0 0 0 30.934
AbstractRepairTest-compression 1 0 0 1 0.159
LocalSyncTaskTest-compression 6 0 0 0 3.792
NeighborsAndRangesTest-compression 2 0 0 0 1.004
RepairJobTest-compression 16 0 0 0 4.141
RepairSessionTest-compression 1 0 0 0 1.131
StreamingRepairTaskTest-compression 2 0 0 0 2.891
SymmetricRemoteSyncTaskTest-compression 1 0 0 0 1.017
ValidatorTest-compression 6 0 0 0 26.880
AbstractRepairTest 1 0 0 1 0.088
LocalSyncTaskTest 6 0 0 0 6.034
NeighborsAndRangesTest 2 0 0 0 0.901
RepairJobTest 16 0 0 0 4.909
RepairSessionTest 1 0 0 0 0.993
StreamingRepairTaskTest 2 0 0 0 4.097
SymmetricRemoteSyncTaskTest 1 0 0 0 0.913
ValidatorTest 6 0 0 0 29.948
AbstractRepairTest 1 0 0 1 0.151
LocalSyncTaskTest 6 0 0 0 4.034
NeighborsAndRangesTest 2 0 0 0 1.151
RepairJobTest 16 0 0 0 4.807
RepairSessionTest 1 0 0 0 1.455
StreamingRepairTaskTest 2 0 0 0 3.179
SymmetricRemoteSyncTaskTest 1 0 0 0 1.105
ValidatorTest 6 0 0 0 30.049
-------------------------------------------------------------------------------
org.apache.cassandra.repair.asymmetric
Name Tests Errors Failures Skipped Time(s)
DifferenceHolderTest-cdc 2 0 0 0 0.371
RangeDenormalizerTest-cdc 3 0 0 0 0.327
ReduceHelperTest-cdc 5 0 0 0 0.397
StreamFromOptionsTest-cdc 3 0 0 0 0.165
DifferenceHolderTest-cdc 2 0 0 0 0.741
RangeDenormalizerTest-cdc 3 0 0 0 0.741
ReduceHelperTest-cdc 5 0 0 0 0.640
StreamFromOptionsTest-cdc 3 0 0 0 0.428
DifferenceHolderTest-compression 2 0 0 0 0.348
RangeDenormalizerTest-compression 3 0 0 0 0.268
ReduceHelperTest-compression 5 0 0 0 0.300
StreamFromOptionsTest-compression 3 0 0 0 0.121
DifferenceHolderTest-compression 2 0 0 0 0.394
RangeDenormalizerTest-compression 3 0 0 0 0.330
ReduceHelperTest-compression 5 0 0 0 0.346
StreamFromOptionsTest-compression 3 0 0 0 0.208
DifferenceHolderTest 2 0 0 0 0.367
RangeDenormalizerTest 3 0 0 0 0.295
ReduceHelperTest 5 0 0 0 0.346
StreamFromOptionsTest 3 0 0 0 0.136
DifferenceHolderTest 2 0 0 0 0.548
RangeDenormalizerTest 3 0 0 0 0.402
ReduceHelperTest 5 0 0 0 0.512
StreamFromOptionsTest 3 0 0 0 0.230
-------------------------------------------------------------------------------
org.apache.cassandra.repair.consistent
Name Tests Errors Failures Skipped Time(s)
AbstractConsistentSessionTest-cdc 1 0 0 1 0.073
CoordinatorMessagingTest-cdc 7 0 0 0 6.111
CoordinatorSessionTest-cdc 7 0 0 0 1.176
CoordinatorSessionsTest-cdc 7 0 0 0 3.804
LocalSessionTest-cdc 40 0 0 0 5.315
PendingRepairStatTest-cdc 1 0 0 0 4.186
RepairStateTest-cdc 6 0 0 0 0.137
AbstractConsistentSessionTest-cdc 1 0 0 1 0.359
CoordinatorMessagingTest-cdc 7 0 0 0 6.476
CoordinatorSessionTest-cdc 7 0 0 0 1.565
CoordinatorSessionsTest-cdc 7 0 0 0 3.442
LocalSessionTest-cdc 40 0 0 0 5.246
PendingRepairStatTest-cdc 1 0 0 0 3.636
RepairStateTest-cdc 6 0 0 0 0.264
AbstractConsistentSessionTest-compression 1 0 0 1 0.058
CoordinatorMessagingTest-compression 7 0 0 0 6.450
CoordinatorSessionTest-compression 7 0 0 0 1.014
CoordinatorSessionsTest-compression 7 0 0 0 3.315
LocalSessionTest-compression 40 0 0 0 4.611
PendingRepairStatTest-compression 1 0 0 0 3.406
RepairStateTest-compression 6 0 0 0 0.121
AbstractConsistentSessionTest-compression 1 0 0 1 0.148
CoordinatorMessagingTest-compression 7 0 0 0 5.352
CoordinatorSessionTest-compression 7 0 0 0 1.098
CoordinatorSessionsTest-compression 7 0 0 0 2.701
LocalSessionTest-compression 40 0 0 0 5.009
PendingRepairStatTest-compression 1 0 0 0 2.982
RepairStateTest-compression 6 0 0 0 0.185
AbstractConsistentSessionTest 1 0 0 1 0.072
CoordinatorMessagingTest 7 0 0 0 7.499
CoordinatorSessionTest 7 0 0 0 1.065
CoordinatorSessionsTest 7 0 0 0 3.349
LocalSessionTest 40 0 0 0 6.045
PendingRepairStatTest 1 0 0 0 4.007
RepairStateTest 6 0 0 0 0.172
AbstractConsistentSessionTest 1 0 0 1 0.162
CoordinatorMessagingTest 7 0 0 0 5.306
CoordinatorSessionTest 7 0 0 0 1.219
CoordinatorSessionsTest 7 0 0 0 2.809
LocalSessionTest 40 0 0 0 4.852
PendingRepairStatTest 1 0 0 0 3.192
RepairStateTest 6 0 0 0 0.196
-------------------------------------------------------------------------------
org.apache.cassandra.repair.consistent.admin
Name Tests Errors Failures Skipped Time(s)
SchemaArgsParserTest-cdc 5 0 0 0 3.381
SchemaArgsParserTest-cdc 5 0 0 0 3.510
SchemaArgsParserTest-compression 5 0 0 0 3.198
SchemaArgsParserTest-compression 5 0 0 0 2.684
SchemaArgsParserTest 5 0 0 0 3.460
SchemaArgsParserTest 5 0 0 0 2.884
-------------------------------------------------------------------------------
org.apache.cassandra.repair.messages
Name Tests Errors Failures Skipped Time(s)
RepairMessageSerializationsTest-cdc 8 0 0 0 0.958
RepairMessageSerializerTest-cdc 6 0 0 0 0.511
RepairOptionTest-cdc 4 0 0 0 0.898
RepairMessageSerializationsTest-cdc 8 0 0 0 1.428
RepairMessageSerializerTest-cdc 6 0 0 0 0.731
RepairOptionTest-cdc 4 0 0 0 1.283
RepairMessageSerializationsTest- 8 0 0 0 0.950
compression
RepairMessageSerializerTest-compression 6 0 0 0 0.480
RepairOptionTest-compression 4 0 0 0 0.876
RepairMessageSerializationsTest- 8 0 0 0 1.027
compression
RepairMessageSerializerTest-compression 6 0 0 0 0.550
RepairOptionTest-compression 4 0 0 0 1.045
RepairMessageSerializationsTest 8 0 0 0 1.024
RepairMessageSerializerTest 6 0 0 0 0.523
RepairOptionTest 4 0 0 0 0.873
RepairMessageSerializationsTest 8 0 0 0 1.191
RepairMessageSerializerTest 6 0 0 0 0.600
RepairOptionTest 4 0 0 0 1.029
-------------------------------------------------------------------------------
org.apache.cassandra.schema
Name Tests Errors Failures Skipped Time(s)
CreateTableValidationTest-cdc 1 0 0 0 3.855
IndexMetadataTest-cdc 3 0 0 0 0.238
MigrationManagerTest-cdc 17 0 0 0 10.500
SchemaKeyspaceTest-cdc 5 0 0 0 4.717
SchemaTest-cdc 1 0 0 0 2.900
TupleTypesRepresentationTest-cdc 2 0 0 1 1.123
ValidationTest-cdc 4 0 0 0 0.376
CreateTableValidationTest-cdc 1 0 0 0 3.709
IndexMetadataTest-cdc 3 0 0 0 0.453
MigrationManagerTest-cdc 17 0 0 0 5.733
SchemaKeyspaceTest-cdc 5 0 0 0 3.790
SchemaTest-cdc 1 0 0 0 3.022
TupleTypesRepresentationTest-cdc 2 0 0 1 1.414
ValidationTest-cdc 4 0 0 0 0.480
CreateTableValidationTest-compression 1 0 0 0 3.416
IndexMetadataTest-compression 3 0 0 0 0.232
MigrationManagerTest-compression 17 0 0 0 5.571
SchemaKeyspaceTest-compression 5 0 0 0 3.671
SchemaTest-compression 1 0 0 0 2.405
TupleTypesRepresentationTest-compression 2 0 0 1 0.942
ValidationTest-compression 4 0 0 0 0.322
CreateTableValidationTest-compression 1 0 0 0 3.561
IndexMetadataTest-compression 3 0 0 0 0.394
MigrationManagerTest-compression 17 0 0 0 5.110
SchemaKeyspaceTest-compression 5 0 0 0 3.376
SchemaTest-compression 1 0 0 0 2.449
TupleTypesRepresentationTest-compression 2 0 0 1 0.966
ValidationTest-compression 4 0 0 0 0.348
CreateTableValidationTest 1 0 0 0 3.915
IndexMetadataTest 3 0 0 0 0.348
MigrationManagerTest 17 0 0 0 6.346
SchemaKeyspaceTest 5 0 0 0 4.529
SchemaTest 1 0 0 0 2.523
TupleTypesRepresentationTest 2 0 0 1 1.013
ValidationTest 4 0 0 0 0.325
CreateTableValidationTest 1 0 0 0 3.095
IndexMetadataTest 3 0 0 0 0.404
MigrationManagerTest 17 0 0 0 5.608
SchemaKeyspaceTest 5 0 0 0 3.366
SchemaTest 1 0 0 0 2.626
TupleTypesRepresentationTest 2 0 0 1 1.194
ValidationTest 4 0 0 0 0.496
-------------------------------------------------------------------------------
org.apache.cassandra.security
Name Tests Errors Failures Skipped Time(s)
CipherFactoryTest-cdc 7 0 0 0 0.644
EncryptionUtilsTest-cdc 3 0 0 0 1.360
JKSKeyProviderTest-cdc 2 0 0 0 0.381
SSLFactoryTest-cdc 14 0 0 0 1.687
CipherFactoryTest-cdc 7 0 0 0 0.753
EncryptionUtilsTest-cdc 3 0 0 0 1.626
JKSKeyProviderTest-cdc 2 0 0 0 0.496
SSLFactoryTest-cdc 14 0 0 0 1.989
CipherFactoryTest-compression 7 0 0 0 0.827
EncryptionUtilsTest-compression 3 0 0 0 1.514
JKSKeyProviderTest-compression 2 0 0 0 0.574
SSLFactoryTest-compression 14 0 0 0 1.639
CipherFactoryTest-compression 7 0 0 0 0.563
EncryptionUtilsTest-compression 3 0 0 0 1.227
JKSKeyProviderTest-compression 2 0 0 0 0.359
SSLFactoryTest-compression 14 0 0 0 1.964
CipherFactoryTest 7 0 0 0 0.626
EncryptionUtilsTest 3 0 0 0 1.452
JKSKeyProviderTest 2 0 0 0 0.337
SSLFactoryTest 14 0 0 0 1.435
CipherFactoryTest 7 0 0 0 0.727
EncryptionUtilsTest 3 0 0 0 1.745
JKSKeyProviderTest 2 0 0 0 0.671
SSLFactoryTest 14 0 0 0 2.339
-------------------------------------------------------------------------------
org.apache.cassandra.serializers
Name Tests Errors Failures Skipped Time(s)
SimpleDateSerializerTest-cdc 9 0 0 0 0.117
TimeSerializerTest-cdc 16 0 0 0 0.086
TimestampSerializerTest-cdc 8 0 0 0 0.304
SimpleDateSerializerTest-cdc 9 0 0 0 0.319
TimeSerializerTest-cdc 16 0 0 0 0.269
TimestampSerializerTest-cdc 8 0 0 0 0.649
SimpleDateSerializerTest-compression 9 0 0 0 0.134
TimeSerializerTest-compression 16 0 0 0 0.089
TimestampSerializerTest-compression 8 0 0 0 0.381
SimpleDateSerializerTest-compression 9 0 0 0 0.200
TimeSerializerTest-compression 16 0 0 0 0.175
TimestampSerializerTest-compression 8 0 0 0 0.392
SimpleDateSerializerTest 9 0 0 0 0.117
TimeSerializerTest 16 0 0 0 0.086
TimestampSerializerTest 8 0 0 0 0.341
SimpleDateSerializerTest 9 0 0 0 0.218
TimeSerializerTest 16 0 0 0 0.180
TimestampSerializerTest 8 0 0 0 0.419
-------------------------------------------------------------------------------
org.apache.cassandra.service
Name Tests Errors Failures Skipped Time(s)
ActiveRepairServiceTest-cdc 11 0 0 0 4.134
BootstrapTransientTest-cdc 1 0 0 0 1.055
ClientWarningsTest-cdc 4 0 0 0 30.071
GCInspectorTest-cdc 6 0 0 0 0.864
JoinTokenRingTest-cdc 1 0 0 0 5.513
LeaveAndBootstrapTest-cdc 8 0 0 0 5.774
LegacyAuthFailTest-cdc 1 0 0 0 5.874
MoveTest-cdc 7 0 0 0 23.194
MoveTransientTest-cdc 19 0 0 0 1.424
NativeTransportServiceTest-cdc 11 0 0 0 8.107
OptionalTasksTest-cdc 2 0 0 0 4.743
PaxosStateTest-cdc 2 0 0 0 5.172
ProtocolBetaVersionTest-cdc 2 0 0 0 13.422
QueryPagerTest-cdc 8 0 0 0 3.848
RMIServerSocketFactoryImplTest-cdc 1 0 0 0 0.087
RemoveTest-cdc 4 0 0 0 6.230
SerializationsTest-cdc 4 0 0 0 0.987
StartupChecksTest-cdc 3 0 0 0 2.765
StorageProxyTest-cdc 4 0 0 0 0.991
StorageServiceServerTest-cdc 19 0 0 1 8.663
StorageServiceTest-cdc 1 0 0 0 0.970
WriteResponseHandlerTest-cdc 5 0 0 0 4.733
WriteResponseHandlerTransientTest-cdc 4 0 0 0 3.802
ActiveRepairServiceTest-cdc 11 0 0 0 4.128
BootstrapTransientTest-cdc 1 0 0 0 1.084
ClientWarningsTest-cdc 4 0 0 0 28.854
GCInspectorTest-cdc 6 0 0 0 1.285
JoinTokenRingTest-cdc 1 0 0 0 6.004
LeaveAndBootstrapTest-cdc 8 0 0 0 7.441
LegacyAuthFailTest-cdc 1 0 0 0 4.189
MoveTest-cdc 7 0 0 0 22.574
MoveTransientTest-cdc 19 0 0 0 1.650
NativeTransportServiceTest-cdc 11 0 0 0 8.674
OptionalTasksTest-cdc 2 0 0 0 3.663
PaxosStateTest-cdc 2 0 0 0 5.493
ProtocolBetaVersionTest-cdc 2 0 0 0 13.763
QueryPagerTest-cdc 8 0 0 0 3.940
RMIServerSocketFactoryImplTest-cdc 1 0 0 0 0.278
RemoveTest-cdc 4 0 0 0 6.854
SerializationsTest-cdc 4 0 0 0 1.417
StartupChecksTest-cdc 3 0 0 0 3.092
StorageProxyTest-cdc 4 0 0 0 1.524
StorageServiceServerTest-cdc 19 0 0 1 9.076
StorageServiceTest-cdc 1 0 0 0 1.316
WriteResponseHandlerTest-cdc 5 0 0 0 3.470
WriteResponseHandlerTransientTest-cdc 4 0 0 0 3.597
ActiveRepairServiceTest-compression 11 0 0 0 4.466
BootstrapTransientTest-compression 1 0 0 0 1.043
ClientWarningsTest-compression 4 0 0 0 34.492
GCInspectorTest-compression 6 0 0 0 0.989
JoinTokenRingTest-compression 1 0 0 0 6.980
LeaveAndBootstrapTest-compression 8 0 0 0 8.120
LegacyAuthFailTest-compression 1 0 0 0 5.329
MoveTest-compression 7 0 0 0 24.775
MoveTransientTest-compression 19 0 0 0 1.337
NativeTransportServiceTest-compression 11 0 0 0 8.007
OptionalTasksTest-compression 2 0 0 0 3.487
PaxosStateTest-compression 2 0 0 0 7.640
ProtocolBetaVersionTest-compression 2 0 0 0 13.361
QueryPagerTest-compression 8 0 0 0 3.634
RMIServerSocketFactoryImplTest- 1 0 0 0 0.091
compression
RemoveTest-compression 4 0 0 0 6.261
SerializationsTest-compression 4 0 0 0 1.027
StartupChecksTest-compression 3 0 0 0 2.978
StorageProxyTest-compression 4 0 0 0 0.997
StorageServiceServerTest-compression 19 0 0 1 8.710
StorageServiceTest-compression 1 0 0 0 1.032
WriteResponseHandlerTest-compression 5 0 0 0 4.028
WriteResponseHandlerTransientTest- 4 0 0 0 3.417
compression
ActiveRepairServiceTest-compression 11 0 0 0 3.265
BootstrapTransientTest-compression 1 0 0 0 1.019
ClientWarningsTest-compression 4 0 0 0 23.994
GCInspectorTest-compression 6 0 0 0 0.942
JoinTokenRingTest-compression 1 0 0 0 5.276
LeaveAndBootstrapTest-compression 8 0 0 0 6.663
LegacyAuthFailTest-compression 1 0 0 0 4.730
MoveTest-compression 7 0 0 0 23.108
MoveTransientTest-compression 19 0 0 0 1.417
NativeTransportServiceTest-compression 11 0 0 0 7.913
OptionalTasksTest-compression 2 0 0 0 2.752
PaxosStateTest-compression 2 0 0 0 5.477
ProtocolBetaVersionTest-compression 2 0 0 0 11.978
QueryPagerTest-compression 8 0 0 0 3.046
RMIServerSocketFactoryImplTest- 1 0 0 0 0.144
compression
RemoveTest-compression 4 0 0 0 5.672
SerializationsTest-compression 4 0 0 0 0.978
StartupChecksTest-compression 3 0 0 0 2.350
StorageProxyTest-compression 4 0 0 0 1.127
StorageServiceServerTest-compression 19 0 0 1 8.234
StorageServiceTest-compression 1 0 0 0 1.078
WriteResponseHandlerTest-compression 5 0 0 0 2.859
WriteResponseHandlerTransientTest- 4 0 0 0 2.918
compression
ActiveRepairServiceTest 11 0 0 0 4.735
BootstrapTransientTest 1 0 0 0 0.995
ClientWarningsTest 4 0 0 0 31.893
GCInspectorTest 6 0 0 0 0.952
JoinTokenRingTest 1 0 0 0 7.145
LeaveAndBootstrapTest 8 0 0 0 5.469
LegacyAuthFailTest 1 0 0 0 5.495
MoveTest 7 0 0 0 22.583
MoveTransientTest 19 0 0 0 1.227
NativeTransportServiceTest 11 0 0 0 7.845
OptionalTasksTest 2 0 0 0 3.930
PaxosStateTest 2 0 0 0 5.184
ProtocolBetaVersionTest 2 0 0 0 13.049
QueryPagerTest 8 0 0 0 4.161
RMIServerSocketFactoryImplTest 1 0 0 0 0.074
RemoveTest 4 0 0 0 6.319
SerializationsTest 4 0 0 0 1.163
StartupChecksTest 3 0 0 0 3.649
StorageProxyTest 4 0 0 0 1.394
StorageServiceServerTest 19 0 0 1 9.897
StorageServiceTest 1 0 0 0 1.212
WriteResponseHandlerTest 5 0 0 0 4.393
WriteResponseHandlerTransientTest 4 0 0 0 4.387
ActiveRepairServiceTest 11 0 0 0 3.362
BootstrapTransientTest 1 0 0 0 1.147
ClientWarningsTest 4 0 0 0 29.165
GCInspectorTest 6 0 0 0 1.222
JoinTokenRingTest 1 0 0 0 4.990
LeaveAndBootstrapTest 8 0 0 0 6.001
LegacyAuthFailTest 1 0 0 0 4.563
MoveTest 7 0 0 0 22.695
MoveTransientTest 19 0 0 0 1.592
NativeTransportServiceTest 11 0 0 0 8.048
OptionalTasksTest 2 0 0 0 3.063
PaxosStateTest 2 0 0 0 4.697
ProtocolBetaVersionTest 2 0 0 0 12.467
QueryPagerTest 8 0 0 0 3.672
RMIServerSocketFactoryImplTest 1 0 0 0 0.199
RemoveTest 4 0 0 0 5.789
SerializationsTest 4 0 0 0 1.055
StartupChecksTest 3 0 0 0 2.624
StorageProxyTest 4 0 0 0 1.419
StorageServiceServerTest 19 0 0 1 8.907
StorageServiceTest 1 0 0 0 1.093
WriteResponseHandlerTest 5 0 0 0 2.970
WriteResponseHandlerTransientTest 4 0 0 0 3.362
-------------------------------------------------------------------------------
org.apache.cassandra.service.pager
Name Tests Errors Failures Skipped Time(s)
PagingStateTest-cdc 7 0 0 0 1.121
PagingStateTest-cdc 7 0 0 0 1.518
PagingStateTest-compression 7 0 0 0 1.035
PagingStateTest-compression 7 0 0 0 1.121
PagingStateTest 7 0 0 0 1.231
PagingStateTest 7 0 0 0 1.863
-------------------------------------------------------------------------------
org.apache.cassandra.service.reads
Name Tests Errors Failures Skipped Time(s)
AbstractReadResponseTest-cdc 1 0 0 1 0.079
DataResolverTest-cdc 32 0 0 0 4.610
DigestResolverTest-cdc 5 0 0 0 4.662
ReadExecutorTest-cdc 3 0 0 0 4.448
SpeculativeRetryParseTest-cdc 78 0 0 0 0.151
AbstractReadResponseTest-cdc 1 0 0 1 0.265
DataResolverTest-cdc 32 0 0 0 3.625
DigestResolverTest-cdc 5 0 0 0 2.943
ReadExecutorTest-cdc 3 0 0 0 3.052
SpeculativeRetryParseTest-cdc 78 0 0 0 0.220
AbstractReadResponseTest-compression 1 0 0 1 0.062
DataResolverTest-compression 32 0 0 0 3.797
DigestResolverTest-compression 5 0 0 0 3.601
ReadExecutorTest-compression 3 0 0 0 3.869
SpeculativeRetryParseTest-compression 78 0 0 0 0.128
AbstractReadResponseTest-compression 1 0 0 1 0.146
DataResolverTest-compression 32 0 0 0 3.041
DigestResolverTest-compression 5 0 0 0 2.842
ReadExecutorTest-compression 3 0 0 0 2.925
SpeculativeRetryParseTest-compression 78 0 0 0 0.189
AbstractReadResponseTest 1 0 0 1 0.071
DataResolverTest 32 0 0 0 4.888
DigestResolverTest 5 0 0 0 4.886
ReadExecutorTest 3 0 0 0 4.262
SpeculativeRetryParseTest 78 0 0 0 0.158
AbstractReadResponseTest 1 0 0 1 0.214
DataResolverTest 32 0 0 0 5.367
DigestResolverTest 5 0 0 0 3.050
ReadExecutorTest 3 0 0 0 3.020
SpeculativeRetryParseTest 78 0 0 0 0.235
-------------------------------------------------------------------------------
org.apache.cassandra.service.reads.repair
Name Tests Errors Failures Skipped Time(s)
AbstractReadRepairTest-cdc 1 0 0 1 0.084
BlockingReadRepairTest-cdc 9 0 0 0 3.783
DiagEventsBlockingReadRepairTest-cdc 3 0 0 0 3.813
ReadOnlyReadRepairTest-cdc 4 0 0 0 3.572
ReadRepairTest-cdc 7 0 0 0 3.668
RepairedDataVerifierTest-cdc 10 0 0 0 5.045
AbstractReadRepairTest-cdc 1 0 0 1 0.172
BlockingReadRepairTest-cdc 9 0 0 0 3.773
DiagEventsBlockingReadRepairTest-cdc 3 0 0 0 3.438
ReadOnlyReadRepairTest-cdc 4 0 0 0 3.322
ReadRepairTest-cdc 7 0 0 0 3.007
RepairedDataVerifierTest-cdc 10 0 0 0 5.408
AbstractReadRepairTest-compression 1 0 0 1 0.070
BlockingReadRepairTest-compression 9 0 0 0 3.700
DiagEventsBlockingReadRepairTest- 3 0 0 0 4.105
compression
ReadOnlyReadRepairTest-compression 4 0 0 0 3.714
ReadRepairTest-compression 7 0 0 0 3.991
RepairedDataVerifierTest-compression 10 0 0 0 7.035
AbstractReadRepairTest-compression 1 0 0 1 0.150
BlockingReadRepairTest-compression 9 0 0 0 2.834
DiagEventsBlockingReadRepairTest- 3 0 0 0 2.909
compression
ReadOnlyReadRepairTest-compression 4 0 0 0 2.775
ReadRepairTest-compression 7 0 0 0 3.127
RepairedDataVerifierTest-compression 10 0 0 0 5.171
AbstractReadRepairTest 1 0 0 1 0.075
BlockingReadRepairTest 9 0 0 0 3.756
DiagEventsBlockingReadRepairTest 3 0 0 0 3.862
ReadOnlyReadRepairTest 4 0 0 0 3.569
ReadRepairTest 7 0 0 0 3.736
RepairedDataVerifierTest 10 0 0 0 5.097
AbstractReadRepairTest 1 0 0 1 0.163
BlockingReadRepairTest 9 0 0 0 3.284
DiagEventsBlockingReadRepairTest 3 0 0 0 3.101
ReadOnlyReadRepairTest 4 0 0 0 4.478
ReadRepairTest 7 0 0 0 5.455
RepairedDataVerifierTest 10 0 0 0 6.389
-------------------------------------------------------------------------------
org.apache.cassandra.streaming
Name Tests Errors Failures Skipped Time
(s)
LongStreamingTest 0 1 0 0 0.909
LongStreamingTest 0 1 0 0 1.051
EntireSSTableStreamingCorrectFilesCountTest- 1 0 0 0 4.256
cdc
SessionInfoTest-cdc 1 0 0 0 0.614
StreamOperationTest-cdc 1 0 0 0 0.077
StreamTransferTaskTest-cdc 2 0 0 0 4.034
StreamingTransferTest-cdc 5 0 0 0 15.057
EntireSSTableStreamingCorrectFilesCountTest- 1 0 0 0 3.487
cdc
SessionInfoTest-cdc 1 0 0 0 0.597
StreamOperationTest-cdc 1 0 0 0 0.184
StreamTransferTaskTest-cdc 2 0 0 0 3.378
StreamingTransferTest-cdc 5 0 0 0 13.827
EntireSSTableStreamingCorrectFilesCountTest- 1 0 0 0 5.338
compression
SessionInfoTest-compression 1 0 0 0 0.726
StreamOperationTest-compression 1 0 0 0 0.084
StreamTransferTaskTest-compression 2 0 0 0 3.445
StreamingTransferTest-compression 5 0 0 0 14.172
EntireSSTableStreamingCorrectFilesCountTest- 1 0 0 0 2.865
compression
SessionInfoTest-compression 1 0 0 0 0.507
StreamOperationTest-compression 1 0 0 0 0.145
StreamTransferTaskTest-compression 2 0 0 0 2.808
StreamingTransferTest-compression 5 0 0 0 13.455
EntireSSTableStreamingCorrectFilesCountTest 1 0 0 0 4.380
SessionInfoTest 1 0 0 0 0.596
StreamOperationTest 1 0 0 0 0.068
StreamTransferTaskTest 2 0 0 0 3.450
StreamingTransferTest 5 0 0 0 13.718
EntireSSTableStreamingCorrectFilesCountTest 1 0 0 0 4.317
SessionInfoTest 1 0 0 0 0.673
StreamOperationTest 1 0 0 0 0.375
StreamTransferTaskTest 2 0 0 0 5.871
StreamingTransferTest 5 0 0 0 14.692
-------------------------------------------------------------------------------
org.apache.cassandra.streaming.async
Name Tests Errors Failures Skipped Time(s)
NettyStreamingMessageSenderTest-cdc 10 0 0 0 1.293
StreamCompressionSerializerTest-cdc 2 0 0 0 1.156
StreamingInboundHandlerTest-cdc 6 0 0 0 1.279
NettyStreamingMessageSenderTest-cdc 10 0 0 0 1.393
StreamCompressionSerializerTest-cdc 2 0 0 0 1.368
StreamingInboundHandlerTest-cdc 6 0 0 0 1.460
NettyStreamingMessageSenderTest- 10 0 0 0 1.114
compression
StreamCompressionSerializerTest- 2 0 0 0 0.885
compression
StreamingInboundHandlerTest-compression 6 0 0 0 1.041
NettyStreamingMessageSenderTest- 10 0 0 0 1.101
compression
StreamCompressionSerializerTest- 2 0 0 0 0.945
compression
StreamingInboundHandlerTest-compression 6 0 0 0 1.097
NettyStreamingMessageSenderTest 10 0 0 0 1.275
StreamCompressionSerializerTest 2 0 0 0 1.082
StreamingInboundHandlerTest 6 0 0 0 1.163
NettyStreamingMessageSenderTest 10 0 0 0 1.219
StreamCompressionSerializerTest 2 0 0 0 1.035
StreamingInboundHandlerTest 6 0 0 0 1.184
-------------------------------------------------------------------------------
org.apache.cassandra.streaming.compression
Name Tests Errors Failures Skipped Time(s)
CompressedInputStreamTest-cdc 6 0 0 0 1.643
CompressedInputStreamTest-cdc 6 0 0 0 1.374
CompressedInputStreamTest-compression 6 0 0 0 1.069
CompressedInputStreamTest-compression 6 0 0 0 1.207
CompressedInputStreamTest 6 0 0 0 1.188
CompressedInputStreamTest 6 0 0 0 1.564
-------------------------------------------------------------------------------
org.apache.cassandra.streaming.messages
Name Tests Errors Failures Skipped Time(s)
StreamMessageTest-cdc 1 0 0 0 0.130
StreamMessageTest-cdc 1 0 0 0 0.208
StreamMessageTest-compression 1 0 0 0 0.090
StreamMessageTest-compression 1 0 0 0 0.163
StreamMessageTest 1 0 0 0 0.102
StreamMessageTest 1 0 0 0 0.239
-------------------------------------------------------------------------------
org.apache.cassandra.stress.generate
Name Tests Errors Failures Skipped Time(s)
DistributionGaussianTest 2 0 0 0 0.117
DistributionSequenceTest 4 0 0 0 0.075
DistributionGaussianTest 2 0 0 0 0.217
DistributionSequenceTest 4 0 0 0 0.158
-------------------------------------------------------------------------------
org.apache.cassandra.stress.settings
Name Tests Errors Failures Skipped Time(s)
OptionReplicationTest 1 0 0 0 0.092
SettingsMiscTest 4 0 0 0 0.090
SettingsNodeTest 2 0 0 0 0.068
StressSettingsTest 1 0 0 0 0.559
OptionReplicationTest 1 0 0 0 0.203
SettingsMiscTest 4 0 0 0 0.194
SettingsNodeTest 2 0 0 0 0.148
StressSettingsTest 1 0 0 0 0.659
-------------------------------------------------------------------------------
org.apache.cassandra.stress.util
Name Tests Errors Failures Skipped Time(s)
MultiResultLoggerTest 5 0 0 0 0.069
MultiResultLoggerTest 5 0 0 0 0.166
-------------------------------------------------------------------------------
org.apache.cassandra.tools
Name Tests Errors Failures Skipped Time(s)
AuditLogViewerTest-cdc 10 0 0 0 15.567
BulkLoaderTest-cdc 6 0 0 0 12.973
ClearSnapshotTest-cdc 4 0 0 0 14.042
CompactionStressTest-cdc 2 0 0 0 15.344
GetFullQueryLogTest-cdc 3 0 0 0 15.235
GetVersionTest-cdc 1 0 0 0 0.448
JMXCompatabilityTest-cdc 3 0 0 0 31.990
JMXToolTest-cdc 5 0 0 0 12.186
LoaderOptionsTest-cdc 1 0 0 0 0.683
NodeToolGossipInfoTest-cdc 2 0 0 0 16.437
NodeToolTPStatsTest-cdc 3 0 0 0 27.240
NodetoolNetStatsTest-cdc 3 0 0 0 8.161
SSTableExpiredBlockersTest-cdc 4 0 0 0 2.642
SSTableExportTest-cdc 10 0 0 0 1.450
SSTableLevelResetterTest-cdc 5 0 0 0 2.444
SSTableMetadataViewerTest-cdc 10 0 0 0 1.359
SSTableOfflineRelevelTest-cdc 4 0 0 0 2.467
SSTableRepairedAtSetterTest-cdc 6 0 0 0 1.155
StandaloneSSTableUtilTest-cdc 8 0 0 0 2.502
StandaloneScrubberTest-cdc 7 0 0 0 2.614
StandaloneSplitterTest-cdc 6 0 0 0 2.461
StandaloneSplitterWithCQLTesterTest-cdc 6 0 0 0 15.070
StandaloneUpgraderOnSStablesTest-cdc 3 0 0 0 6.238
StandaloneUpgraderTest-cdc 6 0 0 0 2.503
StandaloneVerifierTest-cdc 10 0 0 0 2.750
ToolsEnvsConfigsTest-cdc 1 0 0 0 2.327
TopPartitionsTest-cdc 2 0 0 0 4.270
AuditLogViewerTest-cdc 10 0 0 0 15.834
BulkLoaderTest-cdc 6 0 0 0 12.758
ClearSnapshotTest-cdc 4 0 0 0 19.587
CompactionStressTest-cdc 2 0 0 0 14.352
GetFullQueryLogTest-cdc 3 0 0 0 20.532
GetVersionTest-cdc 1 0 0 0 0.480
JMXCompatabilityTest-cdc 3 0 0 0 37.123
JMXToolTest-cdc 5 0 0 0 14.434
LoaderOptionsTest-cdc 1 0 0 0 0.665
NodeToolGossipInfoTest-cdc 2 0 0 0 15.799
NodeToolTPStatsTest-cdc 3 0 0 0 25.733
NodetoolNetStatsTest-cdc 3 0 0 0 6.742
SSTableExpiredBlockersTest-cdc 4 0 0 0 2.519
SSTableExportTest-cdc 10 0 0 0 1.440
SSTableLevelResetterTest-cdc 5 0 0 0 2.278
SSTableMetadataViewerTest-cdc 10 0 0 0 1.597
SSTableOfflineRelevelTest-cdc 4 0 0 0 1.912
SSTableRepairedAtSetterTest-cdc 6 0 0 0 1.117
StandaloneSSTableUtilTest-cdc 8 0 0 0 2.036
StandaloneScrubberTest-cdc 7 0 0 0 2.096
StandaloneSplitterTest-cdc 6 0 0 0 1.837
StandaloneSplitterWithCQLTesterTest-cdc 6 0 0 0 14.717
StandaloneUpgraderOnSStablesTest-cdc 3 0 0 0 5.229
StandaloneUpgraderTest-cdc 6 0 0 0 2.015
StandaloneVerifierTest-cdc 10 0 0 0 2.114
ToolsEnvsConfigsTest-cdc 1 0 0 0 2.336
TopPartitionsTest-cdc 2 0 0 0 3.512
AuditLogViewerTest-compression 10 0 0 0 15.420
BulkLoaderTest-compression 6 0 0 0 12.912
ClearSnapshotTest-compression 4 0 0 0 12.913
CompactionStressTest-compression 2 0 0 0 14.763
GetFullQueryLogTest-compression 3 0 0 0 14.336
GetVersionTest-compression 1 0 0 0 0.453
JMXCompatabilityTest-compression 3 0 0 0 33.316
JMXToolTest-compression 5 0 0 0 13.610
LoaderOptionsTest-compression 1 0 0 0 0.705
NodeToolGossipInfoTest-compression 2 0 0 0 19.985
NodeToolTPStatsTest-compression 3 0 0 0 28.783
NodetoolNetStatsTest-compression 3 0 0 0 6.949
SSTableExpiredBlockersTest-compression 4 0 0 0 2.663
SSTableExportTest-compression 10 0 0 0 1.659
SSTableLevelResetterTest-compression 5 0 0 0 2.581
SSTableMetadataViewerTest-compression 10 0 0 0 1.315
SSTableOfflineRelevelTest-compression 4 0 0 0 2.328
SSTableRepairedAtSetterTest-compression 6 0 0 0 1.127
StandaloneSSTableUtilTest-compression 8 0 0 0 2.518
StandaloneScrubberTest-compression 7 0 0 0 2.776
StandaloneSplitterTest-compression 6 0 0 0 2.797
StandaloneSplitterWithCQLTesterTest- 6 0 0 0 17.392
compression
StandaloneUpgraderOnSStablesTest- 3 0 0 0 5.655
compression
StandaloneUpgraderTest-compression 6 0 0 0 2.768
StandaloneVerifierTest-compression 10 0 0 0 2.552
ToolsEnvsConfigsTest-compression 1 0 0 0 2.041
TopPartitionsTest-compression 2 0 0 0 3.718
AuditLogViewerTest-compression 10 0 0 0 15.202
BulkLoaderTest-compression 6 0 0 0 12.723
ClearSnapshotTest-compression 4 0 0 0 13.214
CompactionStressTest-compression 2 0 0 0 13.891
GetFullQueryLogTest-compression 3 0 0 0 14.533
GetVersionTest-compression 1 0 0 0 0.462
JMXCompatabilityTest-compression 3 0 0 0 31.226
JMXToolTest-compression 5 0 0 0 11.240
LoaderOptionsTest-compression 1 0 0 0 0.621
NodeToolGossipInfoTest-compression 2 0 0 0 15.601
NodeToolTPStatsTest-compression 3 0 0 0 23.503
NodetoolNetStatsTest-compression 3 0 0 0 5.873
SSTableExpiredBlockersTest-compression 4 0 0 0 1.844
SSTableExportTest-compression 10 0 0 0 1.233
SSTableLevelResetterTest-compression 5 0 0 0 1.830
SSTableMetadataViewerTest-compression 10 0 0 0 1.131
SSTableOfflineRelevelTest-compression 4 0 0 0 1.830
SSTableRepairedAtSetterTest-compression 6 0 0 0 1.084
StandaloneSSTableUtilTest-compression 8 0 0 0 1.945
StandaloneScrubberTest-compression 7 0 0 0 1.956
StandaloneSplitterTest-compression 6 0 0 0 1.835
StandaloneSplitterWithCQLTesterTest- 6 0 0 0 13.341
compression
StandaloneUpgraderOnSStablesTest- 3 0 0 0 5.068
compression
StandaloneUpgraderTest-compression 6 0 0 0 1.934
StandaloneVerifierTest-compression 10 0 0 0 1.988
ToolsEnvsConfigsTest-compression 1 0 0 0 2.174
TopPartitionsTest-compression 2 0 0 0 3.451
AuditLogViewerTest 10 0 0 0 14.765
BulkLoaderTest 6 0 0 0 12.860
ClearSnapshotTest 4 0 0 0 13.255
CompactionStressTest 2 0 0 0 14.954
GetFullQueryLogTest 3 0 0 0 14.549
GetVersionTest 1 0 0 0 0.414
JMXCompatabilityTest 3 0 0 0 31.614
JMXToolTest 5 0 0 0 11.133
LoaderOptionsTest 1 0 0 0 0.572
NodeToolGossipInfoTest 2 0 0 0 16.191
NodeToolTPStatsTest 3 0 0 0 31.040
NodetoolNetStatsTest 3 0 0 0 12.566
SSTableExpiredBlockersTest 4 0 0 0 3.156
SSTableExportTest 10 0 0 0 1.700
SSTableLevelResetterTest 5 0 0 0 2.746
SSTableMetadataViewerTest 10 0 0 0 1.577
SSTableOfflineRelevelTest 4 0 0 0 2.672
SSTableRepairedAtSetterTest 6 0 0 0 1.318
StandaloneSSTableUtilTest 8 0 0 0 2.760
StandaloneScrubberTest 7 0 0 0 2.694
StandaloneSplitterTest 6 0 0 0 2.476
StandaloneSplitterWithCQLTesterTest 6 0 0 0 15.328
StandaloneUpgraderOnSStablesTest 3 0 0 0 5.711
StandaloneUpgraderTest 6 0 0 0 2.466
StandaloneVerifierTest 10 0 0 0 2.551
ToolsEnvsConfigsTest 1 0 0 0 2.093
TopPartitionsTest 2 0 0 0 3.831
AuditLogViewerTest 10 0 0 0 15.299
BulkLoaderTest 6 0 0 0 12.548
ClearSnapshotTest 4 0 0 0 17.584
CompactionStressTest 2 0 0 0 16.111
GetFullQueryLogTest 3 0 0 0 21.635
GetVersionTest 1 0 0 0 0.658
JMXCompatabilityTest 3 0 0 0 35.908
JMXToolTest 5 0 0 0 12.120
LoaderOptionsTest 1 0 0 0 0.692
NodeToolGossipInfoTest 2 0 0 0 17.381
NodeToolTPStatsTest 3 0 0 0 32.704
NodetoolNetStatsTest 3 0 0 0 8.890
SSTableExpiredBlockersTest 4 0 0 0 2.045
SSTableExportTest 10 0 0 0 1.325
SSTableLevelResetterTest 5 0 0 0 2.039
SSTableMetadataViewerTest 10 0 0 0 1.400
SSTableOfflineRelevelTest 4 0 0 0 2.015
SSTableRepairedAtSetterTest 6 0 0 0 1.119
StandaloneSSTableUtilTest 8 0 0 0 1.931
StandaloneScrubberTest 7 0 0 0 2.052
StandaloneSplitterTest 6 0 0 0 2.188
StandaloneSplitterWithCQLTesterTest 6 0 0 0 15.841
StandaloneUpgraderOnSStablesTest 3 0 0 0 6.211
StandaloneUpgraderTest 6 0 0 0 2.238
StandaloneVerifierTest 10 0 0 0 2.337
ToolsEnvsConfigsTest 1 0 0 0 2.633
TopPartitionsTest 2 0 0 0 3.940
-------------------------------------------------------------------------------
org.apache.cassandra.tools.cassandrastress
Name Tests Errors Failures Skipped Time(s)
CassandrastressTest-cdc 1 0 0 0 14.302
CassandrastressTest-cdc 1 0 0 0 13.256
CassandrastressTest-compression 1 0 0 0 14.089
CassandrastressTest-compression 1 0 0 0 12.652
CassandrastressTest 1 0 0 0 13.148
CassandrastressTest 1 0 0 0 14.120
-------------------------------------------------------------------------------
org.apache.cassandra.tools.cqlsh
Name Tests Errors Failures Skipped Time(s)
CqlshTest-cdc 1 0 0 0 14.226
CqlshTest-cdc 1 0 0 0 14.967
CqlshTest-compression 1 0 0 0 13.103
CqlshTest-compression 1 0 0 0 12.214
CqlshTest 1 0 0 0 12.944
CqlshTest 1 0 0 0 12.580
-------------------------------------------------------------------------------
org.apache.cassandra.tools.nodetool
Name Tests Errors Failures Skipped Time(s)
SjkTest-cdc 1 0 0 0 2.591
SjkTest-cdc 1 0 0 0 3.194
SjkTest-compression 1 0 0 0 2.099
SjkTest-compression 1 0 0 0 2.169
SjkTest 1 0 0 0 2.121
SjkTest 1 0 0 0 2.816
-------------------------------------------------------------------------------
org.apache.cassandra.tools.nodetool.formatter
Name Tests Errors Failures Skipped Time(s)
TableBuilderTest-cdc 6 0 0 0 0.087
TableBuilderTest-cdc 6 0 0 0 0.262
TableBuilderTest-compression 6 0 0 0 0.076
TableBuilderTest-compression 6 0 0 0 0.154
TableBuilderTest 6 0 0 0 0.071
TableBuilderTest 6 0 0 0 0.243
-------------------------------------------------------------------------------
org.apache.cassandra.tools.nodetool.stats
Name Tests Errors Failures Skipped Time(s)
NodetoolTableStatsTest-cdc 6 0 0 0 30.016
StatsTableComparatorTest-cdc 6 0 0 0 0.292
TableStatsPrinterTest-cdc 2 0 0 0 0.128
NodetoolTableStatsTest-cdc 6 0 0 0 37.770
StatsTableComparatorTest-cdc 6 0 0 0 0.336
TableStatsPrinterTest-cdc 2 0 0 0 0.332
NodetoolTableStatsTest-compression 6 0 0 0 35.101
StatsTableComparatorTest-compression 6 0 0 0 0.310
TableStatsPrinterTest-compression 2 0 0 0 0.117
NodetoolTableStatsTest-compression 6 0 0 0 25.379
StatsTableComparatorTest-compression 6 0 0 0 0.315
TableStatsPrinterTest-compression 2 0 0 0 0.248
NodetoolTableStatsTest 6 0 0 0 27.869
StatsTableComparatorTest 6 0 0 0 0.331
TableStatsPrinterTest 2 0 0 0 0.099
NodetoolTableStatsTest 6 0 0 0 30.265
StatsTableComparatorTest 6 0 0 0 0.402
TableStatsPrinterTest 2 0 0 0 0.295
-------------------------------------------------------------------------------
org.apache.cassandra.tracing
Name Tests Errors Failures Skipped Time(s)
TracingTest-cdc 6 0 0 0 1.374
TracingTest-cdc 6 0 0 0 1.175
TracingTest-compression 6 0 0 0 1.206
TracingTest-compression 6 0 0 0 1.062
TracingTest 6 0 0 0 1.029
TracingTest 6 0 0 0 1.135
-------------------------------------------------------------------------------
org.apache.cassandra.transport
Name Tests Errors Failures Skipped Time(s)
CBUtilTest-cdc 4 0 0 0 0.523
CQLUserAuditTest-cdc 8 0 0 0 31.404
DataTypeTest-cdc 3 0 0 0 0.440
ErrorMessageTest-cdc 7 0 0 0 0.436
IdleDisconnectTest-cdc 2 0 0 0 18.116
InflightRequestPayloadTrackerTest-cdc 7 0 0 0 15.961
MessagePayloadTest-cdc 3 0 0 0 15.436
ProtocolErrorTest-cdc 6 0 0 0 1.187
ProtocolVersionTest-cdc 4 0 0 0 0.948
ProtocolVersionTrackerTest-cdc 3 0 0 0 0.346
SerDeserTest-cdc 6 0 0 0 1.769
StartupMessageTest-cdc 1 0 0 0 13.598
CBUtilTest-cdc 4 0 0 0 0.439
CQLUserAuditTest-cdc 8 0 0 0 28.112
DataTypeTest-cdc 3 0 0 0 0.637
ErrorMessageTest-cdc 7 0 0 0 0.513
IdleDisconnectTest-cdc 2 0 0 0 17.052
InflightRequestPayloadTrackerTest-cdc 7 0 0 0 14.745
MessagePayloadTest-cdc 3 0 0 0 13.040
ProtocolErrorTest-cdc 6 0 0 0 1.220
ProtocolVersionTest-cdc 4 0 0 0 1.021
ProtocolVersionTrackerTest-cdc 3 0 0 0 0.390
SerDeserTest-cdc 6 0 0 0 1.613
StartupMessageTest-cdc 1 0 0 0 12.267
CBUtilTest-compression 4 0 0 0 0.409
CQLUserAuditTest-compression 8 0 0 0 30.248
DataTypeTest-compression 3 0 0 0 0.448
ErrorMessageTest-compression 7 0 0 0 0.486
IdleDisconnectTest-compression 2 0 0 0 18.663
InflightRequestPayloadTrackerTest- 7 0 0 0 18.830
compression
MessagePayloadTest-compression 3 0 0 0 14.945
ProtocolErrorTest-compression 6 0 0 0 1.734
ProtocolVersionTest-compression 4 0 0 0 1.335
ProtocolVersionTrackerTest-compression 3 0 0 0 0.425
SerDeserTest-compression 6 0 0 0 2.136
StartupMessageTest-compression 1 0 0 0 12.732
CBUtilTest-compression 4 0 0 0 0.407
CQLUserAuditTest-compression 8 0 0 0 27.996
DataTypeTest-compression 3 0 0 0 0.465
ErrorMessageTest-compression 7 0 0 0 0.425
IdleDisconnectTest-compression 2 0 0 0 16.720
InflightRequestPayloadTrackerTest- 7 0 0 0 13.611
compression
MessagePayloadTest-compression 3 0 0 0 13.603
ProtocolErrorTest-compression 6 0 0 0 1.146
ProtocolVersionTest-compression 4 0 0 0 0.966
ProtocolVersionTrackerTest-compression 3 0 0 0 0.356
SerDeserTest-compression 6 0 0 0 1.531
StartupMessageTest-compression 1 0 0 0 11.814
CBUtilTest 4 0 0 0 0.371
CQLUserAuditTest 8 0 0 0 30.152
DataTypeTest 3 0 0 0 0.381
ErrorMessageTest 7 0 0 0 0.397
IdleDisconnectTest 2 0 0 0 18.926
InflightRequestPayloadTrackerTest 7 0 0 0 19.062
MessagePayloadTest 3 0 0 0 19.487
ProtocolErrorTest 6 0 0 0 1.174
ProtocolVersionTest 4 0 0 0 0.892
ProtocolVersionTrackerTest 3 0 0 0 0.321
SerDeserTest 6 0 0 0 1.679
StartupMessageTest 1 0 0 0 14.483
CBUtilTest 4 0 0 0 0.529
CQLUserAuditTest 8 0 0 0 28.817
DataTypeTest 3 0 0 0 0.678
ErrorMessageTest 7 0 0 0 0.592
IdleDisconnectTest 2 0 0 0 17.273
InflightRequestPayloadTrackerTest 7 0 0 0 15.247
MessagePayloadTest 3 0 0 0 13.344
ProtocolErrorTest 6 0 0 0 1.547
ProtocolVersionTest 4 0 0 0 1.077
ProtocolVersionTrackerTest 3 0 0 0 0.369
SerDeserTest 6 0 0 0 1.638
StartupMessageTest 1 0 0 0 12.936
-------------------------------------------------------------------------------
org.apache.cassandra.transport.frame.checksum
Name Tests Errors Failures Skipped Time
(s)
ChecksummingTransformerTest-cdc 5 0 0 0 18.946
ChecksummingWithCorruptedLZ4DoesNotCrashTest- 1 0 0 0 24.142
cdc
ChecksummingTransformerTest-cdc 5 0 1 0 13.844
ChecksummingWithCorruptedLZ4DoesNotCrashTest- 1 0 0 0 21.662
cdc
ChecksummingTransformerTest-compression 5 0 0 0 19.611
ChecksummingWithCorruptedLZ4DoesNotCrashTest- 1 0 0 0 23.625
compression
ChecksummingTransformerTest-compression 5 0 0 0 16.423
ChecksummingWithCorruptedLZ4DoesNotCrashTest- 1 0 0 0 21.860
compression
ChecksummingTransformerTest 5 0 0 0 19.166
ChecksummingWithCorruptedLZ4DoesNotCrashTest 1 0 0 0 23.414
ChecksummingTransformerTest 5 0 0 0 24.272
ChecksummingWithCorruptedLZ4DoesNotCrashTest 1 0 0 0 30.839
-------------------------------------------------------------------------------
org.apache.cassandra.transport.messages
Name Tests Errors Failures Skipped Time(s)
AuthenticateMessageTest-cdc 1 0 0 0 0.380
PrepareMessageTest-cdc 1 0 0 0 0.388
AuthenticateMessageTest-cdc 1 0 0 0 0.468
PrepareMessageTest-cdc 1 0 0 0 0.452
AuthenticateMessageTest-compression 1 0 0 0 0.364
PrepareMessageTest-compression 1 0 0 0 0.381
AuthenticateMessageTest-compression 1 0 0 0 0.452
PrepareMessageTest-compression 1 0 0 0 0.398
AuthenticateMessageTest 1 0 0 0 0.416
PrepareMessageTest 1 0 0 0 0.376
AuthenticateMessageTest 1 0 0 0 0.833
PrepareMessageTest 1 0 0 0 0.807
-------------------------------------------------------------------------------
org.apache.cassandra.triggers
Name Tests Errors Failures Skipped Time(s)
TriggerExecutorTest-cdc 9 0 0 0 1.877
TriggersSchemaTest-cdc 4 0 0 0 5.311
TriggersTest-cdc 7 0 0 0 5.675
TriggerExecutorTest-cdc 9 0 0 0 1.771
TriggersSchemaTest-cdc 4 0 0 0 3.427
TriggersTest-cdc 7 0 0 0 4.660
TriggerExecutorTest-compression 9 0 0 0 1.760
TriggersSchemaTest-compression 4 0 0 0 4.602
TriggersTest-compression 7 0 0 0 5.272
TriggerExecutorTest-compression 9 0 0 0 1.620
TriggersSchemaTest-compression 4 0 0 0 3.372
TriggersTest-compression 7 0 0 0 4.537
TriggerExecutorTest 9 0 0 0 1.562
TriggersSchemaTest 4 0 0 0 4.133
TriggersTest 7 0 0 0 6.860
TriggerExecutorTest 9 0 0 0 3.062
TriggersSchemaTest 4 0 0 0 6.432
TriggersTest 7 0 0 0 5.016
-------------------------------------------------------------------------------
org.apache.cassandra.utils
Name Tests Errors Failures Skipped Time(s)
LongBloomFilterTest 5 0 0 0 120.699
LongBloomFilterTest 5 0 0 0 126.511
LongBTreeTest 15 0 0 0 825.880
LongBTreeTest 15 0 0 0 724.476
AbstractIteratorTest-cdc 9 0 0 0 0.100
BloomFilterTest-cdc 11 0 0 2 0.646
ByteArrayUtilTest-cdc 18 0 0 0 0.286
ByteBufferUtilTest-cdc 12 0 0 0 0.449
BytesReadTrackerTest-cdc 4 0 0 0 0.070
CassandraVersionTest-cdc 11 0 0 0 0.632
EstimatedHistogramTest-cdc 7 0 0 0 0.227
FBUtilitiesTest-cdc 7 0 0 0 0.761
FastByteOperationsTest-cdc 2 0 0 0 3.715
GeneratorsTest-cdc 2 0 0 0 0.839
HexTest-cdc 2 0 0 0 0.252
HistogramBuilderTest-cdc 5 0 0 0 0.254
IntegerIntervalsTest-cdc 6 0 0 0 48.248
IntervalTreeTest-cdc 3 0 0 0 0.281
JVMStabilityInspectorTest-cdc 3 0 0 0 0.859
JavaUtilsTest-cdc 1 0 0 0 0.239
MergeIteratorComparisonTest-cdc 16 0 0 0 12.537
MergeIteratorTest-cdc 1 0 0 0 0.114
MerkleTreeTest-cdc 27 0 0 0 7.176
MerkleTreesTest-cdc 13 0 0 0 1.005
MonotonicClockTest-cdc 1 0 0 0 19.322
NativeLibraryTest-cdc 2 0 0 0 0.528
NoSpamLoggerTest-cdc 5 0 0 0 0.087
OverlapIteratorTest-cdc 1 0 0 0 13.520
SerializationsTest-cdc 3 0 0 0 2.022
SlidingTimeRateTest-cdc 7 0 0 0 0.830
StatusLoggerTest-cdc 1 0 0 0 5.058
AbstractIteratorTest-cdc 9 0 0 0 0.228
BloomFilterTest-cdc 11 0 0 2 0.912
ByteArrayUtilTest-cdc 18 0 0 0 0.406
ByteBufferUtilTest-cdc 12 0 0 0 0.533
BytesReadTrackerTest-cdc 4 0 0 0 0.196
CassandraVersionTest-cdc 11 0 0 0 0.860
EstimatedHistogramTest-cdc 7 0 0 0 0.560
FBUtilitiesTest-cdc 7 0 0 0 1.506
FastByteOperationsTest-cdc 2 0 0 0 6.657
GeneratorsTest-cdc 2 0 0 0 1.073
HexTest-cdc 2 0 0 0 0.358
HistogramBuilderTest-cdc 5 0 0 0 0.361
IntegerIntervalsTest-cdc 6 0 0 0 62.879
IntervalTreeTest-cdc 3 0 0 0 0.440
JVMStabilityInspectorTest-cdc 3 0 0 0 1.809
JavaUtilsTest-cdc 1 0 0 0 0.555
MergeIteratorComparisonTest-cdc 16 0 0 0 21.682
MergeIteratorTest-cdc 1 0 0 0 0.263
MerkleTreeTest-cdc 27 0 0 0 7.241
MerkleTreesTest-cdc 13 0 0 0 1.191
MonotonicClockTest-cdc 1 0 0 0 17.400
NativeLibraryTest-cdc 2 0 0 0 0.556
NoSpamLoggerTest-cdc 5 0 0 0 0.266
OverlapIteratorTest-cdc 1 0 0 0 12.581
SerializationsTest-cdc 3 0 0 0 1.866
SlidingTimeRateTest-cdc 7 0 0 0 0.621
StatusLoggerTest-cdc 1 0 0 0 3.925
AbstractIteratorTest-compression 9 0 0 0 0.198
BloomFilterTest-compression 11 0 0 2 0.986
ByteArrayUtilTest-compression 18 0 0 0 0.317
ByteBufferUtilTest-compression 12 0 0 0 0.498
BytesReadTrackerTest-compression 4 0 0 0 0.076
CassandraVersionTest-compression 11 0 0 0 0.602
EstimatedHistogramTest-compression 7 0 0 0 0.230
FBUtilitiesTest-compression 7 0 0 0 0.718
FastByteOperationsTest-compression 2 0 0 0 3.682
GeneratorsTest-compression 2 0 0 0 0.902
HexTest-compression 2 0 0 0 0.257
HistogramBuilderTest-compression 5 0 0 0 0.332
IntegerIntervalsTest-compression 6 0 0 0 60.053
IntervalTreeTest-compression 3 0 0 0 0.288
JVMStabilityInspectorTest-compression 3 0 0 0 0.815
JavaUtilsTest-compression 1 0 0 0 0.215
MergeIteratorComparisonTest-compression 16 0 0 0 13.932
MergeIteratorTest-compression 1 0 0 0 0.140
MerkleTreeTest-compression 27 0 0 0 7.419
MerkleTreesTest-compression 13 0 0 0 0.947
MonotonicClockTest-compression 1 0 0 0 19.369
NativeLibraryTest-compression 2 0 0 0 0.564
NoSpamLoggerTest-compression 5 0 0 0 0.082
OverlapIteratorTest-compression 1 0 0 0 12.315
SerializationsTest-compression 3 0 0 0 1.610
SlidingTimeRateTest-compression 7 0 0 0 0.579
StatusLoggerTest-compression 1 0 0 0 3.989
AbstractIteratorTest-compression 9 0 0 0 0.196
BloomFilterTest-compression 11 0 0 2 0.724
ByteArrayUtilTest-compression 18 0 0 0 0.295
ByteBufferUtilTest-compression 12 0 0 0 0.488
BytesReadTrackerTest-compression 4 0 0 0 0.153
CassandraVersionTest-compression 11 0 0 0 0.718
EstimatedHistogramTest-compression 7 0 0 0 0.294
FBUtilitiesTest-compression 7 0 0 0 0.949
FastByteOperationsTest-compression 2 0 0 0 4.406
GeneratorsTest-compression 2 0 0 0 0.988
HexTest-compression 2 0 0 0 0.355
HistogramBuilderTest-compression 5 0 0 0 0.365
IntegerIntervalsTest-compression 6 0 0 0 56.161
IntervalTreeTest-compression 3 0 0 0 0.323
JVMStabilityInspectorTest-compression 3 0 0 0 0.952
JavaUtilsTest-compression 1 0 0 0 0.295
MergeIteratorComparisonTest-compression 16 0 0 0 12.339
MergeIteratorTest-compression 1 0 0 0 0.175
MerkleTreeTest-compression 27 0 0 0 6.682
MerkleTreesTest-compression 13 0 0 0 1.031
MonotonicClockTest-compression 1 0 0 0 4.771
NativeLibraryTest-compression 2 0 0 0 0.491
NoSpamLoggerTest-compression 5 0 0 0 0.149
OverlapIteratorTest-compression 1 0 0 0 11.179
SerializationsTest-compression 3 0 0 0 1.545
SlidingTimeRateTest-compression 7 0 0 0 0.531
StatusLoggerTest-compression 1 0 0 0 2.924
AbstractIteratorTest 9 0 0 0 0.228
BloomFilterTest 11 0 0 2 0.765
ByteArrayUtilTest 18 0 0 0 0.290
ByteBufferUtilTest 12 0 0 0 0.418
BytesReadTrackerTest 4 0 0 0 0.073
CassandraVersionTest 11 0 0 0 0.586
EstimatedHistogramTest 7 0 0 0 0.229
FBUtilitiesTest 7 0 0 0 0.736
FastByteOperationsTest 2 0 0 0 4.303
GeneratorsTest 2 0 0 0 1.022
HexTest 2 0 0 0 0.242
HistogramBuilderTest 5 0 0 0 0.279
IntegerIntervalsTest 6 0 0 0 53.365
IntervalTreeTest 3 0 0 0 0.365
JVMStabilityInspectorTest 3 0 0 0 1.062
JavaUtilsTest 1 0 0 0 0.267
MergeIteratorComparisonTest 16 0 0 0 13.287
MergeIteratorTest 1 0 0 0 0.103
MerkleTreeTest 27 0 0 0 7.648
MerkleTreesTest 13 0 0 0 0.945
MonotonicClockTest 1 0 0 0 19.426
NativeLibraryTest 2 0 0 0 0.485
NoSpamLoggerTest 5 0 0 0 0.092
OverlapIteratorTest 1 0 0 0 12.232
SerializationsTest 3 0 0 0 1.530
SlidingTimeRateTest 7 0 0 0 0.588
StatusLoggerTest 1 0 0 0 4.467
AbstractIteratorTest 9 0 0 0 0.252
BloomFilterTest 11 0 0 2 0.886
ByteArrayUtilTest 18 0 0 0 0.317
ByteBufferUtilTest 12 0 0 0 0.481
BytesReadTrackerTest 4 0 0 0 0.148
CassandraVersionTest 11 0 0 0 0.782
EstimatedHistogramTest 7 0 0 0 0.381
FBUtilitiesTest 7 0 0 0 1.133
FastByteOperationsTest 2 0 0 0 6.198
GeneratorsTest 2 0 0 0 1.715
HexTest 2 0 0 0 0.635
HistogramBuilderTest 5 0 0 0 0.717
IntegerIntervalsTest 6 0 0 0 62.505
IntervalTreeTest 3 0 0 0 0.363
JVMStabilityInspectorTest 3 0 0 0 1.090
JavaUtilsTest 1 0 0 0 0.304
MergeIteratorComparisonTest 16 0 0 0 15.584
MergeIteratorTest 1 0 0 0 0.205
MerkleTreeTest 27 0 0 0 7.291
MerkleTreesTest 13 0 0 0 1.287
MonotonicClockTest 1 0 0 0 16.801
NativeLibraryTest 2 0 0 0 0.640
NoSpamLoggerTest 5 0 0 0 0.221
OverlapIteratorTest 1 0 0 0 12.544
SerializationsTest 3 0 0 0 2.199
SlidingTimeRateTest 7 0 0 0 0.709
StatusLoggerTest 1 0 0 0 3.499
-------------------------------------------------------------------------------
org.apache.cassandra.utils.binlog
Name Tests Errors Failures Skipped Time(s)
BinLogTest-cdc 13 0 0 0 11.613
DeletingArchiverTest-cdc 3 0 0 0 0.408
ExternalArchiverTest-cdc 5 0 0 0 10.593
BinLogTest-cdc 13 0 0 0 11.885
DeletingArchiverTest-cdc 3 0 0 0 0.442
ExternalArchiverTest-cdc 5 0 0 0 10.517
BinLogTest-compression 13 0 0 0 11.349
DeletingArchiverTest-compression 3 0 0 0 0.327
ExternalArchiverTest-compression 5 0 0 0 10.518
BinLogTest-compression 13 0 0 0 11.472
DeletingArchiverTest-compression 3 0 0 0 0.321
ExternalArchiverTest-compression 5 0 0 0 10.494
BinLogTest 13 0 0 0 11.621
DeletingArchiverTest 3 0 0 0 0.282
ExternalArchiverTest 5 0 0 0 10.582
BinLogTest 13 0 0 0 12.006
DeletingArchiverTest 3 0 0 0 0.373
ExternalArchiverTest 5 0 0 0 10.647
-------------------------------------------------------------------------------
org.apache.cassandra.utils.btree
Name Tests Errors Failures Skipped Time(s)
BTreeRemovalTest-cdc 22 0 0 0 0.206
BTreeSearchIteratorTest-cdc 4 0 0 0 0.084
BTreeTest-cdc 14 0 0 0 0.486
BTreeRemovalTest-cdc 22 0 0 0 0.350
BTreeSearchIteratorTest-cdc 4 0 0 0 0.221
BTreeTest-cdc 14 0 0 0 0.708
BTreeRemovalTest-compression 22 0 0 0 0.201
BTreeSearchIteratorTest-compression 4 0 0 0 0.087
BTreeTest-compression 14 0 0 0 0.536
BTreeRemovalTest-compression 22 0 0 0 0.282
BTreeSearchIteratorTest-compression 4 0 0 0 0.154
BTreeTest-compression 14 0 0 0 0.466
BTreeRemovalTest 22 0 0 0 0.253
BTreeSearchIteratorTest 4 0 0 0 0.076
BTreeTest 14 0 0 0 0.451
BTreeRemovalTest 22 0 0 0 0.412
BTreeSearchIteratorTest 4 0 0 0 0.221
BTreeTest 14 0 0 0 0.652
-------------------------------------------------------------------------------
org.apache.cassandra.utils.concurrent