You are viewing a plain text version of this content. The canonical link for it is here.
Posted to builds@beam.apache.org by Apache Jenkins Server <je...@builds.apache.org> on 2022/09/21 05:39:58 UTC
Build failed in Jenkins: beam_PostCommit_Java_Nexmark_Dataflow_V2_Java11 #1924
See <https://ci-beam.apache.org/job/beam_PostCommit_Java_Nexmark_Dataflow_V2_Java11/1924/display/redirect>
Changes:
------------------------------------------
[...truncated 844.04 KB...]
Sep 21, 2022 5:37:27 AM org.apache.beam.sdk.testutils.metrics.MetricsReader getCounterMetric
SEVERE: Failed to get metric result.elements, from namespace Query1.Results
Sep 21, 2022 5:37:27 AM org.apache.beam.sdk.testutils.metrics.MetricsReader getCounterMetric
SEVERE: Failed to get metric result.bytes, from namespace Query1.Results
2022-09-21T05:37:27.504Z 0 samples not enough to calculate steady-state event rate
2022-09-21T05:37:27.504Z no activity
2022-09-21T05:37:42.544Z RUNNING Query1 (waiting for shutdown)
Sep 21, 2022 5:37:42 AM org.apache.beam.sdk.testutils.metrics.MetricsReader getCounterMetric
SEVERE: Failed to get metric event.elements, from namespace Query1.Events
Sep 21, 2022 5:37:42 AM org.apache.beam.sdk.testutils.metrics.MetricsReader getCounterMetric
SEVERE: Failed to get metric event.bytes, from namespace Query1.Events
Sep 21, 2022 5:37:42 AM org.apache.beam.sdk.testutils.metrics.MetricsReader getCounterMetric
SEVERE: Failed to get metric result.elements, from namespace Query1.Results
Sep 21, 2022 5:37:42 AM org.apache.beam.sdk.testutils.metrics.MetricsReader getCounterMetric
SEVERE: Failed to get metric result.bytes, from namespace Query1.Results
2022-09-21T05:37:43.248Z 0 samples not enough to calculate steady-state event rate
2022-09-21T05:37:43.249Z no activity
2022-09-21T05:37:58.297Z RUNNING Query1 (waiting for shutdown)
Sep 21, 2022 5:37:58 AM org.apache.beam.sdk.testutils.metrics.MetricsReader getCounterMetric
SEVERE: Failed to get metric event.elements, from namespace Query1.Events
Sep 21, 2022 5:37:58 AM org.apache.beam.sdk.testutils.metrics.MetricsReader getCounterMetric
SEVERE: Failed to get metric event.bytes, from namespace Query1.Events
Sep 21, 2022 5:37:58 AM org.apache.beam.sdk.testutils.metrics.MetricsReader getCounterMetric
SEVERE: Failed to get metric result.elements, from namespace Query1.Results
Sep 21, 2022 5:37:58 AM org.apache.beam.sdk.testutils.metrics.MetricsReader getCounterMetric
SEVERE: Failed to get metric result.bytes, from namespace Query1.Results
2022-09-21T05:37:58.895Z 0 samples not enough to calculate steady-state event rate
2022-09-21T05:37:58.895Z no activity
2022-09-21T05:38:13.953Z RUNNING Query1 (waiting for shutdown)
Sep 21, 2022 5:38:14 AM org.apache.beam.sdk.testutils.metrics.MetricsReader getCounterMetric
SEVERE: Failed to get metric event.elements, from namespace Query1.Events
Sep 21, 2022 5:38:14 AM org.apache.beam.sdk.testutils.metrics.MetricsReader getCounterMetric
SEVERE: Failed to get metric event.bytes, from namespace Query1.Events
Sep 21, 2022 5:38:14 AM org.apache.beam.sdk.testutils.metrics.MetricsReader getCounterMetric
SEVERE: Failed to get metric result.elements, from namespace Query1.Results
Sep 21, 2022 5:38:14 AM org.apache.beam.sdk.testutils.metrics.MetricsReader getCounterMetric
SEVERE: Failed to get metric result.bytes, from namespace Query1.Results
2022-09-21T05:38:14.542Z 0 samples not enough to calculate steady-state event rate
2022-09-21T05:38:14.542Z no activity
2022-09-21T05:38:29.579Z RUNNING Query1 (waiting for shutdown)
Sep 21, 2022 5:38:29 AM org.apache.beam.sdk.testutils.metrics.MetricsReader getCounterMetric
SEVERE: Failed to get metric event.elements, from namespace Query1.Events
Sep 21, 2022 5:38:29 AM org.apache.beam.sdk.testutils.metrics.MetricsReader getCounterMetric
SEVERE: Failed to get metric event.bytes, from namespace Query1.Events
Sep 21, 2022 5:38:30 AM org.apache.beam.sdk.testutils.metrics.MetricsReader getCounterMetric
SEVERE: Failed to get metric result.elements, from namespace Query1.Results
Sep 21, 2022 5:38:30 AM org.apache.beam.sdk.testutils.metrics.MetricsReader getCounterMetric
SEVERE: Failed to get metric result.bytes, from namespace Query1.Results
2022-09-21T05:38:30.350Z 0 samples not enough to calculate steady-state event rate
2022-09-21T05:38:30.350Z no activity
2022-09-21T05:38:45.396Z RUNNING Query1 (waiting for shutdown)
Sep 21, 2022 5:38:45 AM org.apache.beam.sdk.testutils.metrics.MetricsReader getCounterMetric
SEVERE: Failed to get metric event.elements, from namespace Query1.Events
Sep 21, 2022 5:38:45 AM org.apache.beam.sdk.testutils.metrics.MetricsReader getCounterMetric
SEVERE: Failed to get metric event.bytes, from namespace Query1.Events
Sep 21, 2022 5:38:45 AM org.apache.beam.sdk.testutils.metrics.MetricsReader getCounterMetric
SEVERE: Failed to get metric result.elements, from namespace Query1.Results
Sep 21, 2022 5:38:45 AM org.apache.beam.sdk.testutils.metrics.MetricsReader getCounterMetric
SEVERE: Failed to get metric result.bytes, from namespace Query1.Results
2022-09-21T05:38:46.048Z 0 samples not enough to calculate steady-state event rate
2022-09-21T05:38:46.048Z no activity
2022-09-21T05:39:01.088Z RUNNING Query1 (waiting for shutdown)
Sep 21, 2022 5:39:01 AM org.apache.beam.sdk.testutils.metrics.MetricsReader getCounterMetric
SEVERE: Failed to get metric event.elements, from namespace Query1.Events
Sep 21, 2022 5:39:01 AM org.apache.beam.sdk.testutils.metrics.MetricsReader getCounterMetric
SEVERE: Failed to get metric event.bytes, from namespace Query1.Events
Sep 21, 2022 5:39:01 AM org.apache.beam.sdk.testutils.metrics.MetricsReader getCounterMetric
SEVERE: Failed to get metric result.elements, from namespace Query1.Results
Sep 21, 2022 5:39:01 AM org.apache.beam.sdk.testutils.metrics.MetricsReader getCounterMetric
SEVERE: Failed to get metric result.bytes, from namespace Query1.Results
2022-09-21T05:39:01.693Z 0 samples not enough to calculate steady-state event rate
2022-09-21T05:39:01.693Z no activity
2022-09-21T05:39:16.724Z RUNNING Query1 (waiting for shutdown)
Sep 21, 2022 5:39:16 AM org.apache.beam.sdk.testutils.metrics.MetricsReader getCounterMetric
SEVERE: Failed to get metric event.elements, from namespace Query1.Events
Sep 21, 2022 5:39:16 AM org.apache.beam.sdk.testutils.metrics.MetricsReader getCounterMetric
SEVERE: Failed to get metric event.bytes, from namespace Query1.Events
Sep 21, 2022 5:39:17 AM org.apache.beam.sdk.testutils.metrics.MetricsReader getCounterMetric
SEVERE: Failed to get metric result.elements, from namespace Query1.Results
Sep 21, 2022 5:39:17 AM org.apache.beam.sdk.testutils.metrics.MetricsReader getCounterMetric
SEVERE: Failed to get metric result.bytes, from namespace Query1.Results
2022-09-21T05:39:17.408Z 0 samples not enough to calculate steady-state event rate
2022-09-21T05:39:17.409Z no activity
2022-09-21T05:39:32.439Z RUNNING Query1 (waiting for shutdown)
Sep 21, 2022 5:39:32 AM org.apache.beam.sdk.testutils.metrics.MetricsReader getCounterMetric
SEVERE: Failed to get metric event.elements, from namespace Query1.Events
Sep 21, 2022 5:39:32 AM org.apache.beam.sdk.testutils.metrics.MetricsReader getCounterMetric
SEVERE: Failed to get metric event.bytes, from namespace Query1.Events
Sep 21, 2022 5:39:32 AM org.apache.beam.sdk.testutils.metrics.MetricsReader getCounterMetric
SEVERE: Failed to get metric result.elements, from namespace Query1.Results
Sep 21, 2022 5:39:32 AM org.apache.beam.sdk.testutils.metrics.MetricsReader getCounterMetric
SEVERE: Failed to get metric result.bytes, from namespace Query1.Results
2022-09-21T05:39:33.081Z 0 samples not enough to calculate steady-state event rate
2022-09-21T05:39:33.081Z no activity
2022-09-21T05:39:48.128Z CANCELLED Query1 (waiting for shutdown)
Sep 21, 2022 5:39:48 AM org.apache.beam.sdk.testutils.metrics.MetricsReader getCounterMetric
SEVERE: Failed to get metric event.elements, from namespace Query1.Events
Sep 21, 2022 5:39:48 AM org.apache.beam.sdk.testutils.metrics.MetricsReader getCounterMetric
SEVERE: Failed to get metric event.bytes, from namespace Query1.Events
Sep 21, 2022 5:39:48 AM org.apache.beam.sdk.testutils.metrics.MetricsReader getCounterMetric
SEVERE: Failed to get metric result.elements, from namespace Query1.Results
Sep 21, 2022 5:39:48 AM org.apache.beam.sdk.testutils.metrics.MetricsReader getCounterMetric
SEVERE: Failed to get metric result.bytes, from namespace Query1.Results
2022-09-21T05:39:48.150Z 0 samples not enough to calculate steady-state event rate
==========================================================================================
Run started 2022-09-21T04:32:26.623Z and ran for PT4041.528S
Default configuration:
{"debug":true,"query":null,"sourceType":"DIRECT","generateEventFilePathPrefix":null,"sinkType":"DEVNULL","exportSummaryToBigQuery":false,"pubSubMode":"COMBINED","pubsubMessageSerializationMethod":"CODER","sideInputType":"DIRECT","sideInputRowCount":500,"sideInputNumShards":3,"sideInputUrl":null,"sessionGap":600000,"numEvents":100000,"numEventGenerators":100,"rateShape":"SINE","firstEventRate":10000,"nextEventRate":10000,"rateUnit":"PER_SECOND","ratePeriodSec":600,"preloadSeconds":0,"streamTimeout":240,"isRateLimited":false,"useWallclockEventTime":false,"avgPersonByteSize":200,"avgAuctionByteSize":500,"avgBidByteSize":100,"hotAuctionRatio":2,"hotSellersRatio":4,"hotBiddersRatio":4,"windowSizeSec":10,"windowPeriodSec":5,"watermarkHoldbackSec":0,"numInFlightAuctions":100,"numActivePeople":1000,"coderStrategy":"HAND","cpuDelayMs":0,"diskBusyBytes":0,"auctionSkip":123,"fanout":5,"maxAuctionsWaitingTime":600,"occasionalDelaySec":3,"probDelayedEvent":0.1,"maxLogEvents":100000,"usePubsubPublishTime":false,"outOfOrderGroupSize":1,"numKeyBuckets":20000,"pardoCPUFactor":1.0}
Configurations:
Conf Description
0000 query:PASSTHROUGH; numEvents:10000000
0001 query:CURRENCY_CONVERSION; numEvents:10000000
0002 query:SELECTION; numEvents:10000000
0003 query:LOCAL_ITEM_SUGGESTION; numEvents:10000000
0004 query:AVERAGE_PRICE_FOR_CATEGORY; numEvents:1000000
0005 query:HOT_ITEMS; numEvents:10000000
0006 query:AVERAGE_SELLING_PRICE_BY_SELLER; numEvents:1000000
0007 query:HIGHEST_BID; numEvents:10000000
0008 query:MONITOR_NEW_USERS; numEvents:10000000
0009 query:WINNING_BIDS; numEvents:1000000
0010 query:LOG_TO_SHARDED_FILES; numEvents:10000000
0011 query:USER_SESSIONS; numEvents:10000000
0012 query:PROCESSING_TIME_WINDOWS; numEvents:10000000
0013 query:PORTABILITY_BATCH; numEvents:10000000
0014 query:RESHUFFLE; numEvents:10000000
0015 query:BOUNDED_SIDE_INPUT_JOIN; numEvents:10000000
0016 query:SESSION_SIDE_INPUT_JOIN; numEvents:10000000
Performance:
Conf Runtime(sec) (Baseline) Events(/sec) (Baseline) Results (Baseline)
0000 39.6 252678.4 10000000
0001 -1.0 -1.0 -1
*** Cancelling streaming job since it appeared stuck for 60 min. ***
0002 28.2 354987.6 83527
0003 53.3 187455.5 59507
0004 *** not run ***
0005 238.5 41921.7 4567
0006 *** not run ***
0007 160.5 62318.5 100
0008 73.1 136875.7 92833
0009 *** not run ***
0010 109.0 91768.4 100
0011 188.3 53103.9 1839657
0012 106.5 93897.6 323327
0013 *** not run ***
0014 148.0 67574.4 10000000
0015 *** not run ***
0016 *** not run ***
==========================================================================================
==========================================================================================
Run started 2022-09-21T04:32:26.623Z and ran for PT4041.805S
Default configuration:
{"debug":true,"query":null,"sourceType":"DIRECT","generateEventFilePathPrefix":null,"sinkType":"DEVNULL","exportSummaryToBigQuery":false,"pubSubMode":"COMBINED","pubsubMessageSerializationMethod":"CODER","sideInputType":"DIRECT","sideInputRowCount":500,"sideInputNumShards":3,"sideInputUrl":null,"sessionGap":600000,"numEvents":100000,"numEventGenerators":100,"rateShape":"SINE","firstEventRate":10000,"nextEventRate":10000,"rateUnit":"PER_SECOND","ratePeriodSec":600,"preloadSeconds":0,"streamTimeout":240,"isRateLimited":false,"useWallclockEventTime":false,"avgPersonByteSize":200,"avgAuctionByteSize":500,"avgBidByteSize":100,"hotAuctionRatio":2,"hotSellersRatio":4,"hotBiddersRatio":4,"windowSizeSec":10,"windowPeriodSec":5,"watermarkHoldbackSec":0,"numInFlightAuctions":100,"numActivePeople":1000,"coderStrategy":"HAND","cpuDelayMs":0,"diskBusyBytes":0,"auctionSkip":123,"fanout":5,"maxAuctionsWaitingTime":600,"occasionalDelaySec":3,"probDelayedEvent":0.1,"maxLogEvents":100000,"usePubsubPublishTime":false,"outOfOrderGroupSize":1,"numKeyBuckets":20000,"pardoCPUFactor":1.0}
Configurations:
Conf Description
0000 query:PASSTHROUGH; numEvents:10000000
0001 query:CURRENCY_CONVERSION; numEvents:10000000
0002 query:SELECTION; numEvents:10000000
0003 query:LOCAL_ITEM_SUGGESTION; numEvents:10000000
0004 query:AVERAGE_PRICE_FOR_CATEGORY; numEvents:1000000
0005 query:HOT_ITEMS; numEvents:10000000
0006 query:AVERAGE_SELLING_PRICE_BY_SELLER; numEvents:1000000
0007 query:HIGHEST_BID; numEvents:10000000
0008 query:MONITOR_NEW_USERS; numEvents:10000000
0009 query:WINNING_BIDS; numEvents:1000000
0010 query:LOG_TO_SHARDED_FILES; numEvents:10000000
0011 query:USER_SESSIONS; numEvents:10000000
0012 query:PROCESSING_TIME_WINDOWS; numEvents:10000000
0013 query:PORTABILITY_BATCH; numEvents:10000000
0014 query:RESHUFFLE; numEvents:10000000
0015 query:BOUNDED_SIDE_INPUT_JOIN; numEvents:10000000
0016 query:SESSION_SIDE_INPUT_JOIN; numEvents:10000000
Performance:
Conf Runtime(sec) (Baseline) Events(/sec) (Baseline) Results (Baseline)
0000 39.6 252678.4 10000000
0001 -1.0 -1.0 -1
*** Cancelling streaming job since it appeared stuck for 60 min. ***
0002 28.2 354987.6 83527
0003 53.3 187455.5 59507
0004 *** not run ***
0005 238.5 41921.7 4567
0006 *** not run ***
0007 160.5 62318.5 100
0008 73.1 136875.7 92833
0009 *** not run ***
0010 109.0 91768.4 100
Exception in thread "main" 0011 188.3 53103.9 1839657
0012 106.5 93897.6 323327
0013 *** not run ***
0014 148.0 67574.4 10000000
0015 *** not run ***
0016 *** not run ***
==========================================================================================
java.lang.RuntimeException: Execution was not successful
at org.apache.beam.sdk.nexmark.Main.runAll(Main.java:169)
at org.apache.beam.sdk.nexmark.Main.main(Main.java:441)
> Task :sdks:java:testing:nexmark:run FAILED
> Task :runners:google-cloud-dataflow-java:cleanUpDockerJavaImages
Untagged: us.gcr.io/apache-beam-testing/java-postcommit-it/java:20220921043156
Untagged: us.gcr.io/apache-beam-testing/java-postcommit-it/java@sha256:a1462613f4cb47b31f986170c0ec313a137a95737833fddc4d8cd42d56c1d420
Tag: [us.gcr.io/apache-beam-testing/java-postcommit-it/java:20220921043156]
- referencing digest: [us.gcr.io/apache-beam-testing/java-postcommit-it/java@sha256:a1462613f4cb47b31f986170c0ec313a137a95737833fddc4d8cd42d56c1d420]
Deleted [[us.gcr.io/apache-beam-testing/java-postcommit-it/java:20220921043156] (referencing [us.gcr.io/apache-beam-testing/java-postcommit-it/java@sha256:a1462613f4cb47b31f986170c0ec313a137a95737833fddc4d8cd42d56c1d420])].
Removing untagged image us.gcr.io/apache-beam-testing/java-postcommit-it/java@sha256:a1462613f4cb47b31f986170c0ec313a137a95737833fddc4d8cd42d56c1d420
Digests:
- us.gcr.io/apache-beam-testing/java-postcommit-it/java@sha256:a1462613f4cb47b31f986170c0ec313a137a95737833fddc4d8cd42d56c1d420
Deleted [us.gcr.io/apache-beam-testing/java-postcommit-it/java@sha256:a1462613f4cb47b31f986170c0ec313a137a95737833fddc4d8cd42d56c1d420].
FAILURE: Build failed with an exception.
* What went wrong:
Execution failed for task ':sdks:java:testing:nexmark:run'.
> Process 'command '/usr/lib/jvm/java-8-openjdk-amd64/bin/java'' finished with non-zero exit value 1
* Try:
> Run with --stacktrace option to get the stack trace.
> Run with --info or --debug option to get more log output.
* Get more help at https://help.gradle.org
Deprecated Gradle features were used in this build, making it incompatible with Gradle 8.0.
You can use '--warning-mode all' to show the individual deprecation warnings and determine if they come from your own scripts or plugins.
See https://docs.gradle.org/7.5.1/userguide/command_line_interface.html#sec:command_line_warnings
Execution optimizations have been disabled for 1 invalid unit(s) of work during this build to ensure correctness.
Please consult deprecation warnings for more details.
BUILD FAILED in 1h 8m 1s
132 actionable tasks: 9 executed, 123 up-to-date
Publishing build scan...
https://gradle.com/s/ipethxu3yhtog
Build step 'Invoke Gradle script' changed build result to FAILURE
Build step 'Invoke Gradle script' marked build as failure
---------------------------------------------------------------------
To unsubscribe, e-mail: builds-unsubscribe@beam.apache.org
For additional commands, e-mail: builds-help@beam.apache.org
Jenkins build is back to normal : beam_PostCommit_Java_Nexmark_Dataflow_V2_Java11 #1925
Posted by Apache Jenkins Server <je...@builds.apache.org>.
See <https://ci-beam.apache.org/job/beam_PostCommit_Java_Nexmark_Dataflow_V2_Java11/1925/display/redirect>
---------------------------------------------------------------------
To unsubscribe, e-mail: builds-unsubscribe@beam.apache.org
For additional commands, e-mail: builds-help@beam.apache.org