You are viewing a plain text version of this content. The canonical link for it is here.
Posted to issues@bookkeeper.apache.org by Apache Jenkins Server <je...@builds.apache.org> on 2018/07/05 13:12:53 UTC
Build failed in Jenkins:
bookkeeper_release_branch_47_integrationtests #77
See <https://builds.apache.org/job/bookkeeper_release_branch_47_integrationtests/77/display/redirect>
------------------------------------------
[...truncated 1.36 MB...]
2018-07-05\T\13:01:00.378 [INFO] Using 'UTF-8' encoding to copy filtered resources.
2018-07-05\T\13:01:00.378 [INFO] Copying 1 resource
2018-07-05\T\13:01:00.378 [INFO] Copying 3 resources
2018-07-05\T\13:01:00.379 [INFO]
2018-07-05\T\13:01:00.379 [INFO] --- maven-compiler-plugin:3.7.0:testCompile (default-testCompile) @ old-cookie-new-cluster ---
2018-07-05\T\13:01:00.383 [INFO] Changes detected - recompiling the module!
2018-07-05\T\13:01:00.384 [INFO] Using Groovy-Eclipse compiler to compile both Java and Groovy files
2018-07-05\T\13:01:00.645 [INFO]
2018-07-05\T\13:01:00.645 [INFO] --- maven-surefire-plugin:2.8.1:test (default-test) @ old-cookie-new-cluster ---
2018-07-05\T\13:01:00.647 [INFO] Surefire report directory: <https://builds.apache.org/job/bookkeeper_release_branch_47_integrationtests/ws/tests/backward-compat/old-cookie-new-cluster/target/surefire-reports>
-------------------------------------------------------
T E S T S
-------------------------------------------------------
Running org.apache.bookkeeper.tests.backwardcompat.TestCompatUpgradeOldServerInClusterWithCookies
Tests run: 1, Failures: 0, Errors: 0, Skipped: 0, Time elapsed: 62.126 sec
Results :
Tests run: 1, Failures: 0, Errors: 0, Skipped: 0
2018-07-05\T\13:02:36.396 [INFO]
2018-07-05\T\13:02:36.396 [INFO] ------------------------------------------------------------------------
2018-07-05\T\13:02:36.396 [INFO] Building Apache BookKeeper :: Tests :: Backward Compatibility :: Test old clients working on current server 4.7.2-SNAPSHOT
2018-07-05\T\13:02:36.396 [INFO] ------------------------------------------------------------------------
2018-07-05\T\13:02:36.421 [INFO]
2018-07-05\T\13:02:36.421 [INFO] --- groovy-eclipse-compiler:2.9.2-04:add-groovy-build-paths (default-add-groovy-build-paths) @ backward-compat-current-server-old-clients ---
2018-07-05\T\13:02:36.422 [INFO] Adding /src/main/groovy to the list of source folders
2018-07-05\T\13:02:36.422 [INFO] Adding /src/test/groovy to the list of test source folders
2018-07-05\T\13:02:36.422 [INFO]
2018-07-05\T\13:02:36.422 [INFO] --- maven-remote-resources-plugin:1.5:process (process-resource-bundles) @ backward-compat-current-server-old-clients ---
2018-07-05\T\13:02:37.937 [INFO]
2018-07-05\T\13:02:37.937 [INFO] --- maven-resources-plugin:2.7:resources (default-resources) @ backward-compat-current-server-old-clients ---
2018-07-05\T\13:02:37.938 [INFO] Using 'UTF-8' encoding to copy filtered resources.
2018-07-05\T\13:02:37.938 [INFO] skip non existing resourceDirectory <https://builds.apache.org/job/bookkeeper_release_branch_47_integrationtests/ws/tests/backward-compat/current-server-old-clients/src/main/resources>
2018-07-05\T\13:02:37.938 [INFO] Copying 3 resources
2018-07-05\T\13:02:37.939 [INFO]
2018-07-05\T\13:02:37.939 [INFO] --- maven-compiler-plugin:3.7.0:compile (default-compile) @ backward-compat-current-server-old-clients ---
2018-07-05\T\13:02:37.940 [INFO] No sources to compile
2018-07-05\T\13:02:37.941 [INFO]
2018-07-05\T\13:02:37.941 [INFO] --- maven-resources-plugin:2.7:testResources (default-testResources) @ backward-compat-current-server-old-clients ---
2018-07-05\T\13:02:37.941 [INFO] Using 'UTF-8' encoding to copy filtered resources.
2018-07-05\T\13:02:37.941 [INFO] Copying 1 resource
2018-07-05\T\13:02:37.942 [INFO] Copying 3 resources
2018-07-05\T\13:02:37.942 [INFO]
2018-07-05\T\13:02:37.942 [INFO] --- maven-compiler-plugin:3.7.0:testCompile (default-testCompile) @ backward-compat-current-server-old-clients ---
2018-07-05\T\13:02:37.946 [INFO] Changes detected - recompiling the module!
2018-07-05\T\13:02:37.948 [INFO] Using Groovy-Eclipse compiler to compile both Java and Groovy files
2018-07-05\T\13:02:38.217 [INFO]
2018-07-05\T\13:02:38.217 [INFO] --- maven-surefire-plugin:2.8.1:test (default-test) @ backward-compat-current-server-old-clients ---
2018-07-05\T\13:02:38.219 [INFO] Surefire report directory: <https://builds.apache.org/job/bookkeeper_release_branch_47_integrationtests/ws/tests/backward-compat/current-server-old-clients/target/surefire-reports>
-------------------------------------------------------
T E S T S
-------------------------------------------------------
Running org.apache.bookkeeper.tests.backwardcompat.TestCompatOldClients
Tests run: 4, Failures: 0, Errors: 0, Skipped: 0, Time elapsed: 350.715 sec
Results :
Tests run: 4, Failures: 0, Errors: 0, Skipped: 0
2018-07-05\T\13:09:02.859 [INFO]
2018-07-05\T\13:09:02.860 [INFO] ------------------------------------------------------------------------
2018-07-05\T\13:09:02.860 [INFO] Building Apache BookKeeper :: Tests :: Backward Compatibility :: Test upgrade between yahoo custom version and current 4.7.2-SNAPSHOT
2018-07-05\T\13:09:02.860 [INFO] ------------------------------------------------------------------------
2018-07-05\T\13:09:02.901 [INFO]
2018-07-05\T\13:09:02.901 [INFO] --- groovy-eclipse-compiler:2.9.2-04:add-groovy-build-paths (default-add-groovy-build-paths) @ yahoo-custom-version ---
2018-07-05\T\13:09:02.902 [INFO] Adding /src/main/groovy to the list of source folders
2018-07-05\T\13:09:02.902 [INFO] Adding /src/test/groovy to the list of test source folders
2018-07-05\T\13:09:02.902 [INFO]
2018-07-05\T\13:09:02.902 [INFO] --- maven-remote-resources-plugin:1.5:process (process-resource-bundles) @ yahoo-custom-version ---
2018-07-05\T\13:09:04.497 [INFO]
2018-07-05\T\13:09:04.497 [INFO] --- maven-resources-plugin:2.7:resources (default-resources) @ yahoo-custom-version ---
2018-07-05\T\13:09:04.498 [INFO] Using 'UTF-8' encoding to copy filtered resources.
2018-07-05\T\13:09:04.499 [INFO] skip non existing resourceDirectory <https://builds.apache.org/job/bookkeeper_release_branch_47_integrationtests/ws/tests/backward-compat/yahoo-custom-version/src/main/resources>
2018-07-05\T\13:09:04.499 [INFO] Copying 3 resources
2018-07-05\T\13:09:04.500 [INFO]
2018-07-05\T\13:09:04.500 [INFO] --- maven-compiler-plugin:3.7.0:compile (default-compile) @ yahoo-custom-version ---
2018-07-05\T\13:09:04.501 [INFO] No sources to compile
2018-07-05\T\13:09:04.501 [INFO]
2018-07-05\T\13:09:04.501 [INFO] --- maven-resources-plugin:2.7:testResources (default-testResources) @ yahoo-custom-version ---
2018-07-05\T\13:09:04.503 [INFO] Using 'UTF-8' encoding to copy filtered resources.
2018-07-05\T\13:09:04.503 [INFO] Copying 1 resource
2018-07-05\T\13:09:04.503 [INFO] Copying 3 resources
2018-07-05\T\13:09:04.504 [INFO]
2018-07-05\T\13:09:04.504 [INFO] --- maven-compiler-plugin:3.7.0:testCompile (default-testCompile) @ yahoo-custom-version ---
2018-07-05\T\13:09:04.508 [INFO] Changes detected - recompiling the module!
2018-07-05\T\13:09:04.509 [INFO] Using Groovy-Eclipse compiler to compile both Java and Groovy files
2018-07-05\T\13:09:04.793 [INFO]
2018-07-05\T\13:09:04.794 [INFO] --- maven-surefire-plugin:2.8.1:test (default-test) @ yahoo-custom-version ---
2018-07-05\T\13:09:04.795 [INFO] Surefire report directory: <https://builds.apache.org/job/bookkeeper_release_branch_47_integrationtests/ws/tests/backward-compat/yahoo-custom-version/target/surefire-reports>
-------------------------------------------------------
T E S T S
-------------------------------------------------------
Running org.apache.bookkeeper.tests.backwardcompat.TestCompatUpgradeYahooCustom
Tests run: 1, Failures: 0, Errors: 0, Skipped: 0, Time elapsed: 45.141 sec
Results :
Tests run: 1, Failures: 0, Errors: 0, Skipped: 0
2018-07-05\T\13:10:14.408 [INFO]
2018-07-05\T\13:10:14.409 [INFO] ------------------------------------------------------------------------
2018-07-05\T\13:10:14.409 [INFO] Building Apache BookKeeper :: Tests :: Integration 4.7.2-SNAPSHOT
2018-07-05\T\13:10:14.409 [INFO] ------------------------------------------------------------------------
2018-07-05\T\13:10:14.410 [INFO]
2018-07-05\T\13:10:14.410 [INFO] --- maven-remote-resources-plugin:1.5:process (process-resource-bundles) @ tests-parent ---
2018-07-05\T\13:10:14.466 [INFO]
2018-07-05\T\13:10:14.466 [INFO] ------------------------------------------------------------------------
2018-07-05\T\13:10:14.466 [INFO] Building Apache BookKeeper :: Tests :: Integration :: Smoke test 4.7.2-SNAPSHOT
2018-07-05\T\13:10:14.466 [INFO] ------------------------------------------------------------------------
2018-07-05\T\13:10:14.499 [INFO]
2018-07-05\T\13:10:14.500 [INFO] --- maven-remote-resources-plugin:1.5:process (process-resource-bundles) @ smoke ---
2018-07-05\T\13:10:16.731 [INFO]
2018-07-05\T\13:10:16.731 [INFO] --- maven-resources-plugin:2.7:resources (default-resources) @ smoke ---
2018-07-05\T\13:10:16.733 [INFO] Using 'UTF-8' encoding to copy filtered resources.
2018-07-05\T\13:10:16.733 [INFO] skip non existing resourceDirectory <https://builds.apache.org/job/bookkeeper_release_branch_47_integrationtests/ws/tests/integration/smoke/src/main/resources>
2018-07-05\T\13:10:16.733 [INFO] Copying 3 resources
2018-07-05\T\13:10:16.734 [INFO]
2018-07-05\T\13:10:16.734 [INFO] --- maven-compiler-plugin:3.7.0:compile (default-compile) @ smoke ---
2018-07-05\T\13:10:16.737 [INFO] No sources to compile
2018-07-05\T\13:10:16.737 [INFO]
2018-07-05\T\13:10:16.737 [INFO] --- maven-resources-plugin:2.7:testResources (default-testResources) @ smoke ---
2018-07-05\T\13:10:16.738 [INFO] Using 'UTF-8' encoding to copy filtered resources.
2018-07-05\T\13:10:16.738 [INFO] Copying 1 resource
2018-07-05\T\13:10:16.739 [INFO] Copying 3 resources
2018-07-05\T\13:10:16.739 [INFO]
2018-07-05\T\13:10:16.739 [INFO] --- maven-compiler-plugin:3.7.0:testCompile (default-testCompile) @ smoke ---
2018-07-05\T\13:10:16.746 [INFO] Nothing to compile - all classes are up to date
2018-07-05\T\13:10:16.746 [INFO]
2018-07-05\T\13:10:16.746 [INFO] --- maven-surefire-plugin:2.20.1:test (default-test) @ smoke ---
2018-07-05\T\13:10:16.752 [INFO]
2018-07-05\T\13:10:16.752 [INFO] -------------------------------------------------------
2018-07-05\T\13:10:16.752 [INFO] T E S T S
2018-07-05\T\13:10:16.752 [INFO] -------------------------------------------------------
2018-07-05\T\13:10:17.187 [INFO] Running org.apache.bookkeeper.tests.integration.TestCLI
2018-07-05\T\13:10:46.656 [INFO] Tests run: 5, Failures: 0, Errors: 0, Skipped: 0, Time elapsed: 29.457 s - in org.apache.bookkeeper.tests.integration.TestCLI
2018-07-05\T\13:10:50.271 [INFO] Running org.apache.bookkeeper.tests.integration.TestBookieShellCluster
2018-07-05\T\13:11:19.596 [INFO] Tests run: 5, Failures: 0, Errors: 0, Skipped: 0, Time elapsed: 29.314 s - in org.apache.bookkeeper.tests.integration.TestBookieShellCluster
2018-07-05\T\13:11:22.667 [INFO] Running org.apache.bookkeeper.tests.integration.TestSmoke
2018-07-05\T\13:12:05.859 [INFO] Tests run: 8, Failures: 0, Errors: 0, Skipped: 0, Time elapsed: 43.184 s - in org.apache.bookkeeper.tests.integration.TestSmoke
2018-07-05\T\13:12:28.489 [INFO] Running org.apache.bookkeeper.tests.integration.TestDlogCLI
2018-07-05\T\13:12:48.803 [INFO] Tests run: 7, Failures: 0, Errors: 0, Skipped: 0, Time elapsed: 20.306 s - in org.apache.bookkeeper.tests.integration.TestDlogCLI
2018-07-05\T\13:12:51.691 [INFO]
2018-07-05\T\13:12:51.691 [INFO] Results:
2018-07-05\T\13:12:51.691 [INFO]
2018-07-05\T\13:12:51.691 [INFO] Tests run: 25, Failures: 0, Errors: 0, Skipped: 0
2018-07-05\T\13:12:51.691 [INFO]
2018-07-05\T\13:12:51.700 [INFO] ------------------------------------------------------------------------
2018-07-05\T\13:12:51.700 [INFO] Reactor Summary:
2018-07-05\T\13:12:51.700 [INFO]
2018-07-05\T\13:12:51.700 [INFO] Apache BookKeeper :: Tests ......................... SUCCESS [ 0.725 s]
2018-07-05\T\13:12:51.701 [INFO] Apache BookKeeper :: Tests :: Test Shaded Jars ..... SUCCESS [ 0.099 s]
2018-07-05\T\13:12:51.701 [INFO] Apache BookKeeper :: Tests :: bookkeeper-server-shaded test SUCCESS [ 4.677 s]
2018-07-05\T\13:12:51.701 [INFO] Apache BookKeeper :: Tests :: bookkeeper-server-tests-shaded test SUCCESS [ 1.482 s]
2018-07-05\T\13:12:51.701 [INFO] Apache BookKeeper :: Tests :: distributedlog-core-shaded test SUCCESS [ 3.812 s]
2018-07-05\T\13:12:51.701 [INFO] Apache BookKeeper :: Tests :: Docker Images ........ SUCCESS [ 0.065 s]
2018-07-05\T\13:12:51.701 [INFO] Apache BookKeeper :: Tests :: Docker Images :: All Released Versions SUCCESS [ 0.100 s]
2018-07-05\T\13:12:51.702 [INFO] Apache BookKeeper :: Tests :: Docker Images :: All Versions SUCCESS [ 2.430 s]
2018-07-05\T\13:12:51.702 [INFO] Apache BookKeeper :: Tests :: Docker Images :: Current Version SUCCESS [ 0.823 s]
2018-07-05\T\13:12:51.702 [INFO] Apache BookKeeper :: Tests :: Utility module for Arquillian based integration tests SUCCESS [ 7.947 s]
2018-07-05\T\13:12:51.702 [INFO] Apache BookKeeper :: Tests :: Common topologies for Docker based integration tests SUCCESS [ 1.740 s]
2018-07-05\T\13:12:51.702 [INFO] Apache BookKeeper :: Tests :: Base module for Arquillian based integration tests SUCCESS [ 1.795 s]
2018-07-05\T\13:12:51.702 [INFO] Apache BookKeeper :: Tests :: Base module for Arquillian based integration tests using groovy SUCCESS [ 2.147 s]
2018-07-05\T\13:12:51.702 [INFO] Apache BookKeeper :: Tests :: Backward Compatibility SUCCESS [ 1.523 s]
2018-07-05\T\13:12:51.703 [INFO] Apache BookKeeper :: Tests :: Backward Compatibility :: Test upgrade between all released versions and current version SUCCESS [05:04 min]
2018-07-05\T\13:12:51.703 [INFO] Apache BookKeeper :: Tests :: Backward Compatibility :: Test upgrade between 4.1.0 and current version SUCCESS [01:00 min]
2018-07-05\T\13:12:51.703 [INFO] Apache BookKeeper :: Tests :: Backward Compatibility :: Test compat between old version and new version of hierarchical ledger manager SUCCESS [ 57.846 s]
2018-07-05\T\13:12:51.703 [INFO] Apache BookKeeper :: Tests :: Backward Compatibility :: Test upgrade between 4.1.0 and current version (with hostname bookie ID) SUCCESS [01:13 min]
2018-07-05\T\13:12:51.703 [INFO] Apache BookKeeper :: Tests :: Backward Compatibility :: Test recovery does not work when password no in metadata SUCCESS [ 52.071 s]
2018-07-05\T\13:12:51.703 [INFO] Apache BookKeeper :: Tests :: Backward Compatibility :: Test upgrade 4.1.0 to current in cluster with cookies SUCCESS [01:37 min]
2018-07-05\T\13:12:51.703 [INFO] Apache BookKeeper :: Tests :: Backward Compatibility :: Test old clients working on current server SUCCESS [06:26 min]
2018-07-05\T\13:12:51.703 [INFO] Apache BookKeeper :: Tests :: Backward Compatibility :: Test upgrade between yahoo custom version and current SUCCESS [01:11 min]
2018-07-05\T\13:12:51.704 [INFO] Apache BookKeeper :: Tests :: Integration .......... SUCCESS [ 0.058 s]
2018-07-05\T\13:12:51.704 [INFO] Apache BookKeeper :: Tests :: Integration :: Smoke test FAILURE [02:37 min]
2018-07-05\T\13:12:51.704 [INFO] Apache BookKeeper :: Tests :: Integration :: Standalone test SKIPPED
2018-07-05\T\13:12:51.704 [INFO] Apache BookKeeper :: Tests :: Bash Scripts Test .... SKIPPED
2018-07-05\T\13:12:51.704 [INFO] ------------------------------------------------------------------------
2018-07-05\T\13:12:51.704 [INFO] BUILD FAILURE
2018-07-05\T\13:12:51.704 [INFO] ------------------------------------------------------------------------
2018-07-05\T\13:12:51.704 [INFO] Total time: 21:32 min
2018-07-05\T\13:12:51.704 [INFO] Finished at: 2018-07-05T13:12:51Z
2018-07-05\T\13:12:52.147 [INFO] Final Memory: 68M/2644M
2018-07-05\T\13:12:52.147 [INFO] ------------------------------------------------------------------------
2018-07-05\T\13:12:52.149 [ERROR] Failed to execute goal org.apache.maven.plugins:maven-surefire-plugin:2.20.1:test (default-test) on project smoke: There are test failures.
2018-07-05\T\13:12:52.149 [ERROR]
2018-07-05\T\13:12:52.149 [ERROR] Please refer to <https://builds.apache.org/job/bookkeeper_release_branch_47_integrationtests/ws/tests/integration/smoke/target/surefire-reports> for the individual test results.
2018-07-05\T\13:12:52.149 [ERROR] Please refer to dump files (if any exist) [date]-jvmRun[N].dump, [date].dumpstream and [date]-jvmRun[N].dumpstream.
2018-07-05\T\13:12:52.149 [ERROR] ExecutionException There was an error in the forked process
2018-07-05\T\13:12:52.149 [ERROR] Test mechanism :: Could not run @AfterSuite
2018-07-05\T\13:12:52.149 [ERROR] ExecutionException There was an error in the forked process
2018-07-05\T\13:12:52.149 [ERROR] Test mechanism :: Could not run @AfterSuite
2018-07-05\T\13:12:52.149 [ERROR] org.apache.maven.surefire.booter.SurefireBooterForkException: ExecutionException There was an error in the forked process
2018-07-05\T\13:12:52.149 [ERROR] Test mechanism :: Could not run @AfterSuite
2018-07-05\T\13:12:52.149 [ERROR] ExecutionException There was an error in the forked process
2018-07-05\T\13:12:52.149 [ERROR] Test mechanism :: Could not run @AfterSuite
2018-07-05\T\13:12:52.149 [ERROR] at org.apache.maven.plugin.surefire.booterclient.ForkStarter.awaitResultsDone(ForkStarter.java:496)
2018-07-05\T\13:12:52.149 [ERROR] at org.apache.maven.plugin.surefire.booterclient.ForkStarter.runSuitesForkPerTestSet(ForkStarter.java:443)
2018-07-05\T\13:12:52.149 [ERROR] at org.apache.maven.plugin.surefire.booterclient.ForkStarter.run(ForkStarter.java:295)
2018-07-05\T\13:12:52.149 [ERROR] at org.apache.maven.plugin.surefire.booterclient.ForkStarter.run(ForkStarter.java:246)
2018-07-05\T\13:12:52.149 [ERROR] at org.apache.maven.plugin.surefire.AbstractSurefireMojo.executeProvider(AbstractSurefireMojo.java:1124)
2018-07-05\T\13:12:52.149 [ERROR] at org.apache.maven.plugin.surefire.AbstractSurefireMojo.executeAfterPreconditionsChecked(AbstractSurefireMojo.java:954)
2018-07-05\T\13:12:52.149 [ERROR] at org.apache.maven.plugin.surefire.AbstractSurefireMojo.execute(AbstractSurefireMojo.java:832)
2018-07-05\T\13:12:52.149 [ERROR] at org.apache.maven.plugin.DefaultBuildPluginManager.executeMojo(DefaultBuildPluginManager.java:134)
2018-07-05\T\13:12:52.149 [ERROR] at org.apache.maven.lifecycle.internal.MojoExecutor.execute(MojoExecutor.java:208)
2018-07-05\T\13:12:52.149 [ERROR] at org.apache.maven.lifecycle.internal.MojoExecutor.execute(MojoExecutor.java:154)
2018-07-05\T\13:12:52.149 [ERROR] at org.apache.maven.lifecycle.internal.MojoExecutor.execute(MojoExecutor.java:146)
2018-07-05\T\13:12:52.149 [ERROR] at org.apache.maven.lifecycle.internal.LifecycleModuleBuilder.buildProject(LifecycleModuleBuilder.java:117)
2018-07-05\T\13:12:52.149 [ERROR] at org.apache.maven.lifecycle.internal.LifecycleModuleBuilder.buildProject(LifecycleModuleBuilder.java:81)
2018-07-05\T\13:12:52.149 [ERROR] at org.apache.maven.lifecycle.internal.builder.singlethreaded.SingleThreadedBuilder.build(SingleThreadedBuilder.java:51)
2018-07-05\T\13:12:52.150 [ERROR] at org.apache.maven.lifecycle.internal.LifecycleStarter.execute(LifecycleStarter.java:128)
2018-07-05\T\13:12:52.150 [ERROR] at org.apache.maven.DefaultMaven.doExecute(DefaultMaven.java:309)
2018-07-05\T\13:12:52.150 [ERROR] at org.apache.maven.DefaultMaven.doExecute(DefaultMaven.java:194)
2018-07-05\T\13:12:52.150 [ERROR] at org.apache.maven.DefaultMaven.execute(DefaultMaven.java:107)
2018-07-05\T\13:12:52.150 [ERROR] at org.apache.maven.cli.MavenCli.execute(MavenCli.java:993)
2018-07-05\T\13:12:52.150 [ERROR] at org.apache.maven.cli.MavenCli.doMain(MavenCli.java:345)
2018-07-05\T\13:12:52.150 [ERROR] at org.apache.maven.cli.MavenCli.main(MavenCli.java:191)
2018-07-05\T\13:12:52.150 [ERROR] at sun.reflect.NativeMethodAccessorImpl.invoke0(Native Method)
2018-07-05\T\13:12:52.150 [ERROR] at sun.reflect.NativeMethodAccessorImpl.invoke(NativeMethodAccessorImpl.java:62)
2018-07-05\T\13:12:52.150 [ERROR] at sun.reflect.DelegatingMethodAccessorImpl.invoke(DelegatingMethodAccessorImpl.java:43)
2018-07-05\T\13:12:52.150 [ERROR] at java.lang.reflect.Method.invoke(Method.java:498)
2018-07-05\T\13:12:52.150 [ERROR] at org.codehaus.plexus.classworlds.launcher.Launcher.launchEnhanced(Launcher.java:289)
2018-07-05\T\13:12:52.150 [ERROR] at org.codehaus.plexus.classworlds.launcher.Launcher.launch(Launcher.java:229)
2018-07-05\T\13:12:52.150 [ERROR] at org.codehaus.plexus.classworlds.launcher.Launcher.mainWithExitCode(Launcher.java:415)
2018-07-05\T\13:12:52.150 [ERROR] at org.codehaus.plexus.classworlds.launcher.Launcher.main(Launcher.java:356)
2018-07-05\T\13:12:52.150 [ERROR] Caused by: org.apache.maven.surefire.booter.SurefireBooterForkException: There was an error in the forked process
2018-07-05\T\13:12:52.150 [ERROR] Test mechanism :: Could not run @AfterSuite
2018-07-05\T\13:12:52.150 [ERROR] at org.apache.maven.plugin.surefire.booterclient.ForkStarter.fork(ForkStarter.java:673)
2018-07-05\T\13:12:52.150 [ERROR] at org.apache.maven.plugin.surefire.booterclient.ForkStarter.fork(ForkStarter.java:535)
2018-07-05\T\13:12:52.151 [ERROR] at org.apache.maven.plugin.surefire.booterclient.ForkStarter.access$700(ForkStarter.java:116)
2018-07-05\T\13:12:52.151 [ERROR] at org.apache.maven.plugin.surefire.booterclient.ForkStarter$2.call(ForkStarter.java:431)
2018-07-05\T\13:12:52.151 [ERROR] at org.apache.maven.plugin.surefire.booterclient.ForkStarter$2.call(ForkStarter.java:408)
2018-07-05\T\13:12:52.151 [ERROR] at java.util.concurrent.FutureTask.run(FutureTask.java:266)
2018-07-05\T\13:12:52.152 [ERROR] at java.util.concurrent.ThreadPoolExecutor.runWorker(ThreadPoolExecutor.java:1149)
2018-07-05\T\13:12:52.152 [ERROR] at java.util.concurrent.ThreadPoolExecutor$Worker.run(ThreadPoolExecutor.java:624)
2018-07-05\T\13:12:52.152 [ERROR] at java.lang.Thread.run(Thread.java:748)
2018-07-05\T\13:12:52.152 [ERROR] -> [Help 1]
2018-07-05\T\13:12:52.152 [ERROR]
2018-07-05\T\13:12:52.152 [ERROR] To see the full stack trace of the errors, re-run Maven with the -e switch.
2018-07-05\T\13:12:52.152 [ERROR] Re-run Maven using the -X switch to enable full debug logging.
2018-07-05\T\13:12:52.152 [ERROR]
2018-07-05\T\13:12:52.152 [ERROR] For more information about the errors and possible solutions, please read the following articles:
2018-07-05\T\13:12:52.153 [ERROR] [Help 1] http://cwiki.apache.org/confluence/display/MAVEN/MojoExecutionException
2018-07-05\T\13:12:52.153 [ERROR]
2018-07-05\T\13:12:52.153 [ERROR] After correcting the problems, you can resume the build with the command
2018-07-05\T\13:12:52.153 [ERROR] mvn <goals> -rf :smoke
Build step 'Invoke top-level Maven targets' marked build as failure
Jenkins build is back to normal :
bookkeeper_release_branch_47_integrationtests #78
Posted by Apache Jenkins Server <je...@builds.apache.org>.
See <https://builds.apache.org/job/bookkeeper_release_branch_47_integrationtests/78/display/redirect>