You are viewing a plain text version of this content. The canonical link for it is here.
Posted to dev@lucene.apache.org by Policeman Jenkins Server <je...@thetaphi.de> on 2018/07/20 20:46:46 UTC

[JENKINS] Lucene-Solr-master-Linux (64bit/jdk-10) - Build # 22491 - Still Unstable!

Build: https://jenkins.thetaphi.de/job/Lucene-Solr-master-Linux/22491/
Java: 64bit/jdk-10 -XX:-UseCompressedOops -XX:+UseParallelGC

1 tests failed.
FAILED:  org.apache.solr.cloud.autoscaling.ScheduledTriggerTest.testTrigger

Error Message:
expected:<3> but was:<2>

Stack Trace:
java.lang.AssertionError: expected:<3> but was:<2>
	at __randomizedtesting.SeedInfo.seed([7EB654C5A4670BF3:1D7D62473DA878DE]:0)
	at org.junit.Assert.fail(Assert.java:93)
	at org.junit.Assert.failNotEquals(Assert.java:647)
	at org.junit.Assert.assertEquals(Assert.java:128)
	at org.junit.Assert.assertEquals(Assert.java:472)
	at org.junit.Assert.assertEquals(Assert.java:456)
	at org.apache.solr.cloud.autoscaling.ScheduledTriggerTest.scheduledTriggerTest(ScheduledTriggerTest.java:112)
	at org.apache.solr.cloud.autoscaling.ScheduledTriggerTest.testTrigger(ScheduledTriggerTest.java:65)
	at java.base/jdk.internal.reflect.NativeMethodAccessorImpl.invoke0(Native Method)
	at java.base/jdk.internal.reflect.NativeMethodAccessorImpl.invoke(NativeMethodAccessorImpl.java:62)
	at java.base/jdk.internal.reflect.DelegatingMethodAccessorImpl.invoke(DelegatingMethodAccessorImpl.java:43)
	at java.base/java.lang.reflect.Method.invoke(Method.java:564)
	at com.carrotsearch.randomizedtesting.RandomizedRunner.invoke(RandomizedRunner.java:1737)
	at com.carrotsearch.randomizedtesting.RandomizedRunner$8.evaluate(RandomizedRunner.java:934)
	at com.carrotsearch.randomizedtesting.RandomizedRunner$9.evaluate(RandomizedRunner.java:970)
	at com.carrotsearch.randomizedtesting.RandomizedRunner$10.evaluate(RandomizedRunner.java:984)
	at com.carrotsearch.randomizedtesting.rules.SystemPropertiesRestoreRule$1.evaluate(SystemPropertiesRestoreRule.java:57)
	at org.apache.lucene.util.TestRuleSetupTeardownChained$1.evaluate(TestRuleSetupTeardownChained.java:49)
	at org.apache.lucene.util.AbstractBeforeAfterRule$1.evaluate(AbstractBeforeAfterRule.java:45)
	at org.apache.lucene.util.TestRuleThreadAndTestName$1.evaluate(TestRuleThreadAndTestName.java:48)
	at org.apache.lucene.util.TestRuleIgnoreAfterMaxFailures$1.evaluate(TestRuleIgnoreAfterMaxFailures.java:64)
	at org.apache.lucene.util.TestRuleMarkFailure$1.evaluate(TestRuleMarkFailure.java:47)
	at com.carrotsearch.randomizedtesting.rules.StatementAdapter.evaluate(StatementAdapter.java:36)
	at com.carrotsearch.randomizedtesting.ThreadLeakControl$StatementRunner.run(ThreadLeakControl.java:368)
	at com.carrotsearch.randomizedtesting.ThreadLeakControl.forkTimeoutingTask(ThreadLeakControl.java:817)
	at com.carrotsearch.randomizedtesting.ThreadLeakControl$3.evaluate(ThreadLeakControl.java:468)
	at com.carrotsearch.randomizedtesting.RandomizedRunner.runSingleTest(RandomizedRunner.java:943)
	at com.carrotsearch.randomizedtesting.RandomizedRunner$5.evaluate(RandomizedRunner.java:829)
	at com.carrotsearch.randomizedtesting.RandomizedRunner$6.evaluate(RandomizedRunner.java:879)
	at com.carrotsearch.randomizedtesting.RandomizedRunner$7.evaluate(RandomizedRunner.java:890)
	at com.carrotsearch.randomizedtesting.rules.StatementAdapter.evaluate(StatementAdapter.java:36)
	at com.carrotsearch.randomizedtesting.rules.SystemPropertiesRestoreRule$1.evaluate(SystemPropertiesRestoreRule.java:57)
	at org.apache.lucene.util.AbstractBeforeAfterRule$1.evaluate(AbstractBeforeAfterRule.java:45)
	at com.carrotsearch.randomizedtesting.rules.StatementAdapter.evaluate(StatementAdapter.java:36)
	at org.apache.lucene.util.TestRuleStoreClassName$1.evaluate(TestRuleStoreClassName.java:41)
	at com.carrotsearch.randomizedtesting.rules.NoShadowingOrOverridesOnMethodsRule$1.evaluate(NoShadowingOrOverridesOnMethodsRule.java:40)
	at com.carrotsearch.randomizedtesting.rules.NoShadowingOrOverridesOnMethodsRule$1.evaluate(NoShadowingOrOverridesOnMethodsRule.java:40)
	at com.carrotsearch.randomizedtesting.rules.StatementAdapter.evaluate(StatementAdapter.java:36)
	at com.carrotsearch.randomizedtesting.rules.StatementAdapter.evaluate(StatementAdapter.java:36)
	at org.apache.lucene.util.TestRuleAssertionsRequired$1.evaluate(TestRuleAssertionsRequired.java:53)
	at org.apache.lucene.util.TestRuleMarkFailure$1.evaluate(TestRuleMarkFailure.java:47)
	at org.apache.lucene.util.TestRuleIgnoreAfterMaxFailures$1.evaluate(TestRuleIgnoreAfterMaxFailures.java:64)
	at org.apache.lucene.util.TestRuleIgnoreTestSuites$1.evaluate(TestRuleIgnoreTestSuites.java:54)
	at com.carrotsearch.randomizedtesting.rules.StatementAdapter.evaluate(StatementAdapter.java:36)
	at com.carrotsearch.randomizedtesting.ThreadLeakControl$StatementRunner.run(ThreadLeakControl.java:368)
	at java.base/java.lang.Thread.run(Thread.java:844)




Build Log:
[...truncated 12673 lines...]
   [junit4] Suite: org.apache.solr.cloud.autoscaling.ScheduledTriggerTest
   [junit4]   2> Creating dataDir: /home/jenkins/workspace/Lucene-Solr-master-Linux/solr/build/solr-core/test/J0/temp/solr.cloud.autoscaling.ScheduledTriggerTest_7EB654C5A4670BF3-001/init-core-data-001
   [junit4]   2> 321719 INFO  (SUITE-ScheduledTriggerTest-seed#[7EB654C5A4670BF3]-worker) [    ] o.a.s.c.MiniSolrCloudCluster Starting cluster of 1 servers in /home/jenkins/workspace/Lucene-Solr-master-Linux/solr/build/solr-core/test/J0/temp/solr.cloud.autoscaling.ScheduledTriggerTest_7EB654C5A4670BF3-001/tempDir-001
   [junit4]   2> 321719 INFO  (SUITE-ScheduledTriggerTest-seed#[7EB654C5A4670BF3]-worker) [    ] o.a.s.c.ZkTestServer STARTING ZK TEST SERVER
   [junit4]   2> 321719 INFO  (Thread-835) [    ] o.a.s.c.ZkTestServer client port:0.0.0.0/0.0.0.0:0
   [junit4]   2> 321719 INFO  (Thread-835) [    ] o.a.s.c.ZkTestServer Starting server
   [junit4]   2> 321721 ERROR (Thread-835) [    ] o.a.z.s.ZooKeeperServer ZKShutdownHandler is not registered, so ZooKeeper server won't take any action on ERROR or SHUTDOWN server state changes
   [junit4]   2> 321820 INFO  (SUITE-ScheduledTriggerTest-seed#[7EB654C5A4670BF3]-worker) [    ] o.a.s.c.ZkTestServer start zk server on port:41167
   [junit4]   2> 321822 INFO  (zkConnectionManagerCallback-1076-thread-1) [    ] o.a.s.c.c.ConnectionManager zkClient has connected
   [junit4]   2> 321825 INFO  (jetty-launcher-1073-thread-1) [    ] o.e.j.s.Server jetty-9.4.11.v20180605; built: 2018-06-05T18:24:03.829Z; git: d5fc0523cfa96bfebfbda19606cad384d772f04c; jvm 10+46
   [junit4]   2> 321826 INFO  (jetty-launcher-1073-thread-1) [    ] o.e.j.s.session DefaultSessionIdManager workerName=node0
   [junit4]   2> 321826 INFO  (jetty-launcher-1073-thread-1) [    ] o.e.j.s.session No SessionScavenger set, using defaults
   [junit4]   2> 321826 INFO  (jetty-launcher-1073-thread-1) [    ] o.e.j.s.session node0 Scavenging every 660000ms
   [junit4]   2> 321826 INFO  (jetty-launcher-1073-thread-1) [    ] o.e.j.s.h.ContextHandler Started o.e.j.s.ServletContextHandler@5af9536c{/solr,null,AVAILABLE}
   [junit4]   2> 321827 INFO  (jetty-launcher-1073-thread-1) [    ] o.e.j.s.AbstractConnector Started ServerConnector@1f0806ad{SSL,[ssl, http/1.1]}{127.0.0.1:39403}
   [junit4]   2> 321827 INFO  (jetty-launcher-1073-thread-1) [    ] o.e.j.s.Server Started @321864ms
   [junit4]   2> 321827 INFO  (jetty-launcher-1073-thread-1) [    ] o.a.s.c.s.e.JettySolrRunner Jetty properties: {hostContext=/solr, hostPort=39403}
   [junit4]   2> 321827 ERROR (jetty-launcher-1073-thread-1) [    ] o.a.s.u.StartupLoggingUtils Missing Java Option solr.log.dir. Logging may be missing or incomplete.
   [junit4]   2> 321827 INFO  (jetty-launcher-1073-thread-1) [    ] o.a.s.s.SolrDispatchFilter Using logger factory org.apache.logging.slf4j.Log4jLoggerFactory
   [junit4]   2> 321828 INFO  (jetty-launcher-1073-thread-1) [    ] o.a.s.s.SolrDispatchFilter  ___      _       Welcome to Apache Solr™ version 8.0.0
   [junit4]   2> 321828 INFO  (jetty-launcher-1073-thread-1) [    ] o.a.s.s.SolrDispatchFilter / __| ___| |_ _   Starting in cloud mode on port null
   [junit4]   2> 321828 INFO  (jetty-launcher-1073-thread-1) [    ] o.a.s.s.SolrDispatchFilter \__ \/ _ \ | '_|  Install dir: null
   [junit4]   2> 321828 INFO  (jetty-launcher-1073-thread-1) [    ] o.a.s.s.SolrDispatchFilter |___/\___/_|_|    Start time: 2018-07-20T20:01:44.520056Z
   [junit4]   2> 321829 INFO  (zkConnectionManagerCallback-1078-thread-1) [    ] o.a.s.c.c.ConnectionManager zkClient has connected
   [junit4]   2> 321829 INFO  (jetty-launcher-1073-thread-1) [    ] o.a.s.s.SolrDispatchFilter solr.xml found in ZooKeeper. Loading...
   [junit4]   2> 321906 INFO  (jetty-launcher-1073-thread-1) [    ] o.a.s.c.ZkContainer Zookeeper client=127.0.0.1:41167/solr
   [junit4]   2> 321907 INFO  (zkConnectionManagerCallback-1082-thread-1) [    ] o.a.s.c.c.ConnectionManager zkClient has connected
   [junit4]   2> 321909 INFO  (zkConnectionManagerCallback-1084-thread-1) [    ] o.a.s.c.c.ConnectionManager zkClient has connected
   [junit4]   2> 321940 INFO  (jetty-launcher-1073-thread-1) [n:127.0.0.1:39403_solr    ] o.a.s.c.OverseerElectionContext I am going to be the leader 127.0.0.1:39403_solr
   [junit4]   2> 321940 INFO  (jetty-launcher-1073-thread-1) [n:127.0.0.1:39403_solr    ] o.a.s.c.Overseer Overseer (id=72161539458924547-127.0.0.1:39403_solr-n_0000000000) starting
   [junit4]   2> 321945 INFO  (zkConnectionManagerCallback-1091-thread-1) [    ] o.a.s.c.c.ConnectionManager zkClient has connected
   [junit4]   2> 321945 INFO  (jetty-launcher-1073-thread-1) [n:127.0.0.1:39403_solr    ] o.a.s.c.s.i.ZkClientClusterStateProvider Cluster at 127.0.0.1:41167/solr ready
   [junit4]   2> 321946 INFO  (OverseerStateUpdate-72161539458924547-127.0.0.1:39403_solr-n_0000000000) [    ] o.a.s.c.Overseer Starting to work on the main queue : 127.0.0.1:39403_solr
   [junit4]   2> 321946 INFO  (jetty-launcher-1073-thread-1) [n:127.0.0.1:39403_solr    ] o.a.s.c.ZkController Register node as live in ZooKeeper:/live_nodes/127.0.0.1:39403_solr
   [junit4]   2> 321946 DEBUG (OverseerAutoScalingTriggerThread-72161539458924547-127.0.0.1:39403_solr-n_0000000000) [    ] o.a.s.c.a.OverseerTriggerThread Adding .auto_add_replicas and .scheduled_maintenance triggers
   [junit4]   2> 321946 INFO  (OverseerStateUpdate-72161539458924547-127.0.0.1:39403_solr-n_0000000000) [    ] o.a.s.c.c.ZkStateReader Updated live nodes from ZooKeeper... (0) -> (1)
   [junit4]   2> 321947 DEBUG (OverseerAutoScalingTriggerThread-72161539458924547-127.0.0.1:39403_solr-n_0000000000) [    ] o.a.s.c.a.OverseerTriggerThread Refreshing /autoscaling.json with znode version 1
   [junit4]   2> 321947 INFO  (zkCallback-1090-thread-1) [    ] o.a.s.c.c.ZkStateReader Updated live nodes from ZooKeeper... (0) -> (1)
   [junit4]   2> 321947 DEBUG (OverseerAutoScalingTriggerThread-72161539458924547-127.0.0.1:39403_solr-n_0000000000) [    ] o.a.s.c.a.OverseerTriggerThread Current znodeVersion 1, lastZnodeVersion -1
   [junit4]   2> 321947 DEBUG (OverseerAutoScalingTriggerThread-72161539458924547-127.0.0.1:39403_solr-n_0000000000) [    ] o.a.s.c.a.OverseerTriggerThread Processed trigger updates upto znodeVersion 1
   [junit4]   2> 321949 DEBUG (OverseerAutoScalingTriggerThread-72161539458924547-127.0.0.1:39403_solr-n_0000000000) [    ] o.a.s.c.a.NodeLostTrigger NodeLostTrigger .auto_add_replicas - Initial livenodes: [127.0.0.1:39403_solr]
   [junit4]   2> 321949 DEBUG (OverseerAutoScalingTriggerThread-72161539458924547-127.0.0.1:39403_solr-n_0000000000) [    ] o.a.s.c.a.OverseerTriggerThread -- clean old nodeAdded markers
   [junit4]   2> 321949 DEBUG (OverseerAutoScalingTriggerThread-72161539458924547-127.0.0.1:39403_solr-n_0000000000) [    ] o.a.s.c.a.OverseerTriggerThread Current znodeVersion 1, lastZnodeVersion 1
   [junit4]   2> 321949 DEBUG (ScheduledTrigger-1368-thread-1) [    ] o.a.s.c.a.NodeLostTrigger Running NodeLostTrigger: .auto_add_replicas with currently live nodes: 1
   [junit4]   2> 321958 INFO  (jetty-launcher-1073-thread-1) [n:127.0.0.1:39403_solr    ] o.a.s.h.a.MetricsHistoryHandler No .system collection, keeping metrics history in memory.
   [junit4]   2> 321968 INFO  (jetty-launcher-1073-thread-1) [n:127.0.0.1:39403_solr    ] o.a.s.m.r.SolrJmxReporter JMX monitoring for 'solr_39403.solr.node' (registry 'solr.node') enabled at server: com.sun.jmx.mbeanserver.JmxMBeanServer@251894fe
   [junit4]   2> 321972 INFO  (jetty-launcher-1073-thread-1) [n:127.0.0.1:39403_solr    ] o.a.s.m.r.SolrJmxReporter JMX monitoring for 'solr_39403.solr.jvm' (registry 'solr.jvm') enabled at server: com.sun.jmx.mbeanserver.JmxMBeanServer@251894fe
   [junit4]   2> 321972 INFO  (jetty-launcher-1073-thread-1) [n:127.0.0.1:39403_solr    ] o.a.s.m.r.SolrJmxReporter JMX monitoring for 'solr_39403.solr.jetty' (registry 'solr.jetty') enabled at server: com.sun.jmx.mbeanserver.JmxMBeanServer@251894fe
   [junit4]   2> 321973 INFO  (jetty-launcher-1073-thread-1) [n:127.0.0.1:39403_solr    ] o.a.s.c.CorePropertiesLocator Found 0 core definitions underneath /home/jenkins/workspace/Lucene-Solr-master-Linux/solr/build/solr-core/test/J0/temp/solr.cloud.autoscaling.ScheduledTriggerTest_7EB654C5A4670BF3-001/tempDir-001/node1/.
   [junit4]   2> 321981 INFO  (zkConnectionManagerCallback-1094-thread-1) [    ] o.a.s.c.c.ConnectionManager zkClient has connected
   [junit4]   2> 321984 INFO  (zkConnectionManagerCallback-1099-thread-1) [    ] o.a.s.c.c.ConnectionManager zkClient has connected
   [junit4]   2> 321985 INFO  (SUITE-ScheduledTriggerTest-seed#[7EB654C5A4670BF3]-worker) [    ] o.a.s.c.c.ZkStateReader Updated live nodes from ZooKeeper... (0) -> (1)
   [junit4]   2> 321985 INFO  (SUITE-ScheduledTriggerTest-seed#[7EB654C5A4670BF3]-worker) [    ] o.a.s.c.s.i.ZkClientClusterStateProvider Cluster at 127.0.0.1:41167/solr ready
   [junit4]   2> 321996 WARN  (TEST-ScheduledTriggerTest.testIgnoredEvent-seed#[7EB654C5A4670BF3]) [    ] o.a.s.c.a.ScheduledTrigger ScheduledTrigger was not able to run event at scheduled time: 2018-07-19T20:01:44.684Z. Now: 2018-07-20T20:01:44.686Z
   [junit4]   2> 322949 DEBUG (ScheduledTrigger-1368-thread-3) [    ] o.a.s.c.a.NodeLostTrigger Running NodeLostTrigger: .auto_add_replicas with currently live nodes: 1
   [junit4]   2> 323950 DEBUG (ScheduledTrigger-1368-thread-4) [    ] o.a.s.c.a.NodeLostTrigger Running NodeLostTrigger: .auto_add_replicas with currently live nodes: 1
   [junit4]   2> 324950 DEBUG (ScheduledTrigger-1368-thread-3) [    ] o.a.s.c.a.NodeLostTrigger Running NodeLostTrigger: .auto_add_replicas with currently live nodes: 1
   [junit4]   2> 325950 DEBUG (ScheduledTrigger-1368-thread-4) [    ] o.a.s.c.a.NodeLostTrigger Running NodeLostTrigger: .auto_add_replicas with currently live nodes: 1
   [junit4]   2> 326950 DEBUG (ScheduledTrigger-1368-thread-3) [    ] o.a.s.c.a.NodeLostTrigger Running NodeLostTrigger: .auto_add_replicas with currently live nodes: 1
   [junit4]   2> 327950 DEBUG (ScheduledTrigger-1368-thread-4) [    ] o.a.s.c.a.NodeLostTrigger Running NodeLostTrigger: .auto_add_replicas with currently live nodes: 1
   [junit4]   2> 328001 WARN  (TEST-ScheduledTriggerTest.testTrigger-seed#[7EB654C5A4670BF3]) [    ] o.a.s.c.a.ScheduledTrigger ScheduledTrigger was not able to run event at scheduled time: 2018-07-20T20:01:47.692Z. Now: 2018-07-20T20:01:50.691Z
   [junit4]   2> 328950 DEBUG (ScheduledTrigger-1368-thread-3) [    ] o.a.s.c.a.NodeLostTrigger Running NodeLostTrigger: .auto_add_replicas with currently live nodes: 1
   [junit4]   2> 329951 DEBUG (ScheduledTrigger-1368-thread-4) [    ] o.a.s.c.a.NodeLostTrigger Running NodeLostTrigger: .auto_add_replicas with currently live nodes: 1
   [junit4]   2> 330951 DEBUG (ScheduledTrigger-1368-thread-3) [    ] o.a.s.c.a.NodeLostTrigger Running NodeLostTrigger: .auto_add_replicas with currently live nodes: 1
   [junit4]   2> 331001 WARN  (TEST-ScheduledTriggerTest.testTrigger-seed#[7EB654C5A4670BF3]) [    ] o.a.s.c.a.ScheduledTrigger ScheduledTrigger was not able to run event at scheduled time: 2018-07-20T20:01:50.692Z. Now: 2018-07-20T20:01:53.691Z
   [junit4]   2> NOTE: reproduce with: ant test  -Dtestcase=ScheduledTriggerTest -Dtests.method=testTrigger -Dtests.seed=7EB654C5A4670BF3 -Dtests.multiplier=3 -Dtests.slow=true -Dtests.locale=fr-CD -Dtests.timezone=MST -Dtests.asserts=true -Dtests.file.encoding=UTF-8
   [junit4] FAILURE 9.01s J0 | ScheduledTriggerTest.testTrigger <<<
   [junit4]    > Throwable #1: java.lang.AssertionError: expected:<3> but was:<2>
   [junit4]    > 	at __randomizedtesting.SeedInfo.seed([7EB654C5A4670BF3:1D7D62473DA878DE]:0)
   [junit4]    > 	at org.apache.solr.cloud.autoscaling.ScheduledTriggerTest.scheduledTriggerTest(ScheduledTriggerTest.java:112)
   [junit4]    > 	at org.apache.solr.cloud.autoscaling.ScheduledTriggerTest.testTrigger(ScheduledTriggerTest.java:65)
   [junit4]    > 	at java.base/jdk.internal.reflect.NativeMethodAccessorImpl.invoke0(Native Method)
   [junit4]    > 	at java.base/jdk.internal.reflect.NativeMethodAccessorImpl.invoke(NativeMethodAccessorImpl.java:62)
   [junit4]    > 	at java.base/jdk.internal.reflect.DelegatingMethodAccessorImpl.invoke(DelegatingMethodAccessorImpl.java:43)
   [junit4]    > 	at java.base/java.lang.reflect.Method.invoke(Method.java:564)
   [junit4]    > 	at java.base/java.lang.Thread.run(Thread.java:844)
   [junit4]   2> 331005 INFO  (jetty-closer-1074-thread-1) [    ] o.e.j.s.AbstractConnector Stopped ServerConnector@1f0806ad{SSL,[ssl, http/1.1]}{127.0.0.1:0}
   [junit4]   2> 331005 INFO  (jetty-closer-1074-thread-1) [    ] o.a.s.c.CoreContainer Shutting down CoreContainer instance=759956935
   [junit4]   2> 331005 INFO  (jetty-closer-1074-thread-1) [    ] o.a.s.m.SolrMetricManager Closing metric reporters for registry=solr.node, tag=null
   [junit4]   2> 331005 INFO  (jetty-closer-1074-thread-1) [    ] o.a.s.m.r.SolrJmxReporter Closing reporter [org.apache.solr.metrics.reporters.SolrJmxReporter@35cd7e2b: rootName = solr_39403, domain = solr.node, service url = null, agent id = null] for registry solr.node / com.codahale.metrics.MetricRegistry@2ebbb203
   [junit4]   2> 331009 INFO  (jetty-closer-1074-thread-1) [    ] o.a.s.m.SolrMetricManager Closing metric reporters for registry=solr.jvm, tag=null
   [junit4]   2> 331009 INFO  (jetty-closer-1074-thread-1) [    ] o.a.s.m.r.SolrJmxReporter Closing reporter [org.apache.solr.metrics.reporters.SolrJmxReporter@61307af9: rootName = solr_39403, domain = solr.jvm, service url = null, agent id = null] for registry solr.jvm / com.codahale.metrics.MetricRegistry@5491f72f
   [junit4]   2> 331010 INFO  (jetty-closer-1074-thread-1) [    ] o.a.s.m.SolrMetricManager Closing metric reporters for registry=solr.jetty, tag=null
   [junit4]   2> 331010 INFO  (jetty-closer-1074-thread-1) [    ] o.a.s.m.r.SolrJmxReporter Closing reporter [org.apache.solr.metrics.reporters.SolrJmxReporter@42a616bf: rootName = solr_39403, domain = solr.jetty, service url = null, agent id = null] for registry solr.jetty / com.codahale.metrics.MetricRegistry@138f104c
   [junit4]   2> 331012 INFO  (jetty-closer-1074-thread-1) [    ] o.a.s.c.ZkController Remove node as live in ZooKeeper:/live_nodes/127.0.0.1:39403_solr
   [junit4]   2> 331012 INFO  (jetty-closer-1074-thread-1) [    ] o.a.s.m.SolrMetricManager Closing metric reporters for registry=solr.cluster, tag=null
   [junit4]   2> 331012 INFO  (jetty-closer-1074-thread-1) [    ] o.a.s.c.TransientSolrCoreCacheDefault Allocating transient cache for 2147483647 transient cores
   [junit4]   2> 331012 INFO  (zkCallback-1090-thread-1) [    ] o.a.s.c.c.ZkStateReader Updated live nodes from ZooKeeper... (1) -> (0)
   [junit4]   2> 331012 INFO  (zkCallback-1083-thread-1) [    ] o.a.s.c.c.ZkStateReader Updated live nodes from ZooKeeper... (1) -> (0)
   [junit4]   2> 331012 INFO  (jetty-closer-1074-thread-1) [    ] o.a.s.c.Overseer Overseer (id=72161539458924547-127.0.0.1:39403_solr-n_0000000000) closing
   [junit4]   2> 331012 INFO  (OverseerStateUpdate-72161539458924547-127.0.0.1:39403_solr-n_0000000000) [    ] o.a.s.c.Overseer Overseer Loop exiting : 127.0.0.1:39403_solr
   [junit4]   2> 331012 WARN  (OverseerAutoScalingTriggerThread-72161539458924547-127.0.0.1:39403_solr-n_0000000000) [    ] o.a.s.c.a.OverseerTriggerThread OverseerTriggerThread woken up but we are closed, exiting.
   [junit4]   2> 331013 DEBUG (jetty-closer-1074-thread-1) [    ] o.a.s.c.a.ScheduledTriggers Shutting down scheduled thread pool executor now
   [junit4]   2> 331013 DEBUG (jetty-closer-1074-thread-1) [    ] o.a.s.c.a.ScheduledTriggers Shutting down action executor now
   [junit4]   2> 331013 DEBUG (jetty-closer-1074-thread-1) [    ] o.a.s.c.a.ScheduledTriggers Awaiting termination for action executor
   [junit4]   2> 331013 DEBUG (jetty-closer-1074-thread-1) [    ] o.a.s.c.a.ScheduledTriggers Awaiting termination for scheduled thread pool executor
   [junit4]   2> 331013 DEBUG (jetty-closer-1074-thread-1) [    ] o.a.s.c.a.ScheduledTriggers ScheduledTriggers closed completely
   [junit4]   2> 331013 DEBUG (jetty-closer-1074-thread-1) [    ] o.a.s.c.a.OverseerTriggerThread OverseerTriggerThread has been closed explicitly
   [junit4]   2> 331014 INFO  (jetty-closer-1074-thread-1) [    ] o.e.j.s.h.ContextHandler Stopped o.e.j.s.ServletContextHandler@5af9536c{/solr,null,UNAVAILABLE}
   [junit4]   2> 331014 INFO  (jetty-closer-1074-thread-1) [    ] o.e.j.s.session node0 Stopped scavenging
   [junit4]   2> 331014 ERROR (SUITE-ScheduledTriggerTest-seed#[7EB654C5A4670BF3]-worker) [    ] o.a.z.s.ZooKeeperServer ZKShutdownHandler is not registered, so ZooKeeper server won't take any action on ERROR or SHUTDOWN server state changes
   [junit4]   2> 331014 INFO  (SUITE-ScheduledTriggerTest-seed#[7EB654C5A4670BF3]-worker) [    ] o.a.s.c.ZkTestServer connecting to 127.0.0.1:41167 41167
   [junit4]   2> 331164 INFO  (Thread-835) [    ] o.a.s.c.ZkTestServer connecting to 127.0.0.1:41167 41167
   [junit4]   2> 331165 WARN  (Thread-835) [    ] o.a.s.c.ZkTestServer Watch limit violations: 
   [junit4]   2> Maximum concurrent create/delete watches above limit:
   [junit4]   2> 
   [junit4]   2> 	3	/solr/aliases.json
   [junit4]   2> 
   [junit4]   2> Maximum concurrent data watches above limit:
   [junit4]   2> 
   [junit4]   2> 	3	/solr/clusterstate.json
   [junit4]   2> 	3	/solr/clusterprops.json
   [junit4]   2> 
   [junit4]   2> Maximum concurrent children watches above limit:
   [junit4]   2> 
   [junit4]   2> 	3	/solr/live_nodes
   [junit4]   2> 	3	/solr/collections
   [junit4]   2> 
   [junit4]   2> NOTE: leaving temporary files on disk at: /home/jenkins/workspace/Lucene-Solr-master-Linux/solr/build/solr-core/test/J0/temp/solr.cloud.autoscaling.ScheduledTriggerTest_7EB654C5A4670BF3-001
   [junit4]   2> Jul 20, 2018 8:01:53 PM com.carrotsearch.randomizedtesting.ThreadLeakControl checkThreadLeaks
   [junit4]   2> WARNING: Will linger awaiting termination of 1 leaked thread(s).
   [junit4]   2> NOTE: test params are: codec=Lucene70, sim=Asserting(org.apache.lucene.search.similarities.AssertingSimilarity@1b4cc721), locale=fr-CD, timezone=MST
   [junit4]   2> NOTE: Linux 4.15.0-24-generic amd64/Oracle Corporation 10 (64-bit)/cpus=8,threads=1,free=251173432,total=508035072
   [junit4]   2> NOTE: All tests run in this JVM: [TestNumericTerms64, TriggerIntegrationTest, TestStressLucene, XmlUpdateRequestHandlerTest, UnloadDistributedZkTest, DistributedDebugComponentTest, TestDynamicLoading, NodeLostTriggerIntegrationTest, TestTrackingShardHandlerFactory, TestRandomDVFaceting, CollectionPropsTest, AnalyticsMergeStrategyTest, ConfigureRecoveryStrategyTest, TestUtils, CdcrBootstrapTest, TestStressUserVersions, RuleEngineTest, RequiredFieldsTest, SpellCheckCollatorTest, TestCollectionAPI, MetricsConfigTest, TestRawTransformer, TestSolrCoreParser, TestSchemaVersionResource, LoggingHandlerTest, TestBinaryResponseWriter, IgnoreCommitOptimizeUpdateProcessorFactoryTest, SuggesterFSTTest, PreAnalyzedUpdateProcessorTest, TestExactSharedStatsCache, ScheduledTriggerTest]
   [junit4] Completed [112/824 (1!)] on J0 in 9.96s, 2 tests, 1 failure <<< FAILURES!

[...truncated 44327 lines...]
[repro] Jenkins log URL: https://jenkins.thetaphi.de/job/Lucene-Solr-master-Linux/22491/consoleText

[repro] Revision: 9d9c3a0cd87832980a4745ec96fb2cd1216dcb4e

[repro] Ant options: "-Dargs=-XX:-UseCompressedOops -XX:+UseParallelGC"
[repro] Repro line:  ant test  -Dtestcase=ScheduledTriggerTest -Dtests.method=testTrigger -Dtests.seed=7EB654C5A4670BF3 -Dtests.multiplier=3 -Dtests.slow=true -Dtests.locale=fr-CD -Dtests.timezone=MST -Dtests.asserts=true -Dtests.file.encoding=UTF-8

[repro] ant clean

[...truncated 6 lines...]
[repro] Test suites by module:
[repro]    solr/core
[repro]       ScheduledTriggerTest
[repro] ant compile-test

[...truncated 3309 lines...]
[repro] ant test-nocompile -Dtests.dups=5 -Dtests.maxfailures=5 -Dtests.class="*.ScheduledTriggerTest" -Dtests.showOutput=onerror "-Dargs=-XX:-UseCompressedOops -XX:+UseParallelGC" -Dtests.seed=7EB654C5A4670BF3 -Dtests.multiplier=3 -Dtests.slow=true -Dtests.locale=fr-CD -Dtests.timezone=MST -Dtests.asserts=true -Dtests.file.encoding=UTF-8

[...truncated 81 lines...]
[repro] Failures:
[repro]   0/5 failed: org.apache.solr.cloud.autoscaling.ScheduledTriggerTest
[repro] Exiting with code 0

[...truncated 40 lines...]