You are viewing a plain text version of this content. The canonical link for it is here.
Posted to builds@cassandra.apache.org by Apache Jenkins Server <je...@builds.apache.org> on 2023/10/19 11:30:30 UTC

Build complete: Cassandra-3.0 #376 [UNSTABLE] f27c6c8e6ef021141130e5b314ff10a429563030

-------------------------------------------------------------------------------
Build Cassandra-3.0 #376 Still unstable
URL: https://ci-cassandra.apache.org/job/Cassandra-3.0/376/
-------------------------------------------------------------------------------
Changes:
No changes

-------------------------------------------------------------------------------
Failed Tests:
13 tests failed.
FAILED:  dtest-upgrade.upgrade_tests.upgrade_through_versions_test.TestProtoV3Upgrade_AllVersions_EndsAt_Trunk_HEAD.test_parallel_upgrade
FAILED:  dtest-upgrade.upgrade_tests.upgrade_through_versions_test.TestProtoV3Upgrade_AllVersions_EndsAt_Trunk_HEAD.test_parallel_upgrade_with_internode_ssl
FAILED:  dtest-upgrade.upgrade_tests.upgrade_through_versions_test.TestProtoV3Upgrade_AllVersions_RandomPartitioner_EndsAt_Trunk_HEAD.test_parallel_upgrade
FAILED:  dtest-upgrade.upgrade_tests.upgrade_through_versions_test.TestProtoV4Upgrade_AllVersions_EndsAt_Trunk_HEAD.test_parallel_upgrade_with_internode_ssl
FAILED:  dtest-upgrade.upgrade_tests.upgrade_through_versions_test.TestProtoV4Upgrade_AllVersions_RandomPartitioner_EndsAt_Trunk_HEAD.test_parallel_upgrade
FAILED:  dtest-upgrade.upgrade_tests.upgrade_through_versions_test.TestUpgrade_current_2_1_x_To_indev_3_0_x.test_bootstrap_multidc
FAILED:  dtest-upgrade.upgrade_tests.upgrade_through_versions_test.TestUpgrade_indev_3_0_x_To_indev_3_11_x.test_bootstrap_multidc
FAILED:  org.apache.cassandra.dht.tokenallocator.ReplicationAwareTokenAllocatorTest.testNewCluster
FAILED:  org.apache.cassandra.cql3.ViewComplexTest.testMVWithDifferentColumnsWithoutFlush
FAILED:  dtest.repair_tests.repair_test.TestRepair.test_dead_sync_initiator
FAILED:  dtest-novnode.repair_tests.repair_test.TestRepair.test_dead_sync_initiator
FAILED:  dtest-upgrade.upgrade_internal_auth_test.TestAuthUpgrade.test_upgrade_legacy_table
FAILED:  dtest-upgrade.upgrade_internal_auth_test.TestAuthUpgrade.test_upgrade_to_30

-------------------------------------------------------------------------------
For complete test report and logs see https://nightlies.apache.org/cassandra/Cassandra-3.0/376/