You are viewing a plain text version of this content. The canonical link for it is here.
Posted to dev@lucene.apache.org by Policeman Jenkins Server <je...@thetaphi.de> on 2016/10/27 18:13:38 UTC

[JENKINS] Lucene-Solr-master-MacOSX (64bit/jdk1.8.0) - Build # 3631 - Unstable!

Build: https://jenkins.thetaphi.de/job/Lucene-Solr-master-MacOSX/3631/
Java: 64bit/jdk1.8.0 -XX:+UseCompressedOops -XX:+UseSerialGC

1 tests failed.
FAILED:  org.apache.solr.security.BasicAuthStandaloneTest.testBasicAuth

Error Message:
Invalid json <html> <head> <meta http-equiv="Content-Type" content="text/html;charset=ISO-8859-1"/> <title>Error 401 </title> </head> <body> <h2>HTTP ERROR: 401</h2> <p>Problem accessing /solr/admin/authentication. Reason: <pre>    Bad credentials</pre></p> <hr /><a href="http://eclipse.org/jetty">Powered by Jetty:// 9.3.8.v20160314</a><hr/> </body> </html> 

Stack Trace:
java.lang.AssertionError: Invalid json <html>
<head>
<meta http-equiv="Content-Type" content="text/html;charset=ISO-8859-1"/>
<title>Error 401 </title>
</head>
<body>
<h2>HTTP ERROR: 401</h2>
<p>Problem accessing /solr/admin/authentication. Reason:
<pre>    Bad credentials</pre></p>
<hr /><a href="http://eclipse.org/jetty">Powered by Jetty:// 9.3.8.v20160314</a><hr/>
</body>
</html>

	at __randomizedtesting.SeedInfo.seed([8AF86C43DEB2E839:36961A517AE16B43]:0)
	at org.junit.Assert.fail(Assert.java:93)
	at org.apache.solr.security.BasicAuthIntegrationTest.verifySecurityStatus(BasicAuthIntegrationTest.java:256)
	at org.apache.solr.security.BasicAuthIntegrationTest.verifySecurityStatus(BasicAuthIntegrationTest.java:237)
	at org.apache.solr.security.BasicAuthStandaloneTest.testBasicAuth(BasicAuthStandaloneTest.java:103)
	at sun.reflect.NativeMethodAccessorImpl.invoke0(Native Method)
	at sun.reflect.NativeMethodAccessorImpl.invoke(NativeMethodAccessorImpl.java:62)
	at sun.reflect.DelegatingMethodAccessorImpl.invoke(DelegatingMethodAccessorImpl.java:43)
	at java.lang.reflect.Method.invoke(Method.java:498)
	at com.carrotsearch.randomizedtesting.RandomizedRunner.invoke(RandomizedRunner.java:1713)
	at com.carrotsearch.randomizedtesting.RandomizedRunner$8.evaluate(RandomizedRunner.java:907)
	at com.carrotsearch.randomizedtesting.RandomizedRunner$9.evaluate(RandomizedRunner.java:943)
	at com.carrotsearch.randomizedtesting.RandomizedRunner$10.evaluate(RandomizedRunner.java:957)
	at com.carrotsearch.randomizedtesting.rules.SystemPropertiesRestoreRule$1.evaluate(SystemPropertiesRestoreRule.java:57)
	at org.apache.lucene.util.TestRuleSetupTeardownChained$1.evaluate(TestRuleSetupTeardownChained.java:49)
	at org.apache.lucene.util.AbstractBeforeAfterRule$1.evaluate(AbstractBeforeAfterRule.java:45)
	at org.apache.lucene.util.TestRuleThreadAndTestName$1.evaluate(TestRuleThreadAndTestName.java:48)
	at org.apache.lucene.util.TestRuleIgnoreAfterMaxFailures$1.evaluate(TestRuleIgnoreAfterMaxFailures.java:64)
	at org.apache.lucene.util.TestRuleMarkFailure$1.evaluate(TestRuleMarkFailure.java:47)
	at com.carrotsearch.randomizedtesting.rules.StatementAdapter.evaluate(StatementAdapter.java:36)
	at com.carrotsearch.randomizedtesting.ThreadLeakControl$StatementRunner.run(ThreadLeakControl.java:367)
	at com.carrotsearch.randomizedtesting.ThreadLeakControl.forkTimeoutingTask(ThreadLeakControl.java:811)
	at com.carrotsearch.randomizedtesting.ThreadLeakControl$3.evaluate(ThreadLeakControl.java:462)
	at com.carrotsearch.randomizedtesting.RandomizedRunner.runSingleTest(RandomizedRunner.java:916)
	at com.carrotsearch.randomizedtesting.RandomizedRunner$5.evaluate(RandomizedRunner.java:802)
	at com.carrotsearch.randomizedtesting.RandomizedRunner$6.evaluate(RandomizedRunner.java:852)
	at com.carrotsearch.randomizedtesting.RandomizedRunner$7.evaluate(RandomizedRunner.java:863)
	at com.carrotsearch.randomizedtesting.rules.StatementAdapter.evaluate(StatementAdapter.java:36)
	at com.carrotsearch.randomizedtesting.rules.SystemPropertiesRestoreRule$1.evaluate(SystemPropertiesRestoreRule.java:57)
	at org.apache.lucene.util.AbstractBeforeAfterRule$1.evaluate(AbstractBeforeAfterRule.java:45)
	at com.carrotsearch.randomizedtesting.rules.StatementAdapter.evaluate(StatementAdapter.java:36)
	at org.apache.lucene.util.TestRuleStoreClassName$1.evaluate(TestRuleStoreClassName.java:41)
	at com.carrotsearch.randomizedtesting.rules.NoShadowingOrOverridesOnMethodsRule$1.evaluate(NoShadowingOrOverridesOnMethodsRule.java:40)
	at com.carrotsearch.randomizedtesting.rules.NoShadowingOrOverridesOnMethodsRule$1.evaluate(NoShadowingOrOverridesOnMethodsRule.java:40)
	at com.carrotsearch.randomizedtesting.rules.StatementAdapter.evaluate(StatementAdapter.java:36)
	at com.carrotsearch.randomizedtesting.rules.StatementAdapter.evaluate(StatementAdapter.java:36)
	at com.carrotsearch.randomizedtesting.rules.StatementAdapter.evaluate(StatementAdapter.java:36)
	at org.apache.lucene.util.TestRuleAssertionsRequired$1.evaluate(TestRuleAssertionsRequired.java:53)
	at org.apache.lucene.util.TestRuleMarkFailure$1.evaluate(TestRuleMarkFailure.java:47)
	at org.apache.lucene.util.TestRuleIgnoreAfterMaxFailures$1.evaluate(TestRuleIgnoreAfterMaxFailures.java:64)
	at org.apache.lucene.util.TestRuleIgnoreTestSuites$1.evaluate(TestRuleIgnoreTestSuites.java:54)
	at com.carrotsearch.randomizedtesting.rules.StatementAdapter.evaluate(StatementAdapter.java:36)
	at com.carrotsearch.randomizedtesting.ThreadLeakControl$StatementRunner.run(ThreadLeakControl.java:367)
	at java.lang.Thread.run(Thread.java:745)




Build Log:
[...truncated 12475 lines...]
   [junit4] Suite: org.apache.solr.security.BasicAuthStandaloneTest
   [junit4]   2> Creating dataDir: /Users/jenkins/workspace/Lucene-Solr-master-MacOSX/solr/build/solr-core/test/J1/temp/solr.security.BasicAuthStandaloneTest_8AF86C43DEB2E839-001/init-core-data-001
   [junit4]   2> 3448823 INFO  (SUITE-BasicAuthStandaloneTest-seed#[8AF86C43DEB2E839]-worker) [    ] o.a.s.SolrTestCaseJ4 Randomized ssl (false) and clientAuth (false) via: @org.apache.solr.util.RandomizeSSL(reason=, value=NaN, ssl=NaN, clientAuth=NaN) w/ MAC_OS_X supressed clientAuth
   [junit4]   2> 3448825 INFO  (TEST-BasicAuthStandaloneTest.testBasicAuth-seed#[8AF86C43DEB2E839]) [    ] o.a.s.SolrTestCaseJ4 ###Starting testBasicAuth
   [junit4]   2> 3448830 INFO  (TEST-BasicAuthStandaloneTest.testBasicAuth-seed#[8AF86C43DEB2E839]) [    ] o.e.j.s.Server jetty-9.3.8.v20160314
   [junit4]   2> 3448832 INFO  (TEST-BasicAuthStandaloneTest.testBasicAuth-seed#[8AF86C43DEB2E839]) [    ] o.e.j.s.h.ContextHandler Started o.e.j.s.ServletContextHandler@21556ab2{/solr,null,AVAILABLE}
   [junit4]   2> 3448832 INFO  (TEST-BasicAuthStandaloneTest.testBasicAuth-seed#[8AF86C43DEB2E839]) [    ] o.e.j.s.ServerConnector Started ServerConnector@767e39eb{HTTP/1.1,[http/1.1]}{127.0.0.1:60940}
   [junit4]   2> 3448832 INFO  (TEST-BasicAuthStandaloneTest.testBasicAuth-seed#[8AF86C43DEB2E839]) [    ] o.e.j.s.Server Started @3455018ms
   [junit4]   2> 3448833 INFO  (TEST-BasicAuthStandaloneTest.testBasicAuth-seed#[8AF86C43DEB2E839]) [    ] o.a.s.c.s.e.JettySolrRunner Jetty properties: {solr.data.dir=/Users/jenkins/workspace/Lucene-Solr-master-MacOSX/solr/build/solr-core/test/J1/temp/solr.security.BasicAuthStandaloneTest_8AF86C43DEB2E839-001/inst-001/collection1/data, hostContext=/solr, hostPort=60940}
   [junit4]   2> 3448833 ERROR (TEST-BasicAuthStandaloneTest.testBasicAuth-seed#[8AF86C43DEB2E839]) [    ] o.a.s.s.StartupLoggingUtils Missing Java Option solr.log.dir. Logging may be missing or incomplete.
   [junit4]   2> 3448833 INFO  (TEST-BasicAuthStandaloneTest.testBasicAuth-seed#[8AF86C43DEB2E839]) [    ] o.a.s.s.SolrDispatchFilter  ___      _       Welcome to Apache Solr? version 7.0.0
   [junit4]   2> 3448833 INFO  (TEST-BasicAuthStandaloneTest.testBasicAuth-seed#[8AF86C43DEB2E839]) [    ] o.a.s.s.SolrDispatchFilter / __| ___| |_ _   Starting in standalone mode on port null
   [junit4]   2> 3448833 INFO  (TEST-BasicAuthStandaloneTest.testBasicAuth-seed#[8AF86C43DEB2E839]) [    ] o.a.s.s.SolrDispatchFilter \__ \/ _ \ | '_|  Install dir: null
   [junit4]   2> 3448833 INFO  (TEST-BasicAuthStandaloneTest.testBasicAuth-seed#[8AF86C43DEB2E839]) [    ] o.a.s.s.SolrDispatchFilter |___/\___/_|_|    Start time: 2016-10-27T17:48:19.375Z
   [junit4]   2> 3448834 INFO  (TEST-BasicAuthStandaloneTest.testBasicAuth-seed#[8AF86C43DEB2E839]) [    ] o.a.s.c.SolrXmlConfig Loading container configuration from /Users/jenkins/workspace/Lucene-Solr-master-MacOSX/solr/build/solr-core/test/J1/temp/solr.security.BasicAuthStandaloneTest_8AF86C43DEB2E839-001/inst-001/solr.xml
   [junit4]   2> 3448866 INFO  (TEST-BasicAuthStandaloneTest.testBasicAuth-seed#[8AF86C43DEB2E839]) [    ] o.a.s.c.CorePropertiesLocator Found 1 core definitions underneath /Users/jenkins/workspace/Lucene-Solr-master-MacOSX/solr/build/solr-core/test/J1/temp/solr.security.BasicAuthStandaloneTest_8AF86C43DEB2E839-001/inst-001/.
   [junit4]   2> 3448866 INFO  (TEST-BasicAuthStandaloneTest.testBasicAuth-seed#[8AF86C43DEB2E839]) [    ] o.a.s.c.CorePropertiesLocator Cores are: [collection1]
   [junit4]   2> 3448878 INFO  (coreLoadExecutor-12640-thread-1) [    ] o.a.s.c.SolrConfig Using Lucene MatchVersion: 7.0.0
   [junit4]   2> 3448883 INFO  (coreLoadExecutor-12640-thread-1) [    ] o.a.s.s.IndexSchema [collection1] Schema name=minimal
   [junit4]   2> 3448886 INFO  (coreLoadExecutor-12640-thread-1) [    ] o.a.s.s.IndexSchema Loaded schema minimal/1.1 with uniqueid field id
   [junit4]   2> 3448890 INFO  (coreLoadExecutor-12640-thread-1) [    ] o.a.s.c.CoreContainer Creating SolrCore 'collection1' using configuration from instancedir /Users/jenkins/workspace/Lucene-Solr-master-MacOSX/solr/build/solr-core/test/J1/temp/solr.security.BasicAuthStandaloneTest_8AF86C43DEB2E839-001/inst-001/./collection1
   [junit4]   2> 3448890 INFO  (coreLoadExecutor-12640-thread-1) [    x:collection1] o.a.s.c.SolrCore [[collection1] ] Opening new SolrCore at [/Users/jenkins/workspace/Lucene-Solr-master-MacOSX/solr/build/solr-core/test/J1/temp/solr.security.BasicAuthStandaloneTest_8AF86C43DEB2E839-001/inst-001/collection1], dataDir=[/Users/jenkins/workspace/Lucene-Solr-master-MacOSX/solr/build/solr-core/test/J1/temp/solr.security.BasicAuthStandaloneTest_8AF86C43DEB2E839-001/inst-001/./collection1/data/]
   [junit4]   2> 3448902 INFO  (coreLoadExecutor-12640-thread-1) [    x:collection1] o.a.s.u.CommitTracker Hard AutoCommit: disabled
   [junit4]   2> 3448902 INFO  (coreLoadExecutor-12640-thread-1) [    x:collection1] o.a.s.u.CommitTracker Soft AutoCommit: disabled
   [junit4]   2> 3448913 INFO  (coreLoadExecutor-12640-thread-1) [    x:collection1] o.a.s.s.SolrIndexSearcher Opening [Searcher@5cdb8df9[collection1] main]
   [junit4]   2> 3448913 INFO  (coreLoadExecutor-12640-thread-1) [    x:collection1] o.a.s.r.ManagedResourceStorage File-based storage initialized to use dir: /Users/jenkins/workspace/Lucene-Solr-master-MacOSX/solr/build/solr-core/test/J1/temp/solr.security.BasicAuthStandaloneTest_8AF86C43DEB2E839-001/inst-001/collection1/conf
   [junit4]   2> 3448913 INFO  (coreLoadExecutor-12640-thread-1) [    x:collection1] o.a.s.h.ReplicationHandler Commits will be reserved for  10000
   [junit4]   2> 3448914 INFO  (searcherExecutor-12641-thread-1-processing-x:collection1) [    x:collection1] o.a.s.c.SolrCore [collection1] Registered new searcher Searcher@5cdb8df9[collection1] main{ExitableDirectoryReader(UninvertingDirectoryReader())}
   [junit4]   2> 3449371 INFO  (TEST-BasicAuthStandaloneTest.testBasicAuth-seed#[8AF86C43DEB2E839]) [    ] o.a.s.SolrTestCaseJ4 ####initCore
   [junit4]   2> 3449377 INFO  (TEST-BasicAuthStandaloneTest.testBasicAuth-seed#[8AF86C43DEB2E839]) [    ] o.a.s.c.SolrConfig Using Lucene MatchVersion: 7.0.0
   [junit4]   2> 3449382 INFO  (TEST-BasicAuthStandaloneTest.testBasicAuth-seed#[8AF86C43DEB2E839]) [    ] o.a.s.s.IndexSchema [null] Schema name=minimal
   [junit4]   2> 3449384 INFO  (TEST-BasicAuthStandaloneTest.testBasicAuth-seed#[8AF86C43DEB2E839]) [    ] o.a.s.s.IndexSchema Loaded schema minimal/1.1 with uniqueid field id
   [junit4]   2> 3449393 INFO  (coreLoadExecutor-12650-thread-1) [    ] o.a.s.c.SolrConfig Using Lucene MatchVersion: 7.0.0
   [junit4]   2> 3449398 INFO  (coreLoadExecutor-12650-thread-1) [    ] o.a.s.s.IndexSchema [collection1] Schema name=minimal
   [junit4]   2> 3449400 INFO  (coreLoadExecutor-12650-thread-1) [    ] o.a.s.s.IndexSchema Loaded schema minimal/1.1 with uniqueid field id
   [junit4]   2> 3449401 INFO  (coreLoadExecutor-12650-thread-1) [    ] o.a.s.c.CoreContainer Creating SolrCore 'collection1' using configuration from instancedir /Users/jenkins/workspace/Lucene-Solr-master-MacOSX/solr/build/solr-core/test/J1/temp/solr.security.BasicAuthStandaloneTest_8AF86C43DEB2E839-001/inst-001/collection1
   [junit4]   2> 3449401 INFO  (coreLoadExecutor-12650-thread-1) [    x:collection1] o.a.s.c.SolrCore [[collection1] ] Opening new SolrCore at [/Users/jenkins/workspace/Lucene-Solr-master-MacOSX/solr/build/solr-core/test/J1/temp/solr.security.BasicAuthStandaloneTest_8AF86C43DEB2E839-001/inst-001/collection1], dataDir=[/Users/jenkins/workspace/Lucene-Solr-master-MacOSX/solr/build/solr-core/test/J1/temp/solr.security.BasicAuthStandaloneTest_8AF86C43DEB2E839-001/init-core-data-001/]
   [junit4]   2> 3449408 INFO  (coreLoadExecutor-12650-thread-1) [    x:collection1] o.a.s.u.CommitTracker Hard AutoCommit: disabled
   [junit4]   2> 3449409 INFO  (coreLoadExecutor-12650-thread-1) [    x:collection1] o.a.s.u.CommitTracker Soft AutoCommit: disabled
   [junit4]   2> 3449409 INFO  (coreLoadExecutor-12650-thread-1) [    x:collection1] o.a.s.s.SolrIndexSearcher Opening [Searcher@7110f382[collection1] main]
   [junit4]   2> 3449409 INFO  (coreLoadExecutor-12650-thread-1) [    x:collection1] o.a.s.r.ManagedResourceStorage File-based storage initialized to use dir: /Users/jenkins/workspace/Lucene-Solr-master-MacOSX/solr/build/solr-core/test/J1/temp/solr.security.BasicAuthStandaloneTest_8AF86C43DEB2E839-001/inst-001/collection1/conf
   [junit4]   2> 3449409 INFO  (coreLoadExecutor-12650-thread-1) [    x:collection1] o.a.s.h.ReplicationHandler Commits will be reserved for  10000
   [junit4]   2> 3449410 INFO  (searcherExecutor-12651-thread-1-processing-x:collection1) [    x:collection1] o.a.s.c.SolrCore [collection1] Registered new searcher Searcher@7110f382[collection1] main{ExitableDirectoryReader(UninvertingDirectoryReader())}
   [junit4]   2> 3449411 INFO  (TEST-BasicAuthStandaloneTest.testBasicAuth-seed#[8AF86C43DEB2E839]) [    ] o.a.s.SolrTestCaseJ4 ####initCore end
   [junit4]   2> 3449416 INFO  (qtp482857625-46382) [    ] o.a.s.s.HttpSolrCall [admin] webapp=null path=/admin/authentication params={} status=0 QTime=0
   [junit4]   2> 3449417 INFO  (TEST-BasicAuthStandaloneTest.testBasicAuth-seed#[8AF86C43DEB2E839]) [    ] o.a.s.c.CoreContainer Security node changed, reloading security.json
   [junit4]   2> 3449443 INFO  (TEST-BasicAuthStandaloneTest.testBasicAuth-seed#[8AF86C43DEB2E839]) [    ] o.a.s.c.CoreContainer Initializing authorization plugin: solr.RuleBasedAuthorizationPlugin
   [junit4]   2> 3449444 INFO  (TEST-BasicAuthStandaloneTest.testBasicAuth-seed#[8AF86C43DEB2E839]) [    ] o.a.s.c.CoreContainer Initializing authentication plugin: solr.BasicAuthPlugin
   [junit4]   2> 3449447 INFO  (TEST-BasicAuthStandaloneTest.testBasicAuth-seed#[8AF86C43DEB2E839]) [    ] o.e.j.s.ServerConnector Stopped ServerConnector@767e39eb{HTTP/1.1,[http/1.1]}{127.0.0.1:0}
   [junit4]   2> 3449447 INFO  (TEST-BasicAuthStandaloneTest.testBasicAuth-seed#[8AF86C43DEB2E839]) [    ] o.a.s.c.CoreContainer Shutting down CoreContainer instance=2137743890
   [junit4]   2> 3449448 INFO  (coreCloseExecutor-12655-thread-1) [    x:collection1] o.a.s.c.SolrCore [collection1]  CLOSING SolrCore org.apache.solr.core.SolrCore@787f063d
   [junit4]   2> 3449453 INFO  (TEST-BasicAuthStandaloneTest.testBasicAuth-seed#[8AF86C43DEB2E839]) [    ] o.e.j.s.h.ContextHandler Stopped o.e.j.s.ServletContextHandler@21556ab2{/solr,null,UNAVAILABLE}
   [junit4]   2> 3449453 INFO  (TEST-BasicAuthStandaloneTest.testBasicAuth-seed#[8AF86C43DEB2E839]) [    ] o.a.s.SolrTestCaseJ4 ###Ending testBasicAuth
   [junit4]   2> NOTE: reproduce with: ant test  -Dtestcase=BasicAuthStandaloneTest -Dtests.method=testBasicAuth -Dtests.seed=8AF86C43DEB2E839 -Dtests.slow=true -Dtests.locale=es-PE -Dtests.timezone=Brazil/West -Dtests.asserts=true -Dtests.file.encoding=ISO-8859-1
   [junit4] FAILURE 0.74s J1 | BasicAuthStandaloneTest.testBasicAuth <<<
   [junit4]    > Throwable #1: java.lang.AssertionError: Invalid json <html>
   [junit4]    > <head>
   [junit4]    > <meta http-equiv="Content-Type" content="text/html;charset=ISO-8859-1"/>
   [junit4]    > <title>Error 401 </title>
   [junit4]    > </head>
   [junit4]    > <body>
   [junit4]    > <h2>HTTP ERROR: 401</h2>
   [junit4]    > <p>Problem accessing /solr/admin/authentication. Reason:
   [junit4]    > <pre>    Bad credentials</pre></p>
   [junit4]    > <hr /><a href="http://eclipse.org/jetty">Powered by Jetty:// 9.3.8.v20160314</a><hr/>
   [junit4]    > </body>
   [junit4]    > </html>
   [junit4]    > 	at __randomizedtesting.SeedInfo.seed([8AF86C43DEB2E839:36961A517AE16B43]:0)
   [junit4]    > 	at org.apache.solr.security.BasicAuthIntegrationTest.verifySecurityStatus(BasicAuthIntegrationTest.java:256)
   [junit4]    > 	at org.apache.solr.security.BasicAuthIntegrationTest.verifySecurityStatus(BasicAuthIntegrationTest.java:237)
   [junit4]    > 	at org.apache.solr.security.BasicAuthStandaloneTest.testBasicAuth(BasicAuthStandaloneTest.java:103)
   [junit4]    > 	at java.lang.Thread.run(Thread.java:745)
   [junit4]   2> 3449560 INFO  (SUITE-BasicAuthStandaloneTest-seed#[8AF86C43DEB2E839]-worker) [    ] o.a.s.SolrTestCaseJ4 ###deleteCore
   [junit4]   2> 3449560 INFO  (SUITE-BasicAuthStandaloneTest-seed#[8AF86C43DEB2E839]-worker) [    ] o.a.s.c.CoreContainer Shutting down CoreContainer instance=1706496023
   [junit4]   2> 3449560 INFO  (coreCloseExecutor-12657-thread-1) [    x:collection1] o.a.s.c.SolrCore [collection1]  CLOSING SolrCore org.apache.solr.core.SolrCore@714d7cc7
   [junit4]   2> NOTE: leaving temporary files on disk at: /Users/jenkins/workspace/Lucene-Solr-master-MacOSX/solr/build/solr-core/test/J1/temp/solr.security.BasicAuthStandaloneTest_8AF86C43DEB2E839-001
   [junit4]   2> NOTE: test params are: codec=Asserting(Lucene70): {}, docValues:{}, maxPointsInLeafNode=125, maxMBSortInHeap=5.301580175545539, sim=ClassicSimilarity, locale=es-PE, timezone=Brazil/West
   [junit4]   2> NOTE: Mac OS X 10.11.6 x86_64/Oracle Corporation 1.8.0_102 (64-bit)/cpus=3,threads=1,free=136727512,total=518979584
   [junit4]   2> NOTE: All tests run in this JVM: [TestLeaderInitiatedRecoveryThread, TestReplicationHandlerBackup, SolrCmdDistributorTest, LukeRequestHandlerTest, NoCacheHeaderTest, TestUseDocValuesAsStored, TestInfoStreamLogging, TestFieldCacheWithThreads, TestRangeQuery, BasicDistributedZk2Test, TestRandomRequestDistribution, OpenCloseCoreStressTest, TestConfigOverlay, RAMDirectoryFactoryTest, TestOrdValues, CreateCollectionCleanupTest, URLClassifyProcessorTest, TestRequestStatusCollectionAPI, TestCustomSort, TermVectorComponentTest, BadIndexSchemaTest, QueryParsingTest, TestManagedSchema, CacheHeaderTest, RegexBoostProcessorTest, TestDistributedGrouping, CSVRequestHandlerTest, DirectUpdateHandlerOptimizeTest, TestUtils, TestConfigSetProperties, TestSolrCloudSnapshots, ParsingFieldUpdateProcessorsTest, TestZkChroot, GraphQueryTest, CoreAdminHandlerTest, SpatialRPTFieldTypeTest, TestDFRSimilarityFactory, TestFieldCache, TestAtomicUpdateErrorCases, DeleteShardTest, SpellPossibilityIteratorTest, PreAnalyzedFieldTest, TestFieldCacheSanityChecker, BlockJoinFacetRandomTest, BufferStoreTest, SortByFunctionTest, TestCloudRecovery, CollectionsAPIDistributedZkTest, NotRequiredUniqueKeyTest, TestJoin, DeleteNodeTest, TestSearchPerf, TestExclusionRuleCollectionAccess, TestLuceneMatchVersion, TestCustomDocTransformer, TestLMJelinekMercerSimilarityFactory, DistributedDebugComponentTest, JsonLoaderTest, RequestHandlersTest, ShowFileRequestHandlerTest, RequestLoggingTest, TestSolr4Spatial, TermVectorComponentDistributedTest, FieldAnalysisRequestHandlerTest, HdfsCollectionsAPIDistributedZkTest, TestIntervalFaceting, RecoveryAfterSoftCommitTest, SharedFSAutoReplicaFailoverUtilsTest, CdcrReplicationHandlerTest, DataDrivenBlockJoinTest, TestReload, SSLMigrationTest, TestManagedResourceStorage, TestSuggestSpellingConverter, CollectionsAPISolrJTest, AddSchemaFieldsUpdateProcessorFactoryTest, TestUninvertingReader, TestSolrCloudWithDelegationTokens, TestExactStatsCache, TestReloadDeadlock, UUIDFieldTest, TestSha256AuthenticationProvider, TestTrackingShardHandlerFactory, TestTolerantUpdateProcessorRandomCloud, TestDocSet, TestSolr4Spatial2, DistributedIntervalFacetingTest, HdfsRestartWhileUpdatingTest, ClassificationUpdateProcessorFactoryTest, StressHdfsTest, TestConfigSetsAPIZkFailure, ClusterStateTest, DateMathParserTest, SolrCLIZkUtilsTest, TestSubQueryTransformerDistrib, TestFieldCollectionResource, TestMacros, ExitableDirectoryReaderTest, DistributedQueryComponentCustomSortTest, TestSolrCloudWithSecureImpersonation, DistributedFacetPivotSmallTest, LeaderInitiatedRecoveryOnCommitTest, TestNonDefinedSimilarityFactory, CircularListTest, UpdateParamsTest, HdfsThreadLeakTest, TestShardHandlerFactory, CleanupOldIndexTest, TestClassicSimilarityFactory, TestQueryTypes, TestRTimerTree, CurrencyFieldOpenExchangeTest, TestNumericTerms32, TestTrie, PKIAuthenticationIntegrationTest, DistributedSuggestComponentTest, TestSolrConfigHandlerConcurrent, TestFoldingMultitermQuery, SpatialHeatmapFacetsTest, SignatureUpdateProcessorFactoryTest, CloudMLTQParserTest, TestLeaderElectionWithEmptyReplica, SpellingQueryConverterTest, CoreAdminRequestStatusTest, TestSolrIndexConfig, TestMissingGroups, HighlighterConfigTest, DefaultValueUpdateProcessorTest, TestSimpleTrackingShardHandler, TestConfigSetsAPI, SuggestComponentTest, TestDynamicFieldCollectionResource, ScriptEngineTest, ConfigSetsAPITest, DistribCursorPagingTest, HdfsChaosMonkeyNothingIsSafeTest, TestRestoreCore, TestFieldTypeCollectionResource, SegmentsInfoRequestHandlerTest, HttpPartitionTest, CursorMarkTest, TestHdfsUpdateLog, TestSimpleQParserPlugin, UpdateRequestProcessorFactoryTest, TestRealTimeGet, MigrateRouteKeyTest, FullHLLTest, TestDistribDocBasedVersion, ShardRoutingCustomTest, ShardSplitTest, TestOverriddenPrefixQueryForCustomFieldType, BasicAuthIntegrationTest, OutOfBoxZkACLAndCredentialsProvidersTest, RestartWhileUpdatingTest, HdfsBasicDistributedZk2Test, ChaosMonkeySafeLeaderTest, UnloadDistributedZkTest, SyncSliceTest, OverseerTest, LeaderElectionIntegrationTest, TestReplicationHandler, LeaderElectionTest, TestRandomDVFaceting, ZkCLITest, TestStressVersions, StatsComponentTest, ConvertedLegacyTest, TestFiltering, BasicFunctionalityTest, TestBadConfig, HighlighterTest, DistributedQueryElevationComponentTest, CurrencyFieldXmlFileTest, SolrIndexSplitterTest, SimplePostToolTest, TestCoreDiscovery, SpellCheckCollatorTest, SuggesterTSTTest, WordBreakSolrSpellCheckerTest, TestUpdate, TestWordDelimiterFilterFactory, DocValuesMultiTest, TestSolrDeletionPolicy1, DebugComponentTest, DisMaxRequestHandlerTest, TestQueryUtils, TestWriterPerf, DocumentBuilderTest, PathHierarchyTokenizerFactoryTest, RequiredFieldsTest, FastVectorHighlighterTest, LoggingHandlerTest, TestJmxIntegration, TestCSVResponseWriter, TestAnalyzedSuggestions, TestComponentsName, SearchHandlerTest, TestQuerySenderListener, TestQuerySenderNoQuery, ResponseLogComponentTest, SolrIndexConfigTest, BadComponentTest, TestStressRecovery, ResourceLoaderTest, OpenExchangeRatesOrgProviderTest, TestSystemIdResolver, DOMUtilTest, TestLRUCache, SliceStateTest, TestRTGBase, TestCrossCoreJoin, TestDistributedMissingSort, ActionThrottleTest, AliasIntegrationTest, CdcrReplicationDistributedZkTest, CdcrRequestHandlerTest, CdcrVersionReplicationTest, CloudExitableDirectoryReaderTest, CollectionReloadTest, CollectionStateFormat2Test, CollectionTooManyReplicasTest, ConcurrentDeleteAndCreateCollectionTest, DeleteInactiveReplicaTest, DistribJoinFromCollectionTest, ForceLeaderTest, OverseerCollectionConfigSetProcessorTest, OverseerRolesTest, PeerSyncReplicationTest, SaslZkACLProviderTest, TestCloudDeleteByQuery, TestCloudInspectUtil, TestCloudPivotFacet, TestDownShardTolerantSearch, TestLocalFSCloudBackupRestore, TestLockTree, TestMiniSolrCloudCluster, TestRebalanceLeaders, TestShortCircuitedRequests, TestStressLiveNodes, TlogReplayBufferedWhileIndexingTest, TriLevelCompositeIdRoutingTest, ZkStateWriterTest, RuleEngineTest, RulesTest, TestInitParams, TestNRTOpen, TestSolrDynamicMBean, TestConfigReload, CoreMergeIndexesAdminHandlerTest, InfoHandlerTest, SecurityConfHandlerTest, StatsReloadRaceTest, DistributedFacetExistsSmallTest, DistributedFacetPivotLongTailTest, DistributedFacetPivotWhiteBoxTest, FacetPivotSmallTest, TestDistributedStatsComponentCardinality, TestCopyFieldCollectionResource, TestDynamicFieldResource, TestFieldTypeResource, TestSchemaNameResource, TestSchemaSimilarityResource, TestSolrQueryParserDefaultOperatorResource, TestManagedStopFilterFactory, EnumFieldTest, TestCloudSchemaless, TestSmileRequest, BJQParserTest, TestScoreJoinQPNoScore, TestScoreJoinQPScore, TestDFISimilarityFactory, TestPerFieldSimilarityWithDefaultOverride, TestDistribIDF, TestExactSharedStatsCache, BasicAuthStandaloneTest]
   [junit4] Completed [610/645 (1!)] on J1 in 0.77s, 1 test, 1 failure <<< FAILURES!

[...truncated 60531 lines...]