You are viewing a plain text version of this content. The canonical link for it is here.
Posted to yarn-dev@hadoop.apache.org by Apache Jenkins Server <je...@builds.apache.org> on 2015/08/25 11:39:37 UTC
Hadoop-Yarn-trunk - Build # 1037 - Still Failing
See https://builds.apache.org/job/Hadoop-Yarn-trunk/1037/
###################################################################################
########################## LAST 60 LINES OF THE CONSOLE ###########################
[...truncated 7560 lines...]
Tests run: 19, Failures: 0, Errors: 0, Skipped: 0, Time elapsed: 8.555 sec - in org.apache.hadoop.yarn.server.nodemanager.webapp.TestNMWebServicesApps
Running org.apache.hadoop.yarn.server.nodemanager.webapp.TestNMWebServer
Tests run: 3, Failures: 0, Errors: 0, Skipped: 0, Time elapsed: 2.535 sec - in org.apache.hadoop.yarn.server.nodemanager.webapp.TestNMWebServer
Results :
Tests in error:
TestContainerManagerWithLCE.initializationError ยป NoClassDefFound Lorg/apache/...
Tests run: 338, Failures: 0, Errors: 1, Skipped: 17
[INFO] ------------------------------------------------------------------------
[INFO] Reactor Summary:
[INFO]
[INFO] Apache Hadoop YARN ................................ SUCCESS [ 3.174 s]
[INFO] Apache Hadoop YARN API ............................ SUCCESS [03:41 min]
[INFO] Apache Hadoop YARN Common ......................... SUCCESS [02:52 min]
[INFO] Apache Hadoop YARN Server ......................... SUCCESS [ 0.091 s]
[INFO] Apache Hadoop YARN Server Common .................. SUCCESS [ 45.123 s]
[INFO] Apache Hadoop YARN NodeManager .................... FAILURE [07:10 min]
[INFO] Apache Hadoop YARN Web Proxy ...................... SKIPPED
[INFO] Apache Hadoop YARN ApplicationHistoryService ...... SKIPPED
[INFO] Apache Hadoop YARN ResourceManager ................ SKIPPED
[INFO] Apache Hadoop YARN Server Tests ................... SKIPPED
[INFO] Apache Hadoop YARN Client ......................... SKIPPED
[INFO] Apache Hadoop YARN SharedCacheManager ............. SKIPPED
[INFO] Apache Hadoop YARN Applications ................... SKIPPED
[INFO] Apache Hadoop YARN DistributedShell ............... SKIPPED
[INFO] Apache Hadoop YARN Unmanaged Am Launcher .......... SKIPPED
[INFO] Apache Hadoop YARN Site ........................... SKIPPED
[INFO] Apache Hadoop YARN Registry ....................... SKIPPED
[INFO] Apache Hadoop YARN Project ........................ SKIPPED
[INFO] ------------------------------------------------------------------------
[INFO] BUILD FAILURE
[INFO] ------------------------------------------------------------------------
[INFO] Total time: 14:35 min
[INFO] Finished at: 2015-08-25T09:40:37+00:00
[INFO] Final Memory: 76M/1157M
[INFO] ------------------------------------------------------------------------
[ERROR] Failed to execute goal org.apache.maven.plugins:maven-surefire-plugin:2.17:test (default-test) on project hadoop-yarn-server-nodemanager: There are test failures.
[ERROR]
[ERROR] Please refer to /home/jenkins/jenkins-slave/workspace/Hadoop-Yarn-trunk/hadoop-yarn-project/hadoop-yarn/hadoop-yarn-server/hadoop-yarn-server-nodemanager/target/surefire-reports for the individual test results.
[ERROR] -> [Help 1]
[ERROR]
[ERROR] To see the full stack trace of the errors, re-run Maven with the -e switch.
[ERROR] Re-run Maven using the -X switch to enable full debug logging.
[ERROR]
[ERROR] For more information about the errors and possible solutions, please read the following articles:
[ERROR] [Help 1] http://cwiki.apache.org/confluence/display/MAVEN/MojoFailureException
[ERROR]
[ERROR] After correcting the problems, you can resume the build with the command
[ERROR] mvn <goals> -rf :hadoop-yarn-server-nodemanager
Build step 'Execute shell' marked build as failure
Archiving artifacts
Recording test results
Updating HDFS-8900
Sending e-mails to: yarn-dev@hadoop.apache.org
Email was triggered for: Failure
Sending email for trigger: Failure
###################################################################################
############################## FAILED TESTS (if any) ##############################
1 tests failed.
FAILED: org.apache.hadoop.yarn.server.nodemanager.TestContainerManagerWithLCE.initializationError
Error Message:
Lorg/apache/hadoop/fs/FileContext;
Stack Trace:
java.lang.NoClassDefFoundError: Lorg/apache/hadoop/fs/FileContext;
at java.lang.Class.getDeclaredFields0(Native Method)
at java.lang.Class.privateGetDeclaredFields(Class.java:2397)
at java.lang.Class.getDeclaredFields(Class.java:1806)
at org.junit.runners.model.TestClass.<init>(TestClass.java:49)
at org.junit.runners.ParentRunner.<init>(ParentRunner.java:75)
at org.junit.runners.BlockJUnit4ClassRunner.<init>(BlockJUnit4ClassRunner.java:57)
at org.junit.internal.builders.JUnit4Builder.runnerForClass(JUnit4Builder.java:10)
at org.junit.runners.model.RunnerBuilder.safeRunnerForClass(RunnerBuilder.java:59)
at org.junit.internal.builders.AllDefaultPossibilitiesBuilder.runnerForClass(AllDefaultPossibilitiesBuilder.java:26)
at org.junit.runners.model.RunnerBuilder.safeRunnerForClass(RunnerBuilder.java:59)
at org.junit.internal.requests.ClassRequest.getRunner(ClassRequest.java:26)
at org.apache.maven.surefire.junit4.JUnit4Provider.execute(JUnit4Provider.java:262)
at org.apache.maven.surefire.junit4.JUnit4Provider.executeTestSet(JUnit4Provider.java:153)
at org.apache.maven.surefire.junit4.JUnit4Provider.invoke(JUnit4Provider.java:124)
at org.apache.maven.surefire.booter.ForkedBooter.invokeProviderInSameClassLoader(ForkedBooter.java:200)
at org.apache.maven.surefire.booter.ForkedBooter.runSuitesInProcess(ForkedBooter.java:153)
at org.apache.maven.surefire.booter.ForkedBooter.main(ForkedBooter.java:103)
Caused by: java.lang.ClassNotFoundException: org.apache.hadoop.fs.FileContext
at java.net.URLClassLoader$1.run(URLClassLoader.java:366)
at java.net.URLClassLoader$1.run(URLClassLoader.java:355)
at java.security.AccessController.doPrivileged(Native Method)
at java.net.URLClassLoader.findClass(URLClassLoader.java:354)
at java.lang.ClassLoader.loadClass(ClassLoader.java:425)
at sun.misc.Launcher$AppClassLoader.loadClass(Launcher.java:308)
at java.lang.ClassLoader.loadClass(ClassLoader.java:358)
at java.lang.Class.getDeclaredFields0(Native Method)
at java.lang.Class.privateGetDeclaredFields(Class.java:2397)
at java.lang.Class.getDeclaredFields(Class.java:1806)
at org.junit.runners.model.TestClass.<init>(TestClass.java:49)
at org.junit.runners.ParentRunner.<init>(ParentRunner.java:75)
at org.junit.runners.BlockJUnit4ClassRunner.<init>(BlockJUnit4ClassRunner.java:57)
at org.junit.internal.builders.JUnit4Builder.runnerForClass(JUnit4Builder.java:10)
at org.junit.runners.model.RunnerBuilder.safeRunnerForClass(RunnerBuilder.java:59)
at org.junit.internal.builders.AllDefaultPossibilitiesBuilder.runnerForClass(AllDefaultPossibilitiesBuilder.java:26)
at org.junit.runners.model.RunnerBuilder.safeRunnerForClass(RunnerBuilder.java:59)
at org.junit.internal.requests.ClassRequest.getRunner(ClassRequest.java:26)
at org.apache.maven.surefire.junit4.JUnit4Provider.execute(JUnit4Provider.java:262)
at org.apache.maven.surefire.junit4.JUnit4Provider.executeTestSet(JUnit4Provider.java:153)
at org.apache.maven.surefire.junit4.JUnit4Provider.invoke(JUnit4Provider.java:124)
at org.apache.maven.surefire.booter.ForkedBooter.invokeProviderInSameClassLoader(ForkedBooter.java:200)
at org.apache.maven.surefire.booter.ForkedBooter.runSuitesInProcess(ForkedBooter.java:153)
at org.apache.maven.surefire.booter.ForkedBooter.main(ForkedBooter.java:103)