You are viewing a plain text version of this content. The canonical link for it is here.
Posted to builds@cassandra.apache.org by Apache Jenkins Server <je...@builds.apache.org> on 2026/04/21 11:57:01 UTC

Build complete: Cassandra-trunk #2464 [ABORTED] 0c6380fd73833ab8de64c50a437624b2d1f22ada

-------------------------------------------------------------------------------
  Build Cassandra-trunk #2464 Aborted
  URL: https://ci-cassandra.apache.org/job/Cassandra-trunk/2464/
  -------------------------------------------------------------------------------
  Changes:
  No changes

  -------------------------------------------------------------------------------
  Failed Tests:
  113 tests failed.
FAILED:  dtest-latest.materialized_views_test.TestMaterializedViews.Tests / dtest-latest jdk21 17/64 / test_complex_mv_select_statements
FAILED:  dtest-latest.materialized_views_test.TestMaterializedViews.Tests / dtest-latest jdk11 17/64 / test_complex_mv_select_statements
FAILED:  dtest-novnode.secondary_indexes_test.TestSecondaryIndexes.Tests / dtest-novnode jdk17 13/64 / test_6924_dropping_ks
FAILED:  dtest-upgrade-large-novnode.upgrade_tests.upgrade_through_versions_test.TestUpgrade_current_6_0_x_To_indev_trunk.Tests / dtest-upgrade-large-novnode jdk11 6/40 / test_rolling_upgrade_with_internode_ssl
FAILED:  dtest-upgrade-large.upgrade_tests.upgrade_through_versions_test.TestUpgrade_current_6_0_x_To_indev_trunk.Tests / dtest-upgrade-large jdk11 6/40 / test_rolling_upgrade_with_internode_ssl
FAILED:  dtest-upgrade-novnode.upgrade_tests.cql_tests.TestCQLNodes2RF1_Upgrade_current_6_0_x_To_indev_trunk.Tests / dtest-upgrade-novnode jdk11 13/160 / test_conditional_delete
FAILED:  dtest-upgrade-novnode.upgrade_tests.cql_tests.TestCQLNodes2RF1_Upgrade_current_6_0_x_To_indev_trunk.Tests / dtest-upgrade-novnode jdk11 11/160 / test_conditional_update
FAILED:  dtest-upgrade-novnode.upgrade_tests.cql_tests.TestCQLNodes2RF1_Upgrade_current_6_0_x_To_indev_trunk.Tests / dtest-upgrade-novnode jdk11 12/160 / test_non_eq_conditional_update
FAILED:  dtest-upgrade-novnode.upgrade_tests.cql_tests.TestCQLNodes2RF1_Upgrade_current_6_0_x_To_indev_trunk.Tests / dtest-upgrade-novnode jdk11 14/160 / test_range_key_ordered
FAILED:  dtest-upgrade-novnode.upgrade_tests.cql_tests.TestCQLNodes3RF3_Upgrade_current_6_0_x_To_indev_trunk.Tests / dtest-upgrade-novnode jdk11 11/160 / test_exclusive_slice
FAILED:  dtest-upgrade-novnode.upgrade_tests.cql_tests.TestCQLNodes3RF3_Upgrade_current_6_0_x_To_indev_trunk.Tests / dtest-upgrade-novnode jdk11 12/160 / test_in_clause_wide_rows
FAILED:  dtest-upgrade-novnode.upgrade_tests.cql_tests.TestCQLNodes3RF3_Upgrade_current_6_0_x_To_indev_trunk.Tests / dtest-upgrade-novnode jdk11 14/160 / test_more_order_by
FAILED:  dtest-upgrade-novnode.upgrade_tests.cql_tests.TestCQLNodes3RF3_Upgrade_current_6_0_x_To_indev_trunk.Tests / dtest-upgrade-novnode jdk11 13/160 / test_order_by
FAILED:  dtest-upgrade-novnode.upgrade_tests.paging_test.TestPagingDataNodes3RF3_Upgrade_current_6_0_x_To_indev_trunk.Tests / dtest-upgrade-novnode jdk11 11/160 / test_paging_a_single_wide_row
FAILED:  dtest-upgrade-novnode.upgrade_tests.paging_test.TestPagingDataNodes3RF3_Upgrade_current_6_0_x_To_indev_trunk.Tests / dtest-upgrade-novnode jdk11 12/160 / test_paging_across_multi_wide_rows
FAILED:  dtest-upgrade-novnode.upgrade_tests.paging_test.TestPagingDataNodes3RF3_Upgrade_current_6_0_x_To_indev_trunk.Tests / dtest-upgrade-novnode jdk11 13/160 / test_paging_using_secondary_indexes
FAILED:  dtest-upgrade-novnode.upgrade_tests.paging_test.TestPagingDataNodes3RF3_Upgrade_current_6_0_x_To_indev_trunk.Tests / dtest-upgrade-novnode jdk11 14/160 / test_static_columns_paging
FAILED:  dtest-upgrade.upgrade_tests.cql_tests.TestCQLNodes2RF1_Upgrade_current_6_0_x_To_indev_trunk.Tests / dtest-upgrade jdk11 14/160 / test_batch
FAILED:  dtest-upgrade.upgrade_tests.cql_tests.TestCQLNodes2RF1_Upgrade_current_6_0_x_To_indev_trunk.Tests / dtest-upgrade jdk11 13/160 / test_count
FAILED:  dtest-upgrade.upgrade_tests.cql_tests.TestCQLNodes2RF1_Upgrade_current_6_0_x_To_indev_trunk.Tests / dtest-upgrade jdk11 12/160 / test_deletion
FAILED:  dtest-upgrade.upgrade_tests.cql_tests.TestCQLNodes2RF1_Upgrade_current_6_0_x_To_indev_trunk.Tests / dtest-upgrade jdk11 11/160 / test_nameless_index
FAILED:  dtest-upgrade.upgrade_tests.cql_tests.TestCQLNodes2RF1_Upgrade_current_6_0_x_To_indev_trunk.Tests / dtest-upgrade jdk11 7/160 / test_order_by_validation
FAILED:  dtest-upgrade.upgrade_tests.cql_tests.TestCQLNodes3RF3_Upgrade_current_5_0_x_To_indev_trunk.Tests / dtest-upgrade jdk11 10/160 / test_timestamp_and_ttl
FAILED:  dtest-upgrade.upgrade_tests.cql_tests.TestCQLNodes3RF3_Upgrade_current_6_0_x_To_indev_trunk.Tests / dtest-upgrade jdk11 13/160 / test_batch_and_list
FAILED:  dtest-upgrade.upgrade_tests.cql_tests.TestCQLNodes3RF3_Upgrade_current_6_0_x_To_indev_trunk.Tests / dtest-upgrade jdk11 14/160 / test_boolean
FAILED:  dtest-upgrade.upgrade_tests.cql_tests.TestCQLNodes3RF3_Upgrade_current_6_0_x_To_indev_trunk.Tests / dtest-upgrade jdk11 12/160 / test_collection_and_regular
FAILED:  dtest-upgrade.upgrade_tests.cql_tests.TestCQLNodes3RF3_Upgrade_current_6_0_x_To_indev_trunk.Tests / dtest-upgrade jdk11 7/160 / test_remove_range_slice
FAILED:  dtest-upgrade.upgrade_tests.cql_tests.TestCQLNodes3RF3_Upgrade_current_6_0_x_To_indev_trunk.Tests / dtest-upgrade jdk11 11/160 / test_reversed_compact_multikey
FAILED:  dtest-upgrade.upgrade_tests.paging_test.TestPagingWithModifiersNodes2RF1_Upgrade_current_6_0_x_To_indev_trunk.Tests / dtest-upgrade jdk11 7/160 / test_with_allow_filtering
FAILED:  dtest.materialized_views_test.TestMaterializedViews.Tests / dtest jdk11 17/64 / test_complex_mv_select_statements
FAILED:  org.apache.cassandra.db.compaction.CompactionStrategyManagerTest.Tests / test-latest jdk21 9/20 / testAutomaticUpgradeConcurrency-latest_jdk21_x86_64
FAILED:  org.apache.cassandra.db.compaction.CompactionTaskTest.Tests / test-oa jdk17 10/20 / testFullyExpiredSSTablesAreNotReleasedPrematurely-oa_jdk17_x86_64
FAILED:  org.apache.cassandra.db.compaction.UnifiedCompactionStrategyTest.Tests / test-cdc jdk11 13/20 / testDropExpiredSSTables-cdc_jdk11_x86_64
FAILED:  org.apache.cassandra.db.virtual.AccordDebugKeyspaceTest.Tests / test-system-keyspace-directory jdk11 14/20 / tracing-system_keyspace_directory_jdk11_x86_64
FAILED:  org.apache.cassandra.distributed.test.accord.AccordWriteInteroperabilityTest.Tests / jvm-dtest jdk11 13/16 / testBatchInsertApplyIsInteropApply[transactionalMode=full, migrated=firstPhase]-_jdk11_x86_64
FAILED:  org.apache.cassandra.index.accord.RouteIndexTest.Tests / test-compression jdk17 10/20 / test-compression_jdk17_x86_64
FAILED:  org.apache.cassandra.simulator.test.EpochStressTest.Tests / simulator-dtest jdk11 1/2 / manyEpochsAndAccordConverges-_jdk11_x86_64
FAILED:  org.apache.cassandra.simulator.test.HarrySimulatorTest.Tests / simulator-dtest jdk11 2/2 / test-_jdk11_x86_64
FAILED:  dtest-upgrade-large-novnode.upgrade_tests.upgrade_through_versions_test.TestUpgrade_current_6_0_x_To_indev_trunk.Tests / dtest-upgrade-large-novnode jdk11 1/40 / test_bootstrap
FAILED:  dtest-upgrade-large-novnode.upgrade_tests.upgrade_through_versions_test.TestUpgrade_current_6_0_x_To_indev_trunk.Tests / dtest-upgrade-large-novnode jdk11 2/40 / test_bootstrap_multidc
FAILED:  dtest-upgrade-large-novnode.upgrade_tests.upgrade_through_versions_test.TestUpgrade_current_6_0_x_To_indev_trunk.Tests / dtest-upgrade-large-novnode jdk11 3/40 / test_parallel_upgrade
FAILED:  dtest-upgrade-large-novnode.upgrade_tests.upgrade_through_versions_test.TestUpgrade_current_6_0_x_To_indev_trunk.Tests / dtest-upgrade-large-novnode jdk11 5/40 / test_parallel_upgrade_with_internode_ssl
FAILED:  dtest-upgrade-large-novnode.upgrade_tests.upgrade_through_versions_test.TestUpgrade_current_6_0_x_To_indev_trunk.Tests / dtest-upgrade-large-novnode jdk11 4/40 / test_rolling_upgrade
FAILED:  dtest-upgrade-large.upgrade_tests.upgrade_through_versions_test.TestUpgrade_current_6_0_x_To_indev_trunk.Tests / dtest-upgrade-large jdk11 1/40 / test_bootstrap
FAILED:  dtest-upgrade-large.upgrade_tests.upgrade_through_versions_test.TestUpgrade_current_6_0_x_To_indev_trunk.Tests / dtest-upgrade-large jdk11 2/40 / test_bootstrap_multidc
FAILED:  dtest-upgrade-large.upgrade_tests.upgrade_through_versions_test.TestUpgrade_current_6_0_x_To_indev_trunk.Tests / dtest-upgrade-large jdk11 3/40 / test_parallel_upgrade
FAILED:  dtest-upgrade-large.upgrade_tests.upgrade_through_versions_test.TestUpgrade_current_6_0_x_To_indev_trunk.Tests / dtest-upgrade-large jdk11 5/40 / test_parallel_upgrade_with_internode_ssl
FAILED:  dtest-upgrade-large.upgrade_tests.upgrade_through_versions_test.TestUpgrade_current_6_0_x_To_indev_trunk.Tests / dtest-upgrade-large jdk11 4/40 / test_rolling_upgrade
FAILED:  dtest-upgrade-novnode.upgrade_tests.cql_tests.TestCQLNodes2RF1_Upgrade_current_6_0_x_To_indev_trunk.Tests / dtest-upgrade-novnode jdk11 4/160 / test_conversion_functions
FAILED:  dtest-upgrade-novnode.upgrade_tests.cql_tests.TestCQLNodes2RF1_Upgrade_current_6_0_x_To_indev_trunk.Tests / dtest-upgrade-novnode jdk11 1/160 / test_edge_2i_on_complex_pk
FAILED:  dtest-upgrade-novnode.upgrade_tests.cql_tests.TestCQLNodes2RF1_Upgrade_current_6_0_x_To_indev_trunk.Tests / dtest-upgrade-novnode jdk11 2/160 / test_end_of_component_as_end_key
FAILED:  dtest-upgrade-novnode.upgrade_tests.cql_tests.TestCQLNodes2RF1_Upgrade_current_6_0_x_To_indev_trunk.Tests / dtest-upgrade-novnode jdk11 3/160 / test_ticket_5230
FAILED:  dtest-upgrade-novnode.upgrade_tests.cql_tests.TestCQLNodes3RF3_Upgrade_current_6_0_x_To_indev_trunk.Tests / dtest-upgrade-novnode jdk11 2/160 / test_dense_cf
FAILED:  dtest-upgrade-novnode.upgrade_tests.cql_tests.TestCQLNodes3RF3_Upgrade_current_6_0_x_To_indev_trunk.Tests / dtest-upgrade-novnode jdk11 1/160 / test_dynamic_cf
FAILED:  dtest-upgrade-novnode.upgrade_tests.cql_tests.TestCQLNodes3RF3_Upgrade_current_6_0_x_To_indev_trunk.Tests / dtest-upgrade-novnode jdk11 9/160 / test_indexed_with_eq
FAILED:  dtest-upgrade-novnode.upgrade_tests.cql_tests.TestCQLNodes3RF3_Upgrade_current_6_0_x_To_indev_trunk.Tests / dtest-upgrade-novnode jdk11 5/160 / test_limit_multiget
FAILED:  dtest-upgrade-novnode.upgrade_tests.cql_tests.TestCQLNodes3RF3_Upgrade_current_6_0_x_To_indev_trunk.Tests / dtest-upgrade-novnode jdk11 4/160 / test_limit_ranges
FAILED:  dtest-upgrade-novnode.upgrade_tests.cql_tests.TestCQLNodes3RF3_Upgrade_current_6_0_x_To_indev_trunk.Tests / dtest-upgrade-novnode jdk11 3/160 / test_sparse_cf
FAILED:  dtest-upgrade-novnode.upgrade_tests.paging_test.TestPagingDataNodes3RF3_Upgrade_current_6_0_x_To_indev_trunk.Tests / dtest-upgrade-novnode jdk11 9/160 / test_basic_paging
FAILED:  dtest-upgrade.upgrade_tests.cql_tests.TestCQLNodes2RF1_Upgrade_current_6_0_x_To_indev_trunk.Tests / dtest-upgrade jdk11 3/160 / test_exclusive_slice
FAILED:  dtest-upgrade.upgrade_tests.cql_tests.TestCQLNodes2RF1_Upgrade_current_6_0_x_To_indev_trunk.Tests / dtest-upgrade jdk11 4/160 / test_in_clause_wide_rows
FAILED:  dtest-upgrade.upgrade_tests.cql_tests.TestCQLNodes2RF1_Upgrade_current_6_0_x_To_indev_trunk.Tests / dtest-upgrade jdk11 1/160 / test_indexed_with_eq
FAILED:  dtest-upgrade.upgrade_tests.cql_tests.TestCQLNodes2RF1_Upgrade_current_6_0_x_To_indev_trunk.Tests / dtest-upgrade jdk11 6/160 / test_more_order_by
FAILED:  dtest-upgrade.upgrade_tests.cql_tests.TestCQLNodes2RF1_Upgrade_current_6_0_x_To_indev_trunk.Tests / dtest-upgrade jdk11 10/160 / test_null_support
FAILED:  dtest-upgrade.upgrade_tests.cql_tests.TestCQLNodes2RF1_Upgrade_current_6_0_x_To_indev_trunk.Tests / dtest-upgrade jdk11 5/160 / test_order_by
FAILED:  dtest-upgrade.upgrade_tests.cql_tests.TestCQLNodes2RF1_Upgrade_current_6_0_x_To_indev_trunk.Tests / dtest-upgrade jdk11 8/160 / test_order_by_with_in
FAILED:  dtest-upgrade.upgrade_tests.cql_tests.TestCQLNodes2RF1_Upgrade_current_6_0_x_To_indev_trunk.Tests / dtest-upgrade jdk11 9/160 / test_reversed_comparator
FAILED:  dtest-upgrade.upgrade_tests.cql_tests.TestCQLNodes2RF1_Upgrade_current_6_0_x_To_indev_trunk.Tests / dtest-upgrade jdk11 2/160 / test_select_key_in
FAILED:  dtest-upgrade.upgrade_tests.cql_tests.TestCQLNodes3RF3_Upgrade_current_6_0_x_To_indev_trunk.Tests / dtest-upgrade jdk11 4/160 / test_date
FAILED:  dtest-upgrade.upgrade_tests.cql_tests.TestCQLNodes3RF3_Upgrade_current_6_0_x_To_indev_trunk.Tests / dtest-upgrade jdk11 8/160 / test_indexes_composite
FAILED:  dtest-upgrade.upgrade_tests.cql_tests.TestCQLNodes3RF3_Upgrade_current_6_0_x_To_indev_trunk.Tests / dtest-upgrade jdk11 3/160 / test_no_clustering
FAILED:  dtest-upgrade.upgrade_tests.cql_tests.TestCQLNodes3RF3_Upgrade_current_6_0_x_To_indev_trunk.Tests / dtest-upgrade jdk11 6/160 / test_npe_composite_table_slice
FAILED:  dtest-upgrade.upgrade_tests.cql_tests.TestCQLNodes3RF3_Upgrade_current_6_0_x_To_indev_trunk.Tests / dtest-upgrade jdk11 5/160 / test_range_slice
FAILED:  dtest-upgrade.upgrade_tests.cql_tests.TestCQLNodes3RF3_Upgrade_current_6_0_x_To_indev_trunk.Tests / dtest-upgrade jdk11 9/160 / test_refuse_in_with_indexes
FAILED:  dtest-upgrade.upgrade_tests.cql_tests.TestCQLNodes3RF3_Upgrade_current_6_0_x_To_indev_trunk.Tests / dtest-upgrade jdk11 10/160 / test_reversed_compact
FAILED:  dtest-upgrade.upgrade_tests.cql_tests.TestCQLNodes3RF3_Upgrade_current_6_0_x_To_indev_trunk.Tests / dtest-upgrade jdk11 2/160 / test_row_existence
FAILED:  dtest-upgrade.upgrade_tests.paging_test.TestPagingWithModifiersNodes2RF1_Upgrade_current_6_0_x_To_indev_trunk.Tests / dtest-upgrade jdk11 6/160 / test_with_limit
FAILED:  dtest-upgrade.upgrade_tests.paging_test.TestPagingWithModifiersNodes2RF1_Upgrade_current_6_0_x_To_indev_trunk.Tests / dtest-upgrade jdk11 4/160 / test_with_order_by
FAILED:  dtest-upgrade.upgrade_tests.paging_test.TestPagingWithModifiersNodes2RF1_Upgrade_current_6_0_x_To_indev_trunk.Tests / dtest-upgrade jdk11 5/160 / test_with_order_by_reversed
FAILED:  org.apache.cassandra.distributed.test.accord.MigrationFromAccordWriteRaceTest.Tests / jvm-dtest jdk11 5/16 / testSplitAndRetryNonSerialLoggedBatchTwoTablesTwoPkeyHintedViaBatchLogRoutingFailure-_jdk11_x86_64
FAILED:  junit.framework.TestSuite.Tests / jvm-dtest jdk17 15/16 / org.apache.cassandra.distributed.test.QueriesTableTest-_jdk17_x86_64
FAILED:  org.apache.cassandra.distributed.test.QueriesTableTest.Tests / jvm-dtest jdk17 15/16 / shouldExposeCAS-_jdk17_x86_64
FAILED:  org.apache.cassandra.distributed.test.QueriesTableTest.Tests / jvm-dtest jdk17 15/16 / shouldExposeReadsAndWrites-_jdk17_x86_64
FAILED:  org.apache.cassandra.distributed.test.QueriesTableTest.Tests / jvm-dtest jdk17 15/16 / shouldExposeTransaction-_jdk17_x86_64
FAILED:  dtest-latest.bootstrap_test.TestBootstrap.Tests / dtest-latest jdk17 7/64 / test_consistent_range_movement_false_with_rf1_should_succeed
FAILED:  dtest-latest.bootstrap_test.TestBootstrap.Tests / dtest-latest jdk11 7/64 / test_consistent_range_movement_false_with_rf1_should_succeed
FAILED:  dtest-latest.bootstrap_test.TestBootstrap.Tests / dtest-latest jdk21 7/64 / test_consistent_range_movement_false_with_rf1_should_succeed
FAILED:  dtest-latest.bootstrap_test.TestBootstrap.Tests / dtest-latest jdk11 6/64 / test_consistent_range_movement_true_with_rf1_should_fail
FAILED:  dtest-latest.bootstrap_test.TestBootstrap.Tests / dtest-latest jdk21 6/64 / test_consistent_range_movement_true_with_rf1_should_fail
FAILED:  dtest-latest.bootstrap_test.TestBootstrap.Tests / dtest-latest jdk17 6/64 / test_consistent_range_movement_true_with_rf1_should_fail
FAILED:  org.apache.cassandra.distributed.test.accord.MigrationFromAccordWriteRaceTest.Tests / jvm-dtest jdk17 5/16 / testSplitAndRetryNonSerialLoggedBatchTwoTablesTwoPkeyHintedViaBatchLogRoutingFailure-_jdk17_x86_64
FAILED:  org.apache.cassandra.fuzz.topology.JournalGCTest.Tests / jvm-dtest jdk11 2/16 / journalGCTest-_jdk11_x86_64
FAILED:  org.apache.cassandra.fuzz.topology.JournalGCTest.Tests / jvm-dtest jdk17 2/16 / journalGCTest-_jdk17_x86_64
FAILED:  org.apache.cassandra.fuzz.topology.JournalGCTest.Tests / jvm-dtest jdk21 2/16 / journalGCTest-_jdk21_x86_64
FAILED:  org.apache.cassandra.distributed.test.cql3.FullAccordInteropMultiNodeTableWalkTest.Tests / jvm-dtest jdk11 11/16 / test-_jdk11_x86_64
FAILED:  org.apache.cassandra.distributed.test.cql3.FullAccordInteropMultiNodeTableWalkTest.Tests / jvm-dtest jdk21 11/16 / test-_jdk21_x86_64
FAILED:  org.apache.cassandra.distributed.test.cql3.FullAccordInteropMultiNodeTableWalkTest.Tests / jvm-dtest jdk17 11/16 / test-_jdk17_x86_64
FAILED:  junit.framework.TestSuite.Tests / jvm-dtest jdk21 5/16 / org.apache.cassandra.distributed.test.accord.MigrationFromAccordWriteRaceTest-_jdk21_x86_64
FAILED:  junit.framework.TestSuite.Tests / jvm-dtest jdk11 5/16 / org.apache.cassandra.distributed.test.accord.MigrationFromAccordWriteRaceTest-_jdk11_x86_64
FAILED:  junit.framework.TestSuite.Tests / jvm-dtest jdk17 5/16 / org.apache.cassandra.distributed.test.accord.MigrationFromAccordWriteRaceTest-_jdk17_x86_64
FAILED:  org.apache.cassandra.fuzz.topology.AccordBootstrapTest.Tests / jvm-dtest jdk21 12/16 / terminated successfully-cassandra.testtag_IS_UNDEFINED
FAILED:  org.apache.cassandra.fuzz.topology.AccordBootstrapTest.Tests / jvm-dtest jdk17 12/16 / terminated successfully-cassandra.testtag_IS_UNDEFINED
FAILED:  org.apache.cassandra.fuzz.topology.AccordBootstrapTest.Tests / jvm-dtest jdk11 12/16 / terminated successfully-cassandra.testtag_IS_UNDEFINED
FAILED:  org.apache.cassandra.simulator.test.ShortPaxosSimulationTest.Tests / simulator-dtest jdk11 2/2 / selfReconcileTest-cassandra.testtag_IS_UNDEFINED
FAILED:  org.apache.cassandra.index.accord.RouteIndexTest.Tests / test jdk21 10/20 / test-cassandra.testtag_IS_UNDEFINED
FAILED:  org.apache.cassandra.index.accord.RouteIndexTest.Tests / test-system-keyspace-directory jdk21 10/20 / test-cassandra.testtag_IS_UNDEFINED
FAILED:  org.apache.cassandra.index.accord.RouteIndexTest.Tests / test-cdc jdk11 10/20 / test-cassandra.testtag_IS_UNDEFINED
FAILED:  org.apache.cassandra.index.accord.RouteIndexTest.Tests / test-oa jdk11 10/20 / test-cassandra.testtag_IS_UNDEFINED
FAILED:  org.apache.cassandra.index.accord.RouteIndexTest.Tests / test-latest jdk21 10/20 / test-cassandra.testtag_IS_UNDEFINED
FAILED:  org.apache.cassandra.index.accord.RouteIndexTest.Tests / test-compression jdk11 10/20 / test-cassandra.testtag_IS_UNDEFINED
FAILED:  org.apache.cassandra.index.accord.RouteIndexTest.Tests / test-compression jdk21 10/20 / test-cassandra.testtag_IS_UNDEFINED
FAILED:  org.apache.cassandra.index.accord.RouteIndexTest.Tests / test jdk11 10/20 / test-cassandra.testtag_IS_UNDEFINED
FAILED:  org.apache.cassandra.distributed.upgrade.ClusterMetadataUpgradeHarryTest.Tests / jvm-dtest-upgrade jdk11 4/6 / simpleUpgradeTest-cassandra.testtag_IS_UNDEFINED

  -------------------------------------------------------------------------------
  For complete test report and logs see https://nightlies.apache.org/cassandra/Cassandra-trunk/2464/