You are viewing a plain text version of this content. The canonical link for it is here.
Posted to notifications@maven.apache.org by Apache Jenkins Server <je...@builds.apache.org> on 2012/11/16 04:45:01 UTC
Build failed in Jenkins: maven-plugins #1281
See <https://builds.apache.org/job/maven-plugins/1281/>
------------------------------------------
[...truncated 7900 lines...]
Running org.apache.maven.plugins.shade.resource.ComponentsXmlResourceTransformerTest
Tests run: 1, Failures: 0, Errors: 0, Skipped: 0, Time elapsed: 0.041 sec
Running org.apache.maven.plugins.shade.resource.XmlAppendingTransformerTest
Tests run: 1, Failures: 0, Errors: 0, Skipped: 0, Time elapsed: 0.003 sec
Results :
Tests run: 27, Failures: 0, Errors: 0, Skipped: 0
mojoSucceeded org.apache.maven.plugins:maven-surefire-plugin:2.12(default-test)
[JENKINS] Recording test results
mojoStarted org.apache.maven.plugins:maven-jar-plugin:2.4(default-jar)
2012-11-16 03:44:42.849::INFO: Shutdown hook complete
[INFO]
[INFO] --- maven-jar-plugin:2.4:jar (default-jar) @ maven-shade-plugin ---
[INFO] Building jar: <https://builds.apache.org/job/maven-plugins/ws/maven-shade-plugin/target/maven-shade-plugin-2.0.1-SNAPSHOT.jar>
mojoSucceeded org.apache.maven.plugins:maven-jar-plugin:2.4(default-jar)
mojoStarted org.apache.maven.plugins:maven-plugin-plugin:3.2(default-addPluginArtifactMetadata)
[INFO]
[INFO] --- maven-plugin-plugin:3.2:addPluginArtifactMetadata (default-addPluginArtifactMetadata) @ maven-shade-plugin ---
mojoSucceeded org.apache.maven.plugins:maven-plugin-plugin:3.2(default-addPluginArtifactMetadata)
mojoStarted org.apache.maven.plugins:maven-install-plugin:2.3.1(default-install)[INFO] Installing <https://builds.apache.org/job/maven-plugins/ws/maven-shade-plugin/target/maven-shade-plugin-2.0.1-SNAPSHOT.jar> to /home/jenkins/jenkins-slave/maven-repositories/0/org/apache/maven/plugins/maven-shade-plugin/2.0.1-SNAPSHOT/maven-shade-plugin-2.0.1-SNAPSHOT.jar
[INFO]
[INFO] --- maven-install-plugin:2.3.1:install (default-install) @ maven-shade-plugin ---
[INFO] Installing <https://builds.apache.org/job/maven-plugins/ws/maven-shade-plugin/pom.xml> to /home/jenkins/jenkins-slave/maven-repositories/0/org/apache/maven/plugins/maven-shade-plugin/2.0.1-SNAPSHOT/maven-shade-plugin-2.0.1-SNAPSHOT.pom
mojoSucceeded org.apache.maven.plugins:maven-install-plugin:2.3.1(default-install)
projectSucceeded org.apache.maven.plugins:maven-shade-plugin:2.0.1-SNAPSHOT
2012-11-16 03:44:43.849::INFO: Shutdown hook complete
Results :
Tests run: 17, Failures: 0, Errors: 0, Skipped: 0
mojoSucceeded org.apache.maven.plugins:maven-surefire-plugin:2.12(default-test)
[JENKINS] Recording test results
mojoStarted org.apache.maven.plugins:maven-jar-plugin:2.4(default-jar)
[INFO]
[INFO] --- maven-jar-plugin:2.4:jar (default-jar) @ maven-project-info-reports-plugin ---
[INFO] Building jar: <https://builds.apache.org/job/maven-plugins/ws/maven-project-info-reports-plugin/target/maven-project-info-reports-plugin-2.7-SNAPSHOT.jar>
mojoSucceeded org.apache.maven.plugins:maven-jar-plugin:2.4(default-jar)
mojoStarted org.apache.maven.plugins:maven-plugin-plugin:3.2(default-addPluginArtifactMetadata)
[INFO]
[INFO] --- maven-plugin-plugin:3.2:addPluginArtifactMetadata (default-addPluginArtifactMetadata) @ maven-project-info-reports-plugin ---
mojoSucceeded org.apache.maven.plugins:maven-plugin-plugin:3.2(default-addPluginArtifactMetadata)
mojoStarted org.apache.maven.plugins:maven-jarsigner-plugin:1.2(sign)
[INFO]
[INFO] --- maven-jarsigner-plugin:1.2:sign (sign) @ maven-project-info-reports-plugin ---
[INFO] 1 archive(s) processed
mojoSucceeded org.apache.maven.plugins:maven-jarsigner-plugin:1.2(sign)
mojoStarted org.apache.maven.plugins:maven-jarsigner-plugin:1.2(verify)
[INFO]
[INFO] --- maven-jarsigner-plugin:1.2:verify (verify) @ maven-project-info-reports-plugin ---
[INFO] 1 archive(s) processed
mojoSucceeded org.apache.maven.plugins:maven-jarsigner-plugin:1.2(verify)
mojoStarted org.apache.maven.plugins:maven-install-plugin:2.3.1(default-install)[INFO] Installing <https://builds.apache.org/job/maven-plugins/ws/maven-project-info-reports-plugin/target/maven-project-info-reports-plugin-2.7-SNAPSHOT.jar> to /home/jenkins/jenkins-slave/maven-repositories/0/org/apache/maven/plugins/maven-project-info-reports-plugin/2.7-SNAPSHOT/maven-project-info-reports-plugin-2.7-SNAPSHOT.jar
[INFO]
[INFO] --- maven-install-plugin:2.3.1:install (default-install) @ maven-project-info-reports-plugin ---
[INFO] Installing <https://builds.apache.org/job/maven-plugins/ws/maven-project-info-reports-plugin/pom.xml> to /home/jenkins/jenkins-slave/maven-repositories/0/org/apache/maven/plugins/maven-project-info-reports-plugin/2.7-SNAPSHOT/maven-project-info-reports-plugin-2.7-SNAPSHOT.pom
mojoSucceeded org.apache.maven.plugins:maven-install-plugin:2.3.1(default-install)
projectSucceeded org.apache.maven.plugins:maven-project-info-reports-plugin:2.7-SNAPSHOT
sessionEnded
[INFO] ------------------------------------------------------------------------
[INFO] Reactor Summary:
[INFO]
[INFO] Maven Plugins ..................................... SUCCESS [7.534s]
[INFO] Maven ACR Plugin .................................. SUCCESS [10.889s]
[INFO] Maven Ant Plugin .................................. SUCCESS [20.984s]
[INFO] Maven AntRun Plugin ............................... SUCCESS [4.643s]
[INFO] Maven Eclipse Plugin .............................. SUCCESS [46.504s]
[INFO] Maven Assembly Plugin ............................. SUCCESS [23.875s]
[INFO] Maven Changelog Plugin ............................ SUCCESS [16.881s]
[INFO] Maven Changes Report Plugin ....................... SUCCESS [18.641s]
[INFO] Maven Checkstyle Plugin ........................... SUCCESS [25.609s]
[INFO] Maven Clean Plugin ................................ SUCCESS [4.320s]
[INFO] Maven Compiler Plugin ............................. FAILURE [1.671s]
[INFO] Maven Dependency Plugin ........................... SUCCESS [1:30.329s]
[INFO] Maven Deploy Plugin ............................... SUCCESS [4.558s]
[INFO] Maven DOAP Plugin ................................. SUCCESS [8.307s]
[INFO] Maven Documentation Checker Plugin ................ SUCCESS [2.492s]
[INFO] Maven EAR Plugin .................................. SUCCESS [18.476s]
[INFO] Maven EJB Plugin .................................. SUCCESS [5.136s]
[INFO] Maven GPG Plugin .................................. SUCCESS [1.995s]
[INFO] Maven Help Plugin ................................. SUCCESS [4.163s]
[INFO] Maven IDEA Plugin ................................. SUCCESS [10.343s]
[INFO] Maven Install Plugin .............................. SUCCESS [6.437s]
[INFO] Maven JAR Plugin .................................. SUCCESS [3.497s]
[INFO] Maven Jarsigner Plugin ............................ SUCCESS [1.955s]
[INFO] Maven Javadoc Plugin .............................. SUCCESS [1:42.800s]
[INFO] Maven Linkcheck Plugin ............................ SUCCESS [3.660s]
[INFO] Maven One Plugin .................................. SUCCESS [2.804s]
[INFO] Maven Patch Plugin ................................ SUCCESS [1.400s]
[INFO] Maven PDF Plugin .................................. SUCCESS [13.709s]
[INFO] Maven PMD Plugin .................................. SUCCESS [16.644s]
[INFO] Maven RAR Plugin .................................. SUCCESS [3.470s]
[INFO] Maven Reactor Plugin .............................. SUCCESS [4.282s]
[INFO] Maven Repository Plugin ........................... SUCCESS [7.281s]
[INFO] Maven Resources Plugin ............................ SUCCESS [5.507s]
[INFO] Maven Site Plugin 3 ............................... SUCCESS [15.251s]
[INFO] Maven Source Plugin ............................... SUCCESS [9.784s]
[INFO] Maven Stage Plugin ................................ SUCCESS [3.465s]
[INFO] Maven Toolchains Plugin ........................... SUCCESS [2.635s]
[INFO] Maven Verifier Plugin ............................. SUCCESS [2.483s]
[INFO] Maven WAR Plugin .................................. SUCCESS [18.696s]
[INFO] SCM Publish Maven Plugin .......................... SUCCESS [9.012s]
[INFO] Maven Invoker Plugin .............................. SUCCESS [11.972s]
[INFO] Maven Project Info Reports Plugin ................. SUCCESS [20.910s]
[INFO] Maven Remote Resources Plugin ..................... SUCCESS [6.466s]
[INFO] Maven Shade Plugin ................................ SUCCESS [7.063s]
[INFO] Maven Plugins Aggregator .......................... SUCCESS [0.367s]
[INFO] ------------------------------------------------------------------------
[INFO] BUILD FAILURE
[INFO] ------------------------------------------------------------------------
[INFO] Total time: 3:29.880s (Wall Clock)
[INFO] Finished at: Fri Nov 16 03:44:46 GMT 2012
[INFO] Final Memory: 82M/542M
[INFO] ------------------------------------------------------------------------
Projects to build: [MavenProject: org.apache.maven.plugins:maven-plugins:24-SNAPSHOT @ <https://builds.apache.org/job/maven-plugins/ws/maven-plugins/pom.xml,> MavenProject: org.apache.maven.plugins:maven-acr-plugin:1.0.1-SNAPSHOT @ <https://builds.apache.org/job/maven-plugins/ws/maven-acr-plugin/pom.xml,> MavenProject: org.apache.maven.plugins:maven-ant-plugin:2.4-SNAPSHOT @ <https://builds.apache.org/job/maven-plugins/ws/maven-ant-plugin/pom.xml,> MavenProject: org.apache.maven.plugins:maven-antrun-plugin:1.8-SNAPSHOT @ <https://builds.apache.org/job/maven-plugins/ws/maven-antrun-plugin/pom.xml,> MavenProject: org.apache.maven.plugins:maven-eclipse-plugin:2.10-SNAPSHOT @ <https://builds.apache.org/job/maven-plugins/ws/maven-eclipse-plugin/pom.xml,> MavenProject: org.apache.maven.plugins:maven-assembly-plugin:2.5-SNAPSHOT @ <https://builds.apache.org/job/maven-plugins/ws/maven-assembly-plugin/pom.xml,> MavenProject: org.apache.maven.plugins:maven-changelog-plugin:2.3-SNAPSHOT @ <https://builds.apache.org/job/maven-plugins/ws/maven-changelog-plugin/pom.xml,> MavenProject: org.apache.maven.plugins:maven-changes-plugin:2.9-SNAPSHOT @ <https://builds.apache.org/job/maven-plugins/ws/maven-changes-plugin/pom.xml,> MavenProject: org.apache.maven.plugins:maven-checkstyle-plugin:2.10-SNAPSHOT @ <https://builds.apache.org/job/maven-plugins/ws/maven-checkstyle-plugin/pom.xml,> MavenProject: org.apache.maven.plugins:maven-clean-plugin:2.6-SNAPSHOT @ <https://builds.apache.org/job/maven-plugins/ws/maven-clean-plugin/pom.xml,> MavenProject: org.apache.maven.plugins:maven-compiler-plugin:3.1-SNAPSHOT @ <https://builds.apache.org/job/maven-plugins/ws/maven-compiler-plugin/pom.xml,> MavenProject: org.apache.maven.plugins:maven-dependency-plugin:2.7-SNAPSHOT @ <https://builds.apache.org/job/maven-plugins/ws/maven-dependency-plugin/pom.xml,> MavenProject: org.apache.maven.plugins:maven-deploy-plugin:2.8-SNAPSHOT @ <https://builds.apache.org/job/maven-plugins/ws/maven-deploy-plugin/pom.xml,> MavenProject: org.apache.maven.plugins:maven-doap-plugin:1.2-SNAPSHOT @ <https://builds.apache.org/job/maven-plugins/ws/maven-doap-plugin/pom.xml,> MavenProject: org.apache.maven.plugins:maven-docck-plugin:1.1-SNAPSHOT @ <https://builds.apache.org/job/maven-plugins/ws/maven-docck-plugin/pom.xml,> MavenProject: org.apache.maven.plugins:maven-ear-plugin:2.9-SNAPSHOT @ <https://builds.apache.org/job/maven-plugins/ws/maven-ear-plugin/pom.xml,> MavenProject: org.apache.maven.plugins:maven-ejb-plugin:2.4-SNAPSHOT @ <https://builds.apache.org/job/maven-plugins/ws/maven-ejb-plugin/pom.xml,> MavenProject: org.apache.maven.plugins:maven-gpg-plugin:1.5-SNAPSHOT @ <https://builds.apache.org/job/maven-plugins/ws/maven-gpg-plugin/pom.xml,> MavenProject: org.apache.maven.plugins:maven-help-plugin:2.2-SNAPSHOT @ <https://builds.apache.org/job/maven-plugins/ws/maven-help-plugin/pom.xml,> MavenProject: org.apache.maven.plugins:maven-idea-plugin:2.3-SNAPSHOT @ <https://builds.apache.org/job/maven-plugins/ws/maven-idea-plugin/pom.xml,> MavenProject: org.apache.maven.plugins:maven-install-plugin:2.5-SNAPSHOT @ <https://builds.apache.org/job/maven-plugins/ws/maven-install-plugin/pom.xml,> MavenProject: org.apache.maven.plugins:maven-jar-plugin:2.5-SNAPSHOT @ <https://builds.apache.org/job/maven-plugins/ws/maven-jar-plugin/pom.xml,> MavenProject: org.apache.maven.plugins:maven-jarsigner-plugin:1.3-SNAPSHOT @ <https://builds.apache.org/job/maven-plugins/ws/maven-jarsigner-plugin/pom.xml,> MavenProject: org.apache.maven.plugins:maven-javadoc-plugin:2.10-SNAPSHOT @ <https://builds.apache.org/job/maven-plugins/ws/maven-javadoc-plugin/pom.xml,> MavenProject: org.apache.maven.plugins:maven-linkcheck-plugin:1.2-SNAPSHOT @ <https://builds.apache.org/job/maven-plugins/ws/maven-linkcheck-plugin/pom.xml,> MavenProject: org.apache.maven.plugins:maven-one-plugin:1.3-SNAPSHOT @ <https://builds.apache.org/job/maven-plugins/ws/maven-one-plugin/pom.xml,> MavenProject: org.apache.maven.plugins:maven-patch-plugin:1.1.2-SNAPSHOT @ <https://builds.apache.org/job/maven-plugins/ws/maven-patch-plugin/pom.xml,> MavenProject: org.apache.maven.plugins:maven-pdf-plugin:1.3-SNAPSHOT @ <https://builds.apache.org/job/maven-plugins/ws/maven-pdf-plugin/pom.xml,> MavenProject: org.apache.maven.plugins:maven-pmd-plugin:2.8-SNAPSHOT @ <https://builds.apache.org/job/maven-plugins/ws/maven-pmd-plugin/pom.xml,> MavenProject: org.apache.maven.plugins:maven-rar-plugin:2.3-SNAPSHOT @ <https://builds.apache.org/job/maven-plugins/ws/maven-rar-plugin/pom.xml,> MavenProject: org.apache.maven.plugins:maven-reactor-plugin:1.1-SNAPSHOT @ <https://builds.apache.org/job/maven-plugins/ws/maven-reactor-plugin/pom.xml,> MavenProject: org.apache.maven.plugins:maven-repository-plugin:2.3.2-SNAPSHOT @ <https://builds.apache.org/job/maven-plugins/ws/maven-repository-plugin/pom.xml,> MavenProject: org.apache.maven.plugins:maven-resources-plugin:2.7-SNAPSHOT @ <https://builds.apache.org/job/maven-plugins/ws/maven-resources-plugin/pom.xml,> MavenProject: org.apache.maven.plugins:maven-site-plugin:3.3-SNAPSHOT @ <https://builds.apache.org/job/maven-plugins/ws/maven-site-plugin/dependency-reduced-pom.xml,> MavenProject: org.apache.maven.plugins:maven-source-plugin:2.3-SNAPSHOT @ <https://builds.apache.org/job/maven-plugins/ws/maven-source-plugin/pom.xml,> MavenProject: org.apache.maven.plugins:maven-stage-plugin:1.0-SNAPSHOT @ <https://builds.apache.org/job/maven-plugins/ws/maven-stage-plugin/pom.xml,> MavenProject: org.apache.maven.plugins:maven-toolchains-plugin:1.1-SNAPSHOT @ <https://builds.apache.org/job/maven-plugins/ws/maven-toolchains-plugin/pom.xml,> MavenProject: org.apache.maven.plugins:maven-verifier-plugin:1.1-SNAPSHOT @ <https://builds.apache.org/job/maven-plugins/ws/maven-verifier-plugin/pom.xml,> MavenProject: org.apache.maven.plugins:maven-war-plugin:2.4-SNAPSHOT @ <https://builds.apache.org/job/maven-plugins/ws/maven-war-plugin/pom.xml,> MavenProject: org.apache.maven.plugins:maven-scm-publish-plugin:1.0-SNAPSHOT @ <https://builds.apache.org/job/maven-plugins/ws/maven-scm-publish-plugin/pom.xml,> MavenProject: org.apache.maven.plugins:maven-invoker-plugin:1.8-SNAPSHOT @ <https://builds.apache.org/job/maven-plugins/ws/maven-invoker-plugin/pom.xml,> MavenProject: org.apache.maven.plugins:maven-project-info-reports-plugin:2.7-SNAPSHOT @ <https://builds.apache.org/job/maven-plugins/ws/maven-project-info-reports-plugin/pom.xml,> MavenProject: org.apache.maven.plugins:maven-remote-resources-plugin:1.5-SNAPSHOT @ <https://builds.apache.org/job/maven-plugins/ws/maven-remote-resources-plugin/pom.xml,> MavenProject: org.apache.maven.plugins:maven-shade-plugin:2.0.1-SNAPSHOT @ <https://builds.apache.org/job/maven-plugins/ws/maven-shade-plugin/pom.xml,> MavenProject: org.apache.maven.plugins:maven-plugins-aggregator:1-SNAPSHOT @ <https://builds.apache.org/job/maven-plugins/ws/pom.xml]>
[JENKINS] Archiving <https://builds.apache.org/job/maven-plugins/ws/maven-war-plugin/pom.xml> to /home/hudson/hudson/jobs/maven-plugins/modules/org.apache.maven.plugins$maven-war-plugin/builds/2012-11-16_03-41-11/archive/org.apache.maven.plugins/maven-war-plugin/2.4-SNAPSHOT/maven-war-plugin-2.4-SNAPSHOT.pom
[JENKINS] Archiving <https://builds.apache.org/job/maven-plugins/ws/maven-war-plugin/target/maven-war-plugin-2.4-SNAPSHOT.jar> to /home/hudson/hudson/jobs/maven-plugins/modules/org.apache.maven.plugins$maven-war-plugin/builds/2012-11-16_03-41-11/archive/org.apache.maven.plugins/maven-war-plugin/2.4-SNAPSHOT/maven-war-plugin-2.4-SNAPSHOT.jar
[JENKINS] Archiving <https://builds.apache.org/job/maven-plugins/ws/maven-docck-plugin/pom.xml> to /home/hudson/hudson/jobs/maven-plugins/modules/org.apache.maven.plugins$maven-docck-plugin/builds/2012-11-16_03-41-11/archive/org.apache.maven.plugins/maven-docck-plugin/1.1-SNAPSHOT/maven-docck-plugin-1.1-SNAPSHOT.pom
[JENKINS] Archiving <https://builds.apache.org/job/maven-plugins/ws/maven-docck-plugin/target/maven-docck-plugin-1.1-SNAPSHOT.jar> to /home/hudson/hudson/jobs/maven-plugins/modules/org.apache.maven.plugins$maven-docck-plugin/builds/2012-11-16_03-41-11/archive/org.apache.maven.plugins/maven-docck-plugin/1.1-SNAPSHOT/maven-docck-plugin-1.1-SNAPSHOT.jar
[JENKINS] Archiving <https://builds.apache.org/job/maven-plugins/ws/pom.xml> to /home/hudson/hudson/jobs/maven-plugins/modules/org.apache.maven.plugins$maven-plugins-aggregator/builds/2012-11-16_03-41-11/archive/org.apache.maven.plugins/maven-plugins-aggregator/1-SNAPSHOT/maven-plugins-aggregator-1-SNAPSHOT.pom
[JENKINS] Archiving <https://builds.apache.org/job/maven-plugins/ws/maven-idea-plugin/pom.xml> to /home/hudson/hudson/jobs/maven-plugins/modules/org.apache.maven.plugins$maven-idea-plugin/builds/2012-11-16_03-41-11/archive/org.apache.maven.plugins/maven-idea-plugin/2.3-SNAPSHOT/maven-idea-plugin-2.3-SNAPSHOT.pom
[JENKINS] Archiving <https://builds.apache.org/job/maven-plugins/ws/maven-idea-plugin/target/maven-idea-plugin-2.3-SNAPSHOT.jar> to /home/hudson/hudson/jobs/maven-plugins/modules/org.apache.maven.plugins$maven-idea-plugin/builds/2012-11-16_03-41-11/archive/org.apache.maven.plugins/maven-idea-plugin/2.3-SNAPSHOT/maven-idea-plugin-2.3-SNAPSHOT.jar
[JENKINS] Archiving <https://builds.apache.org/job/maven-plugins/ws/maven-toolchains-plugin/pom.xml> to /home/hudson/hudson/jobs/maven-plugins/modules/org.apache.maven.plugins$maven-toolchains-plugin/builds/2012-11-16_03-41-11/archive/org.apache.maven.plugins/maven-toolchains-plugin/1.1-SNAPSHOT/maven-toolchains-plugin-1.1-SNAPSHOT.pom
[JENKINS] Archiving <https://builds.apache.org/job/maven-plugins/ws/maven-toolchains-plugin/target/maven-toolchains-plugin-1.1-SNAPSHOT.jar> to /home/hudson/hudson/jobs/maven-plugins/modules/org.apache.maven.plugins$maven-toolchains-plugin/builds/2012-11-16_03-41-11/archive/org.apache.maven.plugins/maven-toolchains-plugin/1.1-SNAPSHOT/maven-toolchains-plugin-1.1-SNAPSHOT.jar
[JENKINS] Archiving <https://builds.apache.org/job/maven-plugins/ws/maven-pmd-plugin/pom.xml> to /home/hudson/hudson/jobs/maven-plugins/modules/org.apache.maven.plugins$maven-pmd-plugin/builds/2012-11-16_03-41-11/archive/org.apache.maven.plugins/maven-pmd-plugin/2.8-SNAPSHOT/maven-pmd-plugin-2.8-SNAPSHOT.pom
[JENKINS] Archiving <https://builds.apache.org/job/maven-plugins/ws/maven-pmd-plugin/target/maven-pmd-plugin-2.8-SNAPSHOT.jar> to /home/hudson/hudson/jobs/maven-plugins/modules/org.apache.maven.plugins$maven-pmd-plugin/builds/2012-11-16_03-41-11/archive/org.apache.maven.plugins/maven-pmd-plugin/2.8-SNAPSHOT/maven-pmd-plugin-2.8-SNAPSHOT.jar
[JENKINS] Archiving <https://builds.apache.org/job/maven-plugins/ws/maven-eclipse-plugin/pom.xml> to /home/hudson/hudson/jobs/maven-plugins/modules/org.apache.maven.plugins$maven-eclipse-plugin/builds/2012-11-16_03-41-11/archive/org.apache.maven.plugins/maven-eclipse-plugin/2.10-SNAPSHOT/maven-eclipse-plugin-2.10-SNAPSHOT.pom
[JENKINS] Archiving <https://builds.apache.org/job/maven-plugins/ws/maven-eclipse-plugin/target/maven-eclipse-plugin-2.10-SNAPSHOT.jar> to /home/hudson/hudson/jobs/maven-plugins/modules/org.apache.maven.plugins$maven-eclipse-plugin/builds/2012-11-16_03-41-11/archive/org.apache.maven.plugins/maven-eclipse-plugin/2.10-SNAPSHOT/maven-eclipse-plugin-2.10-SNAPSHOT.jar
[JENKINS] Archiving <https://builds.apache.org/job/maven-plugins/ws/maven-gpg-plugin/pom.xml> to /home/hudson/hudson/jobs/maven-plugins/modules/org.apache.maven.plugins$maven-gpg-plugin/builds/2012-11-16_03-41-11/archive/org.apache.maven.plugins/maven-gpg-plugin/1.5-SNAPSHOT/maven-gpg-plugin-1.5-SNAPSHOT.pom
[JENKINS] Archiving <https://builds.apache.org/job/maven-plugins/ws/maven-gpg-plugin/target/maven-gpg-plugin-1.5-SNAPSHOT.jar> to /home/hudson/hudson/jobs/maven-plugins/modules/org.apache.maven.plugins$maven-gpg-plugin/builds/2012-11-16_03-41-11/archive/org.apache.maven.plugins/maven-gpg-plugin/1.5-SNAPSHOT/maven-gpg-plugin-1.5-SNAPSHOT.jar
[JENKINS] Archiving <https://builds.apache.org/job/maven-plugins/ws/maven-clean-plugin/pom.xml> to /home/hudson/hudson/jobs/maven-plugins/modules/org.apache.maven.plugins$maven-clean-plugin/builds/2012-11-16_03-41-11/archive/org.apache.maven.plugins/maven-clean-plugin/2.6-SNAPSHOT/maven-clean-plugin-2.6-SNAPSHOT.pom
[JENKINS] Archiving <https://builds.apache.org/job/maven-plugins/ws/maven-clean-plugin/target/maven-clean-plugin-2.6-SNAPSHOT.jar> to /home/hudson/hudson/jobs/maven-plugins/modules/org.apache.maven.plugins$maven-clean-plugin/builds/2012-11-16_03-41-11/archive/org.apache.maven.plugins/maven-clean-plugin/2.6-SNAPSHOT/maven-clean-plugin-2.6-SNAPSHOT.jar
[JENKINS] Archiving <https://builds.apache.org/job/maven-plugins/ws/maven-jar-plugin/pom.xml> to /home/hudson/hudson/jobs/maven-plugins/modules/org.apache.maven.plugins$maven-jar-plugin/builds/2012-11-16_03-41-11/archive/org.apache.maven.plugins/maven-jar-plugin/2.5-SNAPSHOT/maven-jar-plugin-2.5-SNAPSHOT.pom
[JENKINS] Archiving <https://builds.apache.org/job/maven-plugins/ws/maven-jar-plugin/target/maven-jar-plugin-2.5-SNAPSHOT.jar> to /home/hudson/hudson/jobs/maven-plugins/modules/org.apache.maven.plugins$maven-jar-plugin/builds/2012-11-16_03-41-11/archive/org.apache.maven.plugins/maven-jar-plugin/2.5-SNAPSHOT/maven-jar-plugin-2.5-SNAPSHOT.jar
[JENKINS] Archiving <https://builds.apache.org/job/maven-plugins/ws/maven-site-plugin/dependency-reduced-pom.xml> to /home/hudson/hudson/jobs/maven-plugins/modules/org.apache.maven.plugins$maven-site-plugin/builds/2012-11-16_03-41-11/archive/org.apache.maven.plugins/maven-site-plugin/3.3-SNAPSHOT/maven-site-plugin-3.3-SNAPSHOT.pom
[JENKINS] Archiving <https://builds.apache.org/job/maven-plugins/ws/maven-site-plugin/target/maven-site-plugin-3.3-SNAPSHOT.jar> to /home/hudson/hudson/jobs/maven-plugins/modules/org.apache.maven.plugins$maven-site-plugin/builds/2012-11-16_03-41-11/archive/org.apache.maven.plugins/maven-site-plugin/3.3-SNAPSHOT/maven-site-plugin-3.3-SNAPSHOT.jar
[JENKINS] Archiving <https://builds.apache.org/job/maven-plugins/ws/maven-patch-plugin/pom.xml> to /home/hudson/hudson/jobs/maven-plugins/modules/org.apache.maven.plugins$maven-patch-plugin/builds/2012-11-16_03-41-11/archive/org.apache.maven.plugins/maven-patch-plugin/1.1.2-SNAPSHOT/maven-patch-plugin-1.1.2-SNAPSHOT.pom
[JENKINS] Archiving <https://builds.apache.org/job/maven-plugins/ws/maven-patch-plugin/target/maven-patch-plugin-1.1.2-SNAPSHOT.jar> to /home/hudson/hudson/jobs/maven-plugins/modules/org.apache.maven.plugins$maven-patch-plugin/builds/2012-11-16_03-41-11/archive/org.apache.maven.plugins/maven-patch-plugin/1.1.2-SNAPSHOT/maven-patch-plugin-1.1.2-SNAPSHOT.jar
[JENKINS] Archiving <https://builds.apache.org/job/maven-plugins/ws/maven-install-plugin/pom.xml> to /home/hudson/hudson/jobs/maven-plugins/modules/org.apache.maven.plugins$maven-install-plugin/builds/2012-11-16_03-41-11/archive/org.apache.maven.plugins/maven-install-plugin/2.5-SNAPSHOT/maven-install-plugin-2.5-SNAPSHOT.pom
[JENKINS] Archiving <https://builds.apache.org/job/maven-plugins/ws/maven-install-plugin/target/maven-install-plugin-2.5-SNAPSHOT.jar> to /home/hudson/hudson/jobs/maven-plugins/modules/org.apache.maven.plugins$maven-install-plugin/builds/2012-11-16_03-41-11/archive/org.apache.maven.plugins/maven-install-plugin/2.5-SNAPSHOT/maven-install-plugin-2.5-SNAPSHOT.jar
[JENKINS] Archiving <https://builds.apache.org/job/maven-plugins/ws/maven-antrun-plugin/pom.xml> to /home/hudson/hudson/jobs/maven-plugins/modules/org.apache.maven.plugins$maven-antrun-plugin/builds/2012-11-16_03-41-11/archive/org.apache.maven.plugins/maven-antrun-plugin/1.8-SNAPSHOT/maven-antrun-plugin-1.8-SNAPSHOT.pom
[JENKINS] Archiving <https://builds.apache.org/job/maven-plugins/ws/maven-antrun-plugin/target/maven-antrun-plugin-1.8-SNAPSHOT.jar> to /home/hudson/hudson/jobs/maven-plugins/modules/org.apache.maven.plugins$maven-antrun-plugin/builds/2012-11-16_03-41-11/archive/org.apache.maven.plugins/maven-antrun-plugin/1.8-SNAPSHOT/maven-antrun-plugin-1.8-SNAPSHOT.jar
[JENKINS] Archiving <https://builds.apache.org/job/maven-plugins/ws/maven-changes-plugin/pom.xml> to /home/hudson/hudson/jobs/maven-plugins/modules/org.apache.maven.plugins$maven-changes-plugin/builds/2012-11-16_03-41-11/archive/org.apache.maven.plugins/maven-changes-plugin/2.9-SNAPSHOT/maven-changes-plugin-2.9-SNAPSHOT.pom
[JENKINS] Archiving <https://builds.apache.org/job/maven-plugins/ws/maven-changes-plugin/target/maven-changes-plugin-2.9-SNAPSHOT.jar> to /home/hudson/hudson/jobs/maven-plugins/modules/org.apache.maven.plugins$maven-changes-plugin/builds/2012-11-16_03-41-11/archive/org.apache.maven.plugins/maven-changes-plugin/2.9-SNAPSHOT/maven-changes-plugin-2.9-SNAPSHOT.jar
[JENKINS] Archiving <https://builds.apache.org/job/maven-plugins/ws/maven-rar-plugin/pom.xml> to /home/hudson/hudson/jobs/maven-plugins/modules/org.apache.maven.plugins$maven-rar-plugin/builds/2012-11-16_03-41-11/archive/org.apache.maven.plugins/maven-rar-plugin/2.3-SNAPSHOT/maven-rar-plugin-2.3-SNAPSHOT.pom
[JENKINS] Archiving <https://builds.apache.org/job/maven-plugins/ws/maven-rar-plugin/target/maven-rar-plugin-2.3-SNAPSHOT.jar> to /home/hudson/hudson/jobs/maven-plugins/modules/org.apache.maven.plugins$maven-rar-plugin/builds/2012-11-16_03-41-11/archive/org.apache.maven.plugins/maven-rar-plugin/2.3-SNAPSHOT/maven-rar-plugin-2.3-SNAPSHOT.jar
[JENKINS] Archiving <https://builds.apache.org/job/maven-plugins/ws/maven-jarsigner-plugin/pom.xml> to /home/hudson/hudson/jobs/maven-plugins/modules/org.apache.maven.plugins$maven-jarsigner-plugin/builds/2012-11-16_03-41-11/archive/org.apache.maven.plugins/maven-jarsigner-plugin/1.3-SNAPSHOT/maven-jarsigner-plugin-1.3-SNAPSHOT.pom
[JENKINS] Archiving <https://builds.apache.org/job/maven-plugins/ws/maven-jarsigner-plugin/target/maven-jarsigner-plugin-1.3-SNAPSHOT.jar> to /home/hudson/hudson/jobs/maven-plugins/modules/org.apache.maven.plugins$maven-jarsigner-plugin/builds/2012-11-16_03-41-11/archive/org.apache.maven.plugins/maven-jarsigner-plugin/1.3-SNAPSHOT/maven-jarsigner-plugin-1.3-SNAPSHOT.jar
[JENKINS] Archiving <https://builds.apache.org/job/maven-plugins/ws/maven-ear-plugin/pom.xml> to /home/hudson/hudson/jobs/maven-plugins/modules/org.apache.maven.plugins$maven-ear-plugin/builds/2012-11-16_03-41-11/archive/org.apache.maven.plugins/maven-ear-plugin/2.9-SNAPSHOT/maven-ear-plugin-2.9-SNAPSHOT.pom
[JENKINS] Archiving <https://builds.apache.org/job/maven-plugins/ws/maven-ear-plugin/target/maven-ear-plugin-2.9-SNAPSHOT.jar> to /home/hudson/hudson/jobs/maven-plugins/modules/org.apache.maven.plugins$maven-ear-plugin/builds/2012-11-16_03-41-11/archive/org.apache.maven.plugins/maven-ear-plugin/2.9-SNAPSHOT/maven-ear-plugin-2.9-SNAPSHOT.jar
[JENKINS] Archiving <https://builds.apache.org/job/maven-plugins/ws/maven-changelog-plugin/pom.xml> to /home/hudson/hudson/jobs/maven-plugins/modules/org.apache.maven.plugins$maven-changelog-plugin/builds/2012-11-16_03-41-11/archive/org.apache.maven.plugins/maven-changelog-plugin/2.3-SNAPSHOT/maven-changelog-plugin-2.3-SNAPSHOT.pom
[JENKINS] Archiving <https://builds.apache.org/job/maven-plugins/ws/maven-changelog-plugin/target/maven-changelog-plugin-2.3-SNAPSHOT.jar> to /home/hudson/hudson/jobs/maven-plugins/modules/org.apache.maven.plugins$maven-changelog-plugin/builds/2012-11-16_03-41-11/archive/org.apache.maven.plugins/maven-changelog-plugin/2.3-SNAPSHOT/maven-changelog-plugin-2.3-SNAPSHOT.jar
[JENKINS] Archiving <https://builds.apache.org/job/maven-plugins/ws/maven-verifier-plugin/pom.xml> to /home/hudson/hudson/jobs/maven-plugins/modules/org.apache.maven.plugins$maven-verifier-plugin/builds/2012-11-16_03-41-11/archive/org.apache.maven.plugins/maven-verifier-plugin/1.1-SNAPSHOT/maven-verifier-plugin-1.1-SNAPSHOT.pom
[JENKINS] Archiving <https://builds.apache.org/job/maven-plugins/ws/maven-verifier-plugin/target/maven-verifier-plugin-1.1-SNAPSHOT.jar> to /home/hudson/hudson/jobs/maven-plugins/modules/org.apache.maven.plugins$maven-verifier-plugin/builds/2012-11-16_03-41-11/archive/org.apache.maven.plugins/maven-verifier-plugin/1.1-SNAPSHOT/maven-verifier-plugin-1.1-SNAPSHOT.jar
[JENKINS] Archiving <https://builds.apache.org/job/maven-plugins/ws/maven-ant-plugin/pom.xml> to /home/hudson/hudson/jobs/maven-plugins/modules/org.apache.maven.plugins$maven-ant-plugin/builds/2012-11-16_03-41-11/archive/org.apache.maven.plugins/maven-ant-plugin/2.4-SNAPSHOT/maven-ant-plugin-2.4-SNAPSHOT.pom
[JENKINS] Archiving <https://builds.apache.org/job/maven-plugins/ws/maven-ant-plugin/target/maven-ant-plugin-2.4-SNAPSHOT.jar> to /home/hudson/hudson/jobs/maven-plugins/modules/org.apache.maven.plugins$maven-ant-plugin/builds/2012-11-16_03-41-11/archive/org.apache.maven.plugins/maven-ant-plugin/2.4-SNAPSHOT/maven-ant-plugin-2.4-SNAPSHOT.jar
[JENKINS] Archiving <https://builds.apache.org/job/maven-plugins/ws/maven-ejb-plugin/pom.xml> to /home/hudson/hudson/jobs/maven-plugins/modules/org.apache.maven.plugins$maven-ejb-plugin/builds/2012-11-16_03-41-11/archive/org.apache.maven.plugins/maven-ejb-plugin/2.4-SNAPSHOT/maven-ejb-plugin-2.4-SNAPSHOT.pom
[JENKINS] Archiving <https://builds.apache.org/job/maven-plugins/ws/maven-ejb-plugin/target/maven-ejb-plugin-2.4-SNAPSHOT.jar> to /home/hudson/hudson/jobs/maven-plugins/modules/org.apache.maven.plugins$maven-ejb-plugin/builds/2012-11-16_03-41-11/archive/org.apache.maven.plugins/maven-ejb-plugin/2.4-SNAPSHOT/maven-ejb-plugin-2.4-SNAPSHOT.jar
[JENKINS] Archiving <https://builds.apache.org/job/maven-plugins/ws/maven-stage-plugin/pom.xml> to /home/hudson/hudson/jobs/maven-plugins/modules/org.apache.maven.plugins$maven-stage-plugin/builds/2012-11-16_03-41-11/archive/org.apache.maven.plugins/maven-stage-plugin/1.0-SNAPSHOT/maven-stage-plugin-1.0-SNAPSHOT.pom
[JENKINS] Archiving <https://builds.apache.org/job/maven-plugins/ws/maven-stage-plugin/target/maven-stage-plugin-1.0-SNAPSHOT.jar> to /home/hudson/hudson/jobs/maven-plugins/modules/org.apache.maven.plugins$maven-stage-plugin/builds/2012-11-16_03-41-11/archive/org.apache.maven.plugins/maven-stage-plugin/1.0-SNAPSHOT/maven-stage-plugin-1.0-SNAPSHOT.jar
[JENKINS] Archiving <https://builds.apache.org/job/maven-plugins/ws/maven-scm-publish-plugin/pom.xml> to /home/hudson/hudson/jobs/maven-plugins/modules/org.apache.maven.plugins$maven-scm-publish-plugin/builds/2012-11-16_03-41-11/archive/org.apache.maven.plugins/maven-scm-publish-plugin/1.0-SNAPSHOT/maven-scm-publish-plugin-1.0-SNAPSHOT.pom
[JENKINS] Archiving <https://builds.apache.org/job/maven-plugins/ws/maven-scm-publish-plugin/target/maven-scm-publish-plugin-1.0-SNAPSHOT.jar> to /home/hudson/hudson/jobs/maven-plugins/modules/org.apache.maven.plugins$maven-scm-publish-plugin/builds/2012-11-16_03-41-11/archive/org.apache.maven.plugins/maven-scm-publish-plugin/1.0-SNAPSHOT/maven-scm-publish-plugin-1.0-SNAPSHOT.jar
[JENKINS] Archiving <https://builds.apache.org/job/maven-plugins/ws/maven-compiler-plugin/pom.xml> to /home/hudson/hudson/jobs/maven-plugins/modules/org.apache.maven.plugins$maven-compiler-plugin/builds/2012-11-16_03-41-11/archive/org.apache.maven.plugins/maven-compiler-plugin/3.1-SNAPSHOT/maven-compiler-plugin-3.1-SNAPSHOT.pom
[JENKINS] Archiving <https://builds.apache.org/job/maven-plugins/ws/maven-reactor-plugin/pom.xml> to /home/hudson/hudson/jobs/maven-plugins/modules/org.apache.maven.plugins$maven-reactor-plugin/builds/2012-11-16_03-41-11/archive/org.apache.maven.plugins/maven-reactor-plugin/1.1-SNAPSHOT/maven-reactor-plugin-1.1-SNAPSHOT.pom
[JENKINS] Archiving <https://builds.apache.org/job/maven-plugins/ws/maven-reactor-plugin/target/maven-reactor-plugin-1.1-SNAPSHOT.jar> to /home/hudson/hudson/jobs/maven-plugins/modules/org.apache.maven.plugins$maven-reactor-plugin/builds/2012-11-16_03-41-11/archive/org.apache.maven.plugins/maven-reactor-plugin/1.1-SNAPSHOT/maven-reactor-plugin-1.1-SNAPSHOT.jar
[JENKINS] Archiving <https://builds.apache.org/job/maven-plugins/ws/maven-doap-plugin/pom.xml> to /home/hudson/hudson/jobs/maven-plugins/modules/org.apache.maven.plugins$maven-doap-plugin/builds/2012-11-16_03-41-11/archive/org.apache.maven.plugins/maven-doap-plugin/1.2-SNAPSHOT/maven-doap-plugin-1.2-SNAPSHOT.pom
[JENKINS] Archiving <https://builds.apache.org/job/maven-plugins/ws/maven-doap-plugin/target/maven-doap-plugin-1.2-SNAPSHOT.jar> to /home/hudson/hudson/jobs/maven-plugins/modules/org.apache.maven.plugins$maven-doap-plugin/builds/2012-11-16_03-41-11/archive/org.apache.maven.plugins/maven-doap-plugin/1.2-SNAPSHOT/maven-doap-plugin-1.2-SNAPSHOT.jar
[JENKINS] Archiving <https://builds.apache.org/job/maven-plugins/ws/maven-checkstyle-plugin/pom.xml> to /home/hudson/hudson/jobs/maven-plugins/modules/org.apache.maven.plugins$maven-checkstyle-plugin/builds/2012-11-16_03-41-11/archive/org.apache.maven.plugins/maven-checkstyle-plugin/2.10-SNAPSHOT/maven-checkstyle-plugin-2.10-SNAPSHOT.pom
[JENKINS] Archiving <https://builds.apache.org/job/maven-plugins/ws/maven-checkstyle-plugin/target/maven-checkstyle-plugin-2.10-SNAPSHOT.jar> to /home/hudson/hudson/jobs/maven-plugins/modules/org.apache.maven.plugins$maven-checkstyle-plugin/builds/2012-11-16_03-41-11/archive/org.apache.maven.plugins/maven-checkstyle-plugin/2.10-SNAPSHOT/maven-checkstyle-plugin-2.10-SNAPSHOT.jar
[JENKINS] Archiving <https://builds.apache.org/job/maven-plugins/ws/maven-source-plugin/pom.xml> to /home/hudson/hudson/jobs/maven-plugins/modules/org.apache.maven.plugins$maven-source-plugin/builds/2012-11-16_03-41-11/archive/org.apache.maven.plugins/maven-source-plugin/2.3-SNAPSHOT/maven-source-plugin-2.3-SNAPSHOT.pom
[JENKINS] Archiving <https://builds.apache.org/job/maven-plugins/ws/maven-source-plugin/target/maven-source-plugin-2.3-SNAPSHOT.jar> to /home/hudson/hudson/jobs/maven-plugins/modules/org.apache.maven.plugins$maven-source-plugin/builds/2012-11-16_03-41-11/archive/org.apache.maven.plugins/maven-source-plugin/2.3-SNAPSHOT/maven-source-plugin-2.3-SNAPSHOT.jar
[JENKINS] Archiving <https://builds.apache.org/job/maven-plugins/ws/maven-dependency-plugin/pom.xml> to /home/hudson/hudson/jobs/maven-plugins/modules/org.apache.maven.plugins$maven-dependency-plugin/builds/2012-11-16_03-41-11/archive/org.apache.maven.plugins/maven-dependency-plugin/2.7-SNAPSHOT/maven-dependency-plugin-2.7-SNAPSHOT.pom
[JENKINS] Archiving <https://builds.apache.org/job/maven-plugins/ws/maven-dependency-plugin/target/maven-dependency-plugin-2.7-SNAPSHOT.jar> to /home/hudson/hudson/jobs/maven-plugins/modules/org.apache.maven.plugins$maven-dependency-plugin/builds/2012-11-16_03-41-11/archive/org.apache.maven.plugins/maven-dependency-plugin/2.7-SNAPSHOT/maven-dependency-plugin-2.7-SNAPSHOT.jar
[JENKINS] Archiving <https://builds.apache.org/job/maven-plugins/ws/maven-javadoc-plugin/pom.xml> to /home/hudson/hudson/jobs/maven-plugins/modules/org.apache.maven.plugins$maven-javadoc-plugin/builds/2012-11-16_03-41-11/archive/org.apache.maven.plugins/maven-javadoc-plugin/2.10-SNAPSHOT/maven-javadoc-plugin-2.10-SNAPSHOT.pom
[JENKINS] Archiving <https://builds.apache.org/job/maven-plugins/ws/maven-javadoc-plugin/target/maven-javadoc-plugin-2.10-SNAPSHOT.jar> to /home/hudson/hudson/jobs/maven-plugins/modules/org.apache.maven.plugins$maven-javadoc-plugin/builds/2012-11-16_03-41-11/archive/org.apache.maven.plugins/maven-javadoc-plugin/2.10-SNAPSHOT/maven-javadoc-plugin-2.10-SNAPSHOT.jar
[JENKINS] Archiving <https://builds.apache.org/job/maven-plugins/ws/maven-deploy-plugin/pom.xml> to /home/hudson/hudson/jobs/maven-plugins/modules/org.apache.maven.plugins$maven-deploy-plugin/builds/2012-11-16_03-41-11/archive/org.apache.maven.plugins/maven-deploy-plugin/2.8-SNAPSHOT/maven-deploy-plugin-2.8-SNAPSHOT.pom
[JENKINS] Archiving <https://builds.apache.org/job/maven-plugins/ws/maven-deploy-plugin/target/maven-deploy-plugin-2.8-SNAPSHOT.jar> to /home/hudson/hudson/jobs/maven-plugins/modules/org.apache.maven.plugins$maven-deploy-plugin/builds/2012-11-16_03-41-11/archive/org.apache.maven.plugins/maven-deploy-plugin/2.8-SNAPSHOT/maven-deploy-plugin-2.8-SNAPSHOT.jar
[JENKINS] Archiving <https://builds.apache.org/job/maven-plugins/ws/maven-acr-plugin/pom.xml> to /home/hudson/hudson/jobs/maven-plugins/modules/org.apache.maven.plugins$maven-acr-plugin/builds/2012-11-16_03-41-11/archive/org.apache.maven.plugins/maven-acr-plugin/1.0.1-SNAPSHOT/maven-acr-plugin-1.0.1-SNAPSHOT.pom
[JENKINS] Archiving <https://builds.apache.org/job/maven-plugins/ws/maven-acr-plugin/target/maven-acr-plugin-1.0.1-SNAPSHOT.jar> to /home/hudson/hudson/jobs/maven-plugins/modules/org.apache.maven.plugins$maven-acr-plugin/builds/2012-11-16_03-41-11/archive/org.apache.maven.plugins/maven-acr-plugin/1.0.1-SNAPSHOT/maven-acr-plugin-1.0.1-SNAPSHOT.jar
[JENKINS] Archiving <https://builds.apache.org/job/maven-plugins/ws/maven-repository-plugin/pom.xml> to /home/hudson/hudson/jobs/maven-plugins/modules/org.apache.maven.plugins$maven-repository-plugin/builds/2012-11-16_03-41-11/archive/org.apache.maven.plugins/maven-repository-plugin/2.3.2-SNAPSHOT/maven-repository-plugin-2.3.2-SNAPSHOT.pom
[JENKINS] Archiving <https://builds.apache.org/job/maven-plugins/ws/maven-repository-plugin/target/maven-repository-plugin-2.3.2-SNAPSHOT.jar> to /home/hudson/hudson/jobs/maven-plugins/modules/org.apache.maven.plugins$maven-repository-plugin/builds/2012-11-16_03-41-11/archive/org.apache.maven.plugins/maven-repository-plugin/2.3.2-SNAPSHOT/maven-repository-plugin-2.3.2-SNAPSHOT.jar
[JENKINS] Archiving <https://builds.apache.org/job/maven-plugins/ws/maven-assembly-plugin/pom.xml> to /home/hudson/hudson/jobs/maven-plugins/modules/org.apache.maven.plugins$maven-assembly-plugin/builds/2012-11-16_03-41-11/archive/org.apache.maven.plugins/maven-assembly-plugin/2.5-SNAPSHOT/maven-assembly-plugin-2.5-SNAPSHOT.pom
[JENKINS] Archiving <https://builds.apache.org/job/maven-plugins/ws/maven-assembly-plugin/target/maven-assembly-plugin-2.5-SNAPSHOT.jar> to /home/hudson/hudson/jobs/maven-plugins/modules/org.apache.maven.plugins$maven-assembly-plugin/builds/2012-11-16_03-41-11/archive/org.apache.maven.plugins/maven-assembly-plugin/2.5-SNAPSHOT/maven-assembly-plugin-2.5-SNAPSHOT.jar
[JENKINS] Archiving <https://builds.apache.org/job/maven-plugins/ws/maven-project-info-reports-plugin/pom.xml> to /home/hudson/hudson/jobs/maven-plugins/modules/org.apache.maven.plugins$maven-project-info-reports-plugin/builds/2012-11-16_03-41-11/archive/org.apache.maven.plugins/maven-project-info-reports-plugin/2.7-SNAPSHOT/maven-project-info-reports-plugin-2.7-SNAPSHOT.pom
[JENKINS] Archiving <https://builds.apache.org/job/maven-plugins/ws/maven-project-info-reports-plugin/target/maven-project-info-reports-plugin-2.7-SNAPSHOT.jar> to /home/hudson/hudson/jobs/maven-plugins/modules/org.apache.maven.plugins$maven-project-info-reports-plugin/builds/2012-11-16_03-41-11/archive/org.apache.maven.plugins/maven-project-info-reports-plugin/2.7-SNAPSHOT/maven-project-info-reports-plugin-2.7-SNAPSHOT.jar
[JENKINS] Archiving <https://builds.apache.org/job/maven-plugins/ws/maven-one-plugin/pom.xml> to /home/hudson/hudson/jobs/maven-plugins/modules/org.apache.maven.plugins$maven-one-plugin/builds/2012-11-16_03-41-11/archive/org.apache.maven.plugins/maven-one-plugin/1.3-SNAPSHOT/maven-one-plugin-1.3-SNAPSHOT.pom
[JENKINS] Archiving <https://builds.apache.org/job/maven-plugins/ws/maven-one-plugin/target/maven-one-plugin-1.3-SNAPSHOT.jar> to /home/hudson/hudson/jobs/maven-plugins/modules/org.apache.maven.plugins$maven-one-plugin/builds/2012-11-16_03-41-11/archive/org.apache.maven.plugins/maven-one-plugin/1.3-SNAPSHOT/maven-one-plugin-1.3-SNAPSHOT.jar
[JENKINS] Archiving <https://builds.apache.org/job/maven-plugins/ws/maven-help-plugin/pom.xml> to /home/hudson/hudson/jobs/maven-plugins/modules/org.apache.maven.plugins$maven-help-plugin/builds/2012-11-16_03-41-11/archive/org.apache.maven.plugins/maven-help-plugin/2.2-SNAPSHOT/maven-help-plugin-2.2-SNAPSHOT.pom
[JENKINS] Archiving <https://builds.apache.org/job/maven-plugins/ws/maven-help-plugin/target/maven-help-plugin-2.2-SNAPSHOT.jar> to /home/hudson/hudson/jobs/maven-plugins/modules/org.apache.maven.plugins$maven-help-plugin/builds/2012-11-16_03-41-11/archive/org.apache.maven.plugins/maven-help-plugin/2.2-SNAPSHOT/maven-help-plugin-2.2-SNAPSHOT.jar
[JENKINS] Archiving <https://builds.apache.org/job/maven-plugins/ws/maven-invoker-plugin/pom.xml> to /home/hudson/hudson/jobs/maven-plugins/modules/org.apache.maven.plugins$maven-invoker-plugin/builds/2012-11-16_03-41-11/archive/org.apache.maven.plugins/maven-invoker-plugin/1.8-SNAPSHOT/maven-invoker-plugin-1.8-SNAPSHOT.pom
[JENKINS] Archiving <https://builds.apache.org/job/maven-plugins/ws/maven-invoker-plugin/target/maven-invoker-plugin-1.8-SNAPSHOT.jar> to /home/hudson/hudson/jobs/maven-plugins/modules/org.apache.maven.plugins$maven-invoker-plugin/builds/2012-11-16_03-41-11/archive/org.apache.maven.plugins/maven-invoker-plugin/1.8-SNAPSHOT/maven-invoker-plugin-1.8-SNAPSHOT.jar
[JENKINS] Archiving <https://builds.apache.org/job/maven-plugins/ws/maven-remote-resources-plugin/pom.xml> to /home/hudson/hudson/jobs/maven-plugins/modules/org.apache.maven.plugins$maven-remote-resources-plugin/builds/2012-11-16_03-41-11/archive/org.apache.maven.plugins/maven-remote-resources-plugin/1.5-SNAPSHOT/maven-remote-resources-plugin-1.5-SNAPSHOT.pom
[JENKINS] Archiving <https://builds.apache.org/job/maven-plugins/ws/maven-remote-resources-plugin/target/maven-remote-resources-plugin-1.5-SNAPSHOT.jar> to /home/hudson/hudson/jobs/maven-plugins/modules/org.apache.maven.plugins$maven-remote-resources-plugin/builds/2012-11-16_03-41-11/archive/org.apache.maven.plugins/maven-remote-resources-plugin/1.5-SNAPSHOT/maven-remote-resources-plugin-1.5-SNAPSHOT.jar
[JENKINS] Archiving <https://builds.apache.org/job/maven-plugins/ws/maven-pdf-plugin/pom.xml> to /home/hudson/hudson/jobs/maven-plugins/modules/org.apache.maven.plugins$maven-pdf-plugin/builds/2012-11-16_03-41-11/archive/org.apache.maven.plugins/maven-pdf-plugin/1.3-SNAPSHOT/maven-pdf-plugin-1.3-SNAPSHOT.pom
[JENKINS] Archiving <https://builds.apache.org/job/maven-plugins/ws/maven-pdf-plugin/target/maven-pdf-plugin-1.3-SNAPSHOT.jar> to /home/hudson/hudson/jobs/maven-plugins/modules/org.apache.maven.plugins$maven-pdf-plugin/builds/2012-11-16_03-41-11/archive/org.apache.maven.plugins/maven-pdf-plugin/1.3-SNAPSHOT/maven-pdf-plugin-1.3-SNAPSHOT.jar
[JENKINS] Archiving <https://builds.apache.org/job/maven-plugins/ws/maven-shade-plugin/pom.xml> to /home/hudson/hudson/jobs/maven-plugins/modules/org.apache.maven.plugins$maven-shade-plugin/builds/2012-11-16_03-41-11/archive/org.apache.maven.plugins/maven-shade-plugin/2.0.1-SNAPSHOT/maven-shade-plugin-2.0.1-SNAPSHOT.pom
[JENKINS] Archiving <https://builds.apache.org/job/maven-plugins/ws/maven-shade-plugin/target/maven-shade-plugin-2.0.1-SNAPSHOT.jar> to /home/hudson/hudson/jobs/maven-plugins/modules/org.apache.maven.plugins$maven-shade-plugin/builds/2012-11-16_03-41-11/archive/org.apache.maven.plugins/maven-shade-plugin/2.0.1-SNAPSHOT/maven-shade-plugin-2.0.1-SNAPSHOT.jar
[JENKINS] Archiving <https://builds.apache.org/job/maven-plugins/ws/maven-plugins/pom.xml> to /home/hudson/hudson/jobs/maven-plugins/modules/org.apache.maven.plugins$maven-plugins/builds/2012-11-16_03-41-11/archive/org.apache.maven.plugins/maven-plugins/24-SNAPSHOT/maven-plugins-24-SNAPSHOT.pom
[JENKINS] Archiving <https://builds.apache.org/job/maven-plugins/ws/maven-plugins/target/maven-plugins-24-SNAPSHOT-site.xml> to /home/hudson/hudson/jobs/maven-plugins/modules/org.apache.maven.plugins$maven-plugins/builds/2012-11-16_03-41-11/archive/org.apache.maven.plugins/maven-plugins/24-SNAPSHOT/maven-plugins-24-SNAPSHOT-site.xml
[JENKINS] Archiving <https://builds.apache.org/job/maven-plugins/ws/maven-linkcheck-plugin/pom.xml> to /home/hudson/hudson/jobs/maven-plugins/modules/org.apache.maven.plugins$maven-linkcheck-plugin/builds/2012-11-16_03-41-11/archive/org.apache.maven.plugins/maven-linkcheck-plugin/1.2-SNAPSHOT/maven-linkcheck-plugin-1.2-SNAPSHOT.pom
[JENKINS] Archiving <https://builds.apache.org/job/maven-plugins/ws/maven-linkcheck-plugin/target/maven-linkcheck-plugin-1.2-SNAPSHOT.jar> to /home/hudson/hudson/jobs/maven-plugins/modules/org.apache.maven.plugins$maven-linkcheck-plugin/builds/2012-11-16_03-41-11/archive/org.apache.maven.plugins/maven-linkcheck-plugin/1.2-SNAPSHOT/maven-linkcheck-plugin-1.2-SNAPSHOT.jar
[JENKINS] Archiving <https://builds.apache.org/job/maven-plugins/ws/maven-resources-plugin/pom.xml> to /home/hudson/hudson/jobs/maven-plugins/modules/org.apache.maven.plugins$maven-resources-plugin/builds/2012-11-16_03-41-11/archive/org.apache.maven.plugins/maven-resources-plugin/2.7-SNAPSHOT/maven-resources-plugin-2.7-SNAPSHOT.pom
[JENKINS] Archiving <https://builds.apache.org/job/maven-plugins/ws/maven-resources-plugin/target/maven-resources-plugin-2.7-SNAPSHOT.jar> to /home/hudson/hudson/jobs/maven-plugins/modules/org.apache.maven.plugins$maven-resources-plugin/builds/2012-11-16_03-41-11/archive/org.apache.maven.plugins/maven-resources-plugin/2.7-SNAPSHOT/maven-resources-plugin-2.7-SNAPSHOT.jar
Waiting for Jenkins to finish collecting data
mavenExecutionResult exceptions not empty
message : Failed to execute goal on project maven-compiler-plugin: Could not resolve dependencies for project org.apache.maven.plugins:maven-compiler-plugin:maven-plugin:3.1-SNAPSHOT: Could not find artifact org.apache.maven.shared:maven-shared-incremental:jar:1.0 in central (http://repo.maven.apache.org/maven2)
cause : Could not resolve dependencies for project org.apache.maven.plugins:maven-compiler-plugin:maven-plugin:3.1-SNAPSHOT: Could not find artifact org.apache.maven.shared:maven-shared-incremental:jar:1.0 in central (http://repo.maven.apache.org/maven2)
Stack trace :
org.apache.maven.lifecycle.LifecycleExecutionException: Failed to execute goal on project maven-compiler-plugin: Could not resolve dependencies for project org.apache.maven.plugins:maven-compiler-plugin:maven-plugin:3.1-SNAPSHOT: Could not find artifact org.apache.maven.shared:maven-shared-incremental:jar:1.0 in central (http://repo.maven.apache.org/maven2)
at org.apache.maven.lifecycle.internal.LifecycleDependencyResolver.getDependencies(LifecycleDependencyResolver.java:210)
at org.apache.maven.lifecycle.internal.LifecycleDependencyResolver.resolveProjectDependencies(LifecycleDependencyResolver.java:117)
at org.apache.maven.lifecycle.internal.MojoExecutor.ensureDependenciesAreResolved(MojoExecutor.java:258)
at org.apache.maven.lifecycle.internal.MojoExecutor.execute(MojoExecutor.java:201)
at org.apache.maven.lifecycle.internal.MojoExecutor.execute(MojoExecutor.java:153)
at org.apache.maven.lifecycle.internal.MojoExecutor.execute(MojoExecutor.java:145)
at org.apache.maven.lifecycle.internal.LifecycleModuleBuilder.buildProject(LifecycleModuleBuilder.java:84)
at org.apache.maven.lifecycle.internal.LifecycleThreadedBuilder$1.call(LifecycleThreadedBuilder.java:167)
at org.apache.maven.lifecycle.internal.LifecycleThreadedBuilder$1.call(LifecycleThreadedBuilder.java:163)
at java.util.concurrent.FutureTask$Sync.innerRun(FutureTask.java:269)
at java.util.concurrent.FutureTask.run(FutureTask.java:123)
at java.util.concurrent.ThreadPoolExecutor$Worker.runTask(ThreadPoolExecutor.java:651)
at java.util.concurrent.ThreadPoolExecutor$Worker.run(ThreadPoolExecutor.java:676)
at java.lang.Thread.run(Thread.java:595)
Caused by: org.apache.maven.project.DependencyResolutionException: Could not resolve dependencies for project org.apache.maven.plugins:maven-compiler-plugin:maven-plugin:3.1-SNAPSHOT: Could not find artifact org.apache.maven.shared:maven-shared-incremental:jar:1.0 in central (http://repo.maven.apache.org/maven2)
at org.apache.maven.project.DefaultProjectDependenciesResolver.resolve(DefaultProjectDependenciesResolver.java:189)
at org.apache.maven.lifecycle.internal.LifecycleDependencyResolver.getDependencies(LifecycleDependencyResolver.java:185)
... 13 more
Caused by: org.sonatype.aether.resolution.DependencyResolutionException: Could not find artifact org.apache.maven.shared:maven-shared-incremental:jar:1.0 in central (http://repo.maven.apache.org/maven2)
at org.sonatype.aether.impl.internal.DefaultRepositorySystem.resolveDependencies(DefaultRepositorySystem.java:375)
at org.apache.maven.project.DefaultProjectDependenciesResolver.resolve(DefaultProjectDependenciesResolver.java:183)
... 14 more
Caused by: org.sonatype.aether.resolution.ArtifactResolutionException: Could not find artifact org.apache.maven.shared:maven-shared-incremental:jar:1.0 in central (http://repo.maven.apache.org/maven2)
at org.sonatype.aether.impl.internal.DefaultArtifactResolver.resolve(DefaultArtifactResolver.java:538)
at org.sonatype.aether.impl.internal.DefaultArtifactResolver.resolveArtifacts(DefaultArtifactResolver.java:216)
at org.sonatype.aether.impl.internal.DefaultRepositorySystem.resolveDependencies(DefaultRepositorySystem.java:358)
... 15 more
Caused by: org.sonatype.aether.transfer.ArtifactNotFoundException: Could not find artifact org.apache.maven.shared:maven-shared-incremental:jar:1.0 in central (http://repo.maven.apache.org/maven2)
at org.sonatype.aether.connector.wagon.WagonRepositoryConnector$4.wrap(WagonRepositoryConnector.java:947)
at org.sonatype.aether.connector.wagon.WagonRepositoryConnector$4.wrap(WagonRepositoryConnector.java:941)
at org.sonatype.aether.connector.wagon.WagonRepositoryConnector$GetTask.run(WagonRepositoryConnector.java:669)
at org.sonatype.aether.util.concurrency.RunnableErrorForwarder$1.run(RunnableErrorForwarder.java:60)
... 3 more
Sending e-mails to: notifications@maven.apache.org
channel stopped
[WARNINGS] Skipping publisher since build result is FAILURE
Jenkins build is back to normal : maven-plugins #1286
Posted by Apache Jenkins Server <je...@builds.apache.org>.
See <https://builds.apache.org/job/maven-plugins/1286/changes>
Build failed in Jenkins: maven-plugins #1285
Posted by Apache Jenkins Server <je...@builds.apache.org>.
See <https://builds.apache.org/job/maven-plugins/1285/>
------------------------------------------
[...truncated 7882 lines...]
Running org.apache.maven.plugins.shade.resource.ApacheLicenseResourceTransformerTest
Tests run: 1, Failures: 0, Errors: 0, Skipped: 0, Time elapsed: 0 sec
Running org.apache.maven.plugins.shade.resource.AppendingTransformerTest
Tests run: 1, Failures: 0, Errors: 0, Skipped: 0, Time elapsed: 0 sec
Results :
Tests run: 27, Failures: 0, Errors: 0, Skipped: 0
mojoSucceeded org.apache.maven.plugins:maven-surefire-plugin:2.12(default-test)
[JENKINS] Recording test results
mojoStarted org.apache.maven.plugins:maven-jar-plugin:2.4(default-jar)
[INFO]
[INFO] --- maven-jar-plugin:2.4:jar (default-jar) @ maven-shade-plugin ---
2012-11-18 03:33:53.056::INFO: Shutdown hook complete
[INFO] Building jar: <https://builds.apache.org/job/maven-plugins/ws/maven-shade-plugin/target/maven-shade-plugin-2.0.1-SNAPSHOT.jar>
mojoSucceeded org.apache.maven.plugins:maven-jar-plugin:2.4(default-jar)
mojoStarted org.apache.maven.plugins:maven-plugin-plugin:3.2(default-addPluginArtifactMetadata)
[INFO]
[INFO] --- maven-plugin-plugin:3.2:addPluginArtifactMetadata (default-addPluginArtifactMetadata) @ maven-shade-plugin ---
mojoSucceeded org.apache.maven.plugins:maven-plugin-plugin:3.2(default-addPluginArtifactMetadata)
mojoStarted org.apache.maven.plugins:maven-install-plugin:2.3.1(default-install)[INFO] Installing <https://builds.apache.org/job/maven-plugins/ws/maven-shade-plugin/target/maven-shade-plugin-2.0.1-SNAPSHOT.jar> to /home/hudson/hudson-slave/maven-repositories/0/org/apache/maven/plugins/maven-shade-plugin/2.0.1-SNAPSHOT/maven-shade-plugin-2.0.1-SNAPSHOT.jar
[INFO] Installing <https://builds.apache.org/job/maven-plugins/ws/maven-shade-plugin/pom.xml> to /home/hudson/hudson-slave/maven-repositories/0/org/apache/maven/plugins/maven-shade-plugin/2.0.1-SNAPSHOT/maven-shade-plugin-2.0.1-SNAPSHOT.pom
[INFO]
[INFO] --- maven-install-plugin:2.3.1:install (default-install) @ maven-shade-plugin ---
mojoSucceeded org.apache.maven.plugins:maven-install-plugin:2.3.1(default-install)
projectSucceeded org.apache.maven.plugins:maven-shade-plugin:2.0.1-SNAPSHOT
mojoSucceeded org.apache.maven.plugins:maven-surefire-plugin:2.12(default-test)2012-11-18 03:33:54.057::INFO: Shutdown hook complete
Results :
Tests run: 17, Failures: 0, Errors: 0, Skipped: 0
[JENKINS] Recording test results
mojoStarted org.apache.maven.plugins:maven-jar-plugin:2.4(default-jar)
[INFO]
[INFO] --- maven-jar-plugin:2.4:jar (default-jar) @ maven-project-info-reports-plugin ---
[INFO] Building jar: <https://builds.apache.org/job/maven-plugins/ws/maven-project-info-reports-plugin/target/maven-project-info-reports-plugin-2.7-SNAPSHOT.jar>
mojoSucceeded org.apache.maven.plugins:maven-jar-plugin:2.4(default-jar)
mojoStarted org.apache.maven.plugins:maven-plugin-plugin:3.2(default-addPluginArtifactMetadata)
[INFO]
[INFO] --- maven-plugin-plugin:3.2:addPluginArtifactMetadata (default-addPluginArtifactMetadata) @ maven-project-info-reports-plugin ---
mojoSucceeded org.apache.maven.plugins:maven-plugin-plugin:3.2(default-addPluginArtifactMetadata)
mojoStarted org.apache.maven.plugins:maven-jarsigner-plugin:1.2(sign)
[INFO]
[INFO] --- maven-jarsigner-plugin:1.2:sign (sign) @ maven-project-info-reports-plugin ---
[INFO] 1 archive(s) processed
mojoSucceeded org.apache.maven.plugins:maven-jarsigner-plugin:1.2(sign)
mojoStarted org.apache.maven.plugins:maven-jarsigner-plugin:1.2(verify)
[INFO]
[INFO] --- maven-jarsigner-plugin:1.2:verify (verify) @ maven-project-info-reports-plugin ---
[INFO] 1 archive(s) processed
mojoSucceeded org.apache.maven.plugins:maven-jarsigner-plugin:1.2(verify)
mojoStarted org.apache.maven.plugins:maven-install-plugin:2.3.1(default-install)[INFO] Installing <https://builds.apache.org/job/maven-plugins/ws/maven-project-info-reports-plugin/target/maven-project-info-reports-plugin-2.7-SNAPSHOT.jar> to /home/hudson/hudson-slave/maven-repositories/0/org/apache/maven/plugins/maven-project-info-reports-plugin/2.7-SNAPSHOT/maven-project-info-reports-plugin-2.7-SNAPSHOT.jar
[INFO]
[INFO] --- maven-install-plugin:2.3.1:install (default-install) @ maven-project-info-reports-plugin ---
[INFO] Installing <https://builds.apache.org/job/maven-plugins/ws/maven-project-info-reports-plugin/pom.xml> to /home/hudson/hudson-slave/maven-repositories/0/org/apache/maven/plugins/maven-project-info-reports-plugin/2.7-SNAPSHOT/maven-project-info-reports-plugin-2.7-SNAPSHOT.pom
mojoSucceeded org.apache.maven.plugins:maven-install-plugin:2.3.1(default-install)
projectSucceeded org.apache.maven.plugins:maven-project-info-reports-plugin:2.7-SNAPSHOT
sessionEnded
[INFO] ------------------------------------------------------------------------
[INFO] Reactor Summary:
[INFO]
[INFO] Maven Plugins ..................................... SUCCESS [2:18.696s]
[INFO] Maven ACR Plugin .................................. SUCCESS [2:34.274s]
[INFO] Maven Ant Plugin .................................. SUCCESS [2:48.031s]
[INFO] Maven AntRun Plugin ............................... SUCCESS [15.330s]
[INFO] Maven Eclipse Plugin .............................. SUCCESS [36.564s]
[INFO] Maven Assembly Plugin ............................. SUCCESS [32.788s]
[INFO] Maven Changelog Plugin ............................ SUCCESS [11.688s]
[INFO] Maven Changes Report Plugin ....................... SUCCESS [29.679s]
[INFO] Maven Checkstyle Plugin ........................... SUCCESS [26.155s]
[INFO] Maven Clean Plugin ................................ SUCCESS [9.006s]
[INFO] Maven Compiler Plugin ............................. FAILURE [1.273s]
[INFO] Maven Dependency Plugin ........................... SUCCESS [1:08.568s]
[INFO] Maven Deploy Plugin ............................... SUCCESS [6.077s]
[INFO] Maven DOAP Plugin ................................. SUCCESS [13.995s]
[INFO] Maven Documentation Checker Plugin ................ SUCCESS [6.250s]
[INFO] Maven EAR Plugin .................................. SUCCESS [15.741s]
[INFO] Maven EJB Plugin .................................. SUCCESS [10.678s]
[INFO] Maven GPG Plugin .................................. SUCCESS [3.452s]
[INFO] Maven Help Plugin ................................. SUCCESS [5.622s]
[INFO] Maven IDEA Plugin ................................. SUCCESS [13.209s]
[INFO] Maven Install Plugin .............................. SUCCESS [9.875s]
[INFO] Maven JAR Plugin .................................. SUCCESS [5.544s]
[INFO] Maven Jarsigner Plugin ............................ SUCCESS [3.051s]
[INFO] Maven Javadoc Plugin .............................. SUCCESS [1:57.874s]
[INFO] Maven Linkcheck Plugin ............................ SUCCESS [9.898s]
[INFO] Maven One Plugin .................................. SUCCESS [13.630s]
[INFO] Maven Patch Plugin ................................ SUCCESS [3.140s]
[INFO] Maven PDF Plugin .................................. SUCCESS [25.530s]
[INFO] Maven PMD Plugin .................................. SUCCESS [17.927s]
[INFO] Maven RAR Plugin .................................. SUCCESS [8.136s]
[INFO] Maven Reactor Plugin .............................. SUCCESS [8.657s]
[INFO] Maven Repository Plugin ........................... SUCCESS [7.350s]
[INFO] Maven Resources Plugin ............................ SUCCESS [6.460s]
[INFO] Maven Site Plugin 3 ............................... SUCCESS [14.539s]
[INFO] Maven Source Plugin ............................... SUCCESS [7.012s]
[INFO] Maven Stage Plugin ................................ SUCCESS [7.571s]
[INFO] Maven Toolchains Plugin ........................... SUCCESS [8.691s]
[INFO] Maven Verifier Plugin ............................. SUCCESS [9.428s]
[INFO] Maven WAR Plugin .................................. SUCCESS [24.167s]
[INFO] SCM Publish Maven Plugin .......................... SUCCESS [10.515s]
[INFO] Maven Invoker Plugin .............................. SUCCESS [16.747s]
[INFO] Maven Project Info Reports Plugin ................. SUCCESS [27.627s]
[INFO] Maven Remote Resources Plugin ..................... SUCCESS [10.120s]
[INFO] Maven Shade Plugin ................................ SUCCESS [10.677s]
[INFO] Maven Plugins Aggregator .......................... SUCCESS [0.515s]
[INFO] ------------------------------------------------------------------------
[INFO] BUILD FAILURE
[INFO] ------------------------------------------------------------------------
[INFO] Total time: 6:42.300s (Wall Clock)
[INFO] Finished at: Sun Nov 18 03:34:01 UTC 2012
[INFO] Final Memory: 62M/324M
[INFO] ------------------------------------------------------------------------
Projects to build: [MavenProject: org.apache.maven.plugins:maven-plugins:24-SNAPSHOT @ <https://builds.apache.org/job/maven-plugins/ws/maven-plugins/pom.xml,> MavenProject: org.apache.maven.plugins:maven-acr-plugin:1.0.1-SNAPSHOT @ <https://builds.apache.org/job/maven-plugins/ws/maven-acr-plugin/pom.xml,> MavenProject: org.apache.maven.plugins:maven-ant-plugin:2.4-SNAPSHOT @ <https://builds.apache.org/job/maven-plugins/ws/maven-ant-plugin/pom.xml,> MavenProject: org.apache.maven.plugins:maven-antrun-plugin:1.8-SNAPSHOT @ <https://builds.apache.org/job/maven-plugins/ws/maven-antrun-plugin/pom.xml,> MavenProject: org.apache.maven.plugins:maven-eclipse-plugin:2.10-SNAPSHOT @ <https://builds.apache.org/job/maven-plugins/ws/maven-eclipse-plugin/pom.xml,> MavenProject: org.apache.maven.plugins:maven-assembly-plugin:2.5-SNAPSHOT @ <https://builds.apache.org/job/maven-plugins/ws/maven-assembly-plugin/pom.xml,> MavenProject: org.apache.maven.plugins:maven-changelog-plugin:2.3-SNAPSHOT @ <https://builds.apache.org/job/maven-plugins/ws/maven-changelog-plugin/pom.xml,> MavenProject: org.apache.maven.plugins:maven-changes-plugin:2.9-SNAPSHOT @ <https://builds.apache.org/job/maven-plugins/ws/maven-changes-plugin/pom.xml,> MavenProject: org.apache.maven.plugins:maven-checkstyle-plugin:2.10-SNAPSHOT @ <https://builds.apache.org/job/maven-plugins/ws/maven-checkstyle-plugin/pom.xml,> MavenProject: org.apache.maven.plugins:maven-clean-plugin:2.6-SNAPSHOT @ <https://builds.apache.org/job/maven-plugins/ws/maven-clean-plugin/pom.xml,> MavenProject: org.apache.maven.plugins:maven-compiler-plugin:3.1-SNAPSHOT @ <https://builds.apache.org/job/maven-plugins/ws/maven-compiler-plugin/pom.xml,> MavenProject: org.apache.maven.plugins:maven-dependency-plugin:2.7-SNAPSHOT @ <https://builds.apache.org/job/maven-plugins/ws/maven-dependency-plugin/pom.xml,> MavenProject: org.apache.maven.plugins:maven-deploy-plugin:2.8-SNAPSHOT @ <https://builds.apache.org/job/maven-plugins/ws/maven-deploy-plugin/pom.xml,> MavenProject: org.apache.maven.plugins:maven-doap-plugin:1.2-SNAPSHOT @ <https://builds.apache.org/job/maven-plugins/ws/maven-doap-plugin/pom.xml,> MavenProject: org.apache.maven.plugins:maven-docck-plugin:1.1-SNAPSHOT @ <https://builds.apache.org/job/maven-plugins/ws/maven-docck-plugin/pom.xml,> MavenProject: org.apache.maven.plugins:maven-ear-plugin:2.9-SNAPSHOT @ <https://builds.apache.org/job/maven-plugins/ws/maven-ear-plugin/pom.xml,> MavenProject: org.apache.maven.plugins:maven-ejb-plugin:2.4-SNAPSHOT @ <https://builds.apache.org/job/maven-plugins/ws/maven-ejb-plugin/pom.xml,> MavenProject: org.apache.maven.plugins:maven-gpg-plugin:1.5-SNAPSHOT @ <https://builds.apache.org/job/maven-plugins/ws/maven-gpg-plugin/pom.xml,> MavenProject: org.apache.maven.plugins:maven-help-plugin:2.2-SNAPSHOT @ <https://builds.apache.org/job/maven-plugins/ws/maven-help-plugin/pom.xml,> MavenProject: org.apache.maven.plugins:maven-idea-plugin:2.3-SNAPSHOT @ <https://builds.apache.org/job/maven-plugins/ws/maven-idea-plugin/pom.xml,> MavenProject: org.apache.maven.plugins:maven-install-plugin:2.5-SNAPSHOT @ <https://builds.apache.org/job/maven-plugins/ws/maven-install-plugin/pom.xml,> MavenProject: org.apache.maven.plugins:maven-jar-plugin:2.5-SNAPSHOT @ <https://builds.apache.org/job/maven-plugins/ws/maven-jar-plugin/pom.xml,> MavenProject: org.apache.maven.plugins:maven-jarsigner-plugin:1.3-SNAPSHOT @ <https://builds.apache.org/job/maven-plugins/ws/maven-jarsigner-plugin/pom.xml,> MavenProject: org.apache.maven.plugins:maven-javadoc-plugin:2.10-SNAPSHOT @ <https://builds.apache.org/job/maven-plugins/ws/maven-javadoc-plugin/pom.xml,> MavenProject: org.apache.maven.plugins:maven-linkcheck-plugin:1.2-SNAPSHOT @ <https://builds.apache.org/job/maven-plugins/ws/maven-linkcheck-plugin/pom.xml,> MavenProject: org.apache.maven.plugins:maven-one-plugin:1.3-SNAPSHOT @ <https://builds.apache.org/job/maven-plugins/ws/maven-one-plugin/pom.xml,> MavenProject: org.apache.maven.plugins:maven-patch-plugin:1.1.2-SNAPSHOT @ <https://builds.apache.org/job/maven-plugins/ws/maven-patch-plugin/pom.xml,> MavenProject: org.apache.maven.plugins:maven-pdf-plugin:1.3-SNAPSHOT @ <https://builds.apache.org/job/maven-plugins/ws/maven-pdf-plugin/pom.xml,> MavenProject: org.apache.maven.plugins:maven-pmd-plugin:2.8-SNAPSHOT @ <https://builds.apache.org/job/maven-plugins/ws/maven-pmd-plugin/pom.xml,> MavenProject: org.apache.maven.plugins:maven-rar-plugin:2.3-SNAPSHOT @ <https://builds.apache.org/job/maven-plugins/ws/maven-rar-plugin/pom.xml,> MavenProject: org.apache.maven.plugins:maven-reactor-plugin:1.1-SNAPSHOT @ <https://builds.apache.org/job/maven-plugins/ws/maven-reactor-plugin/pom.xml,> MavenProject: org.apache.maven.plugins:maven-repository-plugin:2.3.2-SNAPSHOT @ <https://builds.apache.org/job/maven-plugins/ws/maven-repository-plugin/pom.xml,> MavenProject: org.apache.maven.plugins:maven-resources-plugin:2.7-SNAPSHOT @ <https://builds.apache.org/job/maven-plugins/ws/maven-resources-plugin/pom.xml,> MavenProject: org.apache.maven.plugins:maven-site-plugin:3.3-SNAPSHOT @ <https://builds.apache.org/job/maven-plugins/ws/maven-site-plugin/dependency-reduced-pom.xml,> MavenProject: org.apache.maven.plugins:maven-source-plugin:2.3-SNAPSHOT @ <https://builds.apache.org/job/maven-plugins/ws/maven-source-plugin/pom.xml,> MavenProject: org.apache.maven.plugins:maven-stage-plugin:1.0-SNAPSHOT @ <https://builds.apache.org/job/maven-plugins/ws/maven-stage-plugin/pom.xml,> MavenProject: org.apache.maven.plugins:maven-toolchains-plugin:1.1-SNAPSHOT @ <https://builds.apache.org/job/maven-plugins/ws/maven-toolchains-plugin/pom.xml,> MavenProject: org.apache.maven.plugins:maven-verifier-plugin:1.1-SNAPSHOT @ <https://builds.apache.org/job/maven-plugins/ws/maven-verifier-plugin/pom.xml,> MavenProject: org.apache.maven.plugins:maven-war-plugin:2.4-SNAPSHOT @ <https://builds.apache.org/job/maven-plugins/ws/maven-war-plugin/pom.xml,> MavenProject: org.apache.maven.plugins:maven-scm-publish-plugin:1.0-SNAPSHOT @ <https://builds.apache.org/job/maven-plugins/ws/maven-scm-publish-plugin/pom.xml,> MavenProject: org.apache.maven.plugins:maven-invoker-plugin:1.8-SNAPSHOT @ <https://builds.apache.org/job/maven-plugins/ws/maven-invoker-plugin/pom.xml,> MavenProject: org.apache.maven.plugins:maven-project-info-reports-plugin:2.7-SNAPSHOT @ <https://builds.apache.org/job/maven-plugins/ws/maven-project-info-reports-plugin/pom.xml,> MavenProject: org.apache.maven.plugins:maven-remote-resources-plugin:1.5-SNAPSHOT @ <https://builds.apache.org/job/maven-plugins/ws/maven-remote-resources-plugin/pom.xml,> MavenProject: org.apache.maven.plugins:maven-shade-plugin:2.0.1-SNAPSHOT @ <https://builds.apache.org/job/maven-plugins/ws/maven-shade-plugin/pom.xml,> MavenProject: org.apache.maven.plugins:maven-plugins-aggregator:1-SNAPSHOT @ <https://builds.apache.org/job/maven-plugins/ws/pom.xml]>
[JENKINS] Archiving <https://builds.apache.org/job/maven-plugins/ws/maven-war-plugin/pom.xml> to /home/hudson/hudson/jobs/maven-plugins/modules/org.apache.maven.plugins$maven-war-plugin/builds/2012-11-18_03-26-07/archive/org.apache.maven.plugins/maven-war-plugin/2.4-SNAPSHOT/maven-war-plugin-2.4-SNAPSHOT.pom
[JENKINS] Archiving <https://builds.apache.org/job/maven-plugins/ws/maven-war-plugin/target/maven-war-plugin-2.4-SNAPSHOT.jar> to /home/hudson/hudson/jobs/maven-plugins/modules/org.apache.maven.plugins$maven-war-plugin/builds/2012-11-18_03-26-07/archive/org.apache.maven.plugins/maven-war-plugin/2.4-SNAPSHOT/maven-war-plugin-2.4-SNAPSHOT.jar
[JENKINS] Archiving <https://builds.apache.org/job/maven-plugins/ws/maven-docck-plugin/pom.xml> to /home/hudson/hudson/jobs/maven-plugins/modules/org.apache.maven.plugins$maven-docck-plugin/builds/2012-11-18_03-25-52/archive/org.apache.maven.plugins/maven-docck-plugin/1.1-SNAPSHOT/maven-docck-plugin-1.1-SNAPSHOT.pom
[JENKINS] Archiving <https://builds.apache.org/job/maven-plugins/ws/maven-docck-plugin/target/maven-docck-plugin-1.1-SNAPSHOT.jar> to /home/hudson/hudson/jobs/maven-plugins/modules/org.apache.maven.plugins$maven-docck-plugin/builds/2012-11-18_03-25-52/archive/org.apache.maven.plugins/maven-docck-plugin/1.1-SNAPSHOT/maven-docck-plugin-1.1-SNAPSHOT.jar
[JENKINS] Archiving <https://builds.apache.org/job/maven-plugins/ws/pom.xml> to /home/hudson/hudson/jobs/maven-plugins/modules/org.apache.maven.plugins$maven-plugins-aggregator/builds/2012-11-18_03-25-31/archive/org.apache.maven.plugins/maven-plugins-aggregator/1-SNAPSHOT/maven-plugins-aggregator-1-SNAPSHOT.pom
[JENKINS] Archiving <https://builds.apache.org/job/maven-plugins/ws/maven-idea-plugin/pom.xml> to /home/hudson/hudson/jobs/maven-plugins/modules/org.apache.maven.plugins$maven-idea-plugin/builds/2012-11-18_03-25-56/archive/org.apache.maven.plugins/maven-idea-plugin/2.3-SNAPSHOT/maven-idea-plugin-2.3-SNAPSHOT.pom
[JENKINS] Archiving <https://builds.apache.org/job/maven-plugins/ws/maven-idea-plugin/target/maven-idea-plugin-2.3-SNAPSHOT.jar> to /home/hudson/hudson/jobs/maven-plugins/modules/org.apache.maven.plugins$maven-idea-plugin/builds/2012-11-18_03-25-56/archive/org.apache.maven.plugins/maven-idea-plugin/2.3-SNAPSHOT/maven-idea-plugin-2.3-SNAPSHOT.jar
[JENKINS] Archiving <https://builds.apache.org/job/maven-plugins/ws/maven-toolchains-plugin/pom.xml> to /home/hudson/hudson/jobs/maven-plugins/modules/org.apache.maven.plugins$maven-toolchains-plugin/builds/2012-11-18_03-26-06/archive/org.apache.maven.plugins/maven-toolchains-plugin/1.1-SNAPSHOT/maven-toolchains-plugin-1.1-SNAPSHOT.pom
[JENKINS] Archiving <https://builds.apache.org/job/maven-plugins/ws/maven-toolchains-plugin/target/maven-toolchains-plugin-1.1-SNAPSHOT.jar> to /home/hudson/hudson/jobs/maven-plugins/modules/org.apache.maven.plugins$maven-toolchains-plugin/builds/2012-11-18_03-26-06/archive/org.apache.maven.plugins/maven-toolchains-plugin/1.1-SNAPSHOT/maven-toolchains-plugin-1.1-SNAPSHOT.jar
[JENKINS] Archiving <https://builds.apache.org/job/maven-plugins/ws/maven-pmd-plugin/pom.xml> to /home/hudson/hudson/jobs/maven-plugins/modules/org.apache.maven.plugins$maven-pmd-plugin/builds/2012-11-18_03-26-03/archive/org.apache.maven.plugins/maven-pmd-plugin/2.8-SNAPSHOT/maven-pmd-plugin-2.8-SNAPSHOT.pom
[JENKINS] Archiving <https://builds.apache.org/job/maven-plugins/ws/maven-pmd-plugin/target/maven-pmd-plugin-2.8-SNAPSHOT.jar> to /home/hudson/hudson/jobs/maven-plugins/modules/org.apache.maven.plugins$maven-pmd-plugin/builds/2012-11-18_03-26-03/archive/org.apache.maven.plugins/maven-pmd-plugin/2.8-SNAPSHOT/maven-pmd-plugin-2.8-SNAPSHOT.jar
[JENKINS] Archiving <https://builds.apache.org/job/maven-plugins/ws/maven-eclipse-plugin/pom.xml> to /home/hudson/hudson/jobs/maven-plugins/modules/org.apache.maven.plugins$maven-eclipse-plugin/builds/2012-11-18_03-25-40/archive/org.apache.maven.plugins/maven-eclipse-plugin/2.10-SNAPSHOT/maven-eclipse-plugin-2.10-SNAPSHOT.pom
[JENKINS] Archiving <https://builds.apache.org/job/maven-plugins/ws/maven-eclipse-plugin/target/maven-eclipse-plugin-2.10-SNAPSHOT.jar> to /home/hudson/hudson/jobs/maven-plugins/modules/org.apache.maven.plugins$maven-eclipse-plugin/builds/2012-11-18_03-25-40/archive/org.apache.maven.plugins/maven-eclipse-plugin/2.10-SNAPSHOT/maven-eclipse-plugin-2.10-SNAPSHOT.jar
[JENKINS] Archiving <https://builds.apache.org/job/maven-plugins/ws/maven-gpg-plugin/pom.xml> to /home/hudson/hudson/jobs/maven-plugins/modules/org.apache.maven.plugins$maven-gpg-plugin/builds/2012-11-18_03-25-53/archive/org.apache.maven.plugins/maven-gpg-plugin/1.5-SNAPSHOT/maven-gpg-plugin-1.5-SNAPSHOT.pom
[JENKINS] Archiving <https://builds.apache.org/job/maven-plugins/ws/maven-gpg-plugin/target/maven-gpg-plugin-1.5-SNAPSHOT.jar> to /home/hudson/hudson/jobs/maven-plugins/modules/org.apache.maven.plugins$maven-gpg-plugin/builds/2012-11-18_03-25-53/archive/org.apache.maven.plugins/maven-gpg-plugin/1.5-SNAPSHOT/maven-gpg-plugin-1.5-SNAPSHOT.jar
[JENKINS] Archiving <https://builds.apache.org/job/maven-plugins/ws/maven-clean-plugin/pom.xml> to /home/hudson/hudson/jobs/maven-plugins/modules/org.apache.maven.plugins$maven-clean-plugin/builds/2012-11-18_03-25-46/archive/org.apache.maven.plugins/maven-clean-plugin/2.6-SNAPSHOT/maven-clean-plugin-2.6-SNAPSHOT.pom
[JENKINS] Archiving <https://builds.apache.org/job/maven-plugins/ws/maven-clean-plugin/target/maven-clean-plugin-2.6-SNAPSHOT.jar> to /home/hudson/hudson/jobs/maven-plugins/modules/org.apache.maven.plugins$maven-clean-plugin/builds/2012-11-18_03-25-46/archive/org.apache.maven.plugins/maven-clean-plugin/2.6-SNAPSHOT/maven-clean-plugin-2.6-SNAPSHOT.jar
[JENKINS] Archiving <https://builds.apache.org/job/maven-plugins/ws/maven-jar-plugin/pom.xml> to /home/hudson/hudson/jobs/maven-plugins/modules/org.apache.maven.plugins$maven-jar-plugin/builds/2012-11-18_03-25-57/archive/org.apache.maven.plugins/maven-jar-plugin/2.5-SNAPSHOT/maven-jar-plugin-2.5-SNAPSHOT.pom
[JENKINS] Archiving <https://builds.apache.org/job/maven-plugins/ws/maven-jar-plugin/target/maven-jar-plugin-2.5-SNAPSHOT.jar> to /home/hudson/hudson/jobs/maven-plugins/modules/org.apache.maven.plugins$maven-jar-plugin/builds/2012-11-18_03-25-57/archive/org.apache.maven.plugins/maven-jar-plugin/2.5-SNAPSHOT/maven-jar-plugin-2.5-SNAPSHOT.jar
[JENKINS] Archiving <https://builds.apache.org/job/maven-plugins/ws/maven-site-plugin/dependency-reduced-pom.xml> to /home/hudson/hudson/jobs/maven-plugins/modules/org.apache.maven.plugins$maven-site-plugin/builds/2012-11-18_03-26-06/archive/org.apache.maven.plugins/maven-site-plugin/3.3-SNAPSHOT/maven-site-plugin-3.3-SNAPSHOT.pom
[JENKINS] Archiving <https://builds.apache.org/job/maven-plugins/ws/maven-site-plugin/target/maven-site-plugin-3.3-SNAPSHOT.jar> to /home/hudson/hudson/jobs/maven-plugins/modules/org.apache.maven.plugins$maven-site-plugin/builds/2012-11-18_03-26-06/archive/org.apache.maven.plugins/maven-site-plugin/3.3-SNAPSHOT/maven-site-plugin-3.3-SNAPSHOT.jar
[JENKINS] Archiving <https://builds.apache.org/job/maven-plugins/ws/maven-patch-plugin/pom.xml> to /home/hudson/hudson/jobs/maven-plugins/modules/org.apache.maven.plugins$maven-patch-plugin/builds/2012-11-18_03-26-02/archive/org.apache.maven.plugins/maven-patch-plugin/1.1.2-SNAPSHOT/maven-patch-plugin-1.1.2-SNAPSHOT.pom
[JENKINS] Archiving <https://builds.apache.org/job/maven-plugins/ws/maven-patch-plugin/target/maven-patch-plugin-1.1.2-SNAPSHOT.jar> to /home/hudson/hudson/jobs/maven-plugins/modules/org.apache.maven.plugins$maven-patch-plugin/builds/2012-11-18_03-26-02/archive/org.apache.maven.plugins/maven-patch-plugin/1.1.2-SNAPSHOT/maven-patch-plugin-1.1.2-SNAPSHOT.jar
[JENKINS] Archiving <https://builds.apache.org/job/maven-plugins/ws/maven-install-plugin/pom.xml> to /home/hudson/hudson/jobs/maven-plugins/modules/org.apache.maven.plugins$maven-install-plugin/builds/2012-11-18_03-25-57/archive/org.apache.maven.plugins/maven-install-plugin/2.5-SNAPSHOT/maven-install-plugin-2.5-SNAPSHOT.pom
[JENKINS] Archiving <https://builds.apache.org/job/maven-plugins/ws/maven-install-plugin/target/maven-install-plugin-2.5-SNAPSHOT.jar> to /home/hudson/hudson/jobs/maven-plugins/modules/org.apache.maven.plugins$maven-install-plugin/builds/2012-11-18_03-25-57/archive/org.apache.maven.plugins/maven-install-plugin/2.5-SNAPSHOT/maven-install-plugin-2.5-SNAPSHOT.jar
[JENKINS] Archiving <https://builds.apache.org/job/maven-plugins/ws/maven-antrun-plugin/pom.xml> to /home/hudson/hudson/jobs/maven-plugins/modules/org.apache.maven.plugins$maven-antrun-plugin/builds/2012-11-18_03-25-40/archive/org.apache.maven.plugins/maven-antrun-plugin/1.8-SNAPSHOT/maven-antrun-plugin-1.8-SNAPSHOT.pom
[JENKINS] Archiving <https://builds.apache.org/job/maven-plugins/ws/maven-antrun-plugin/target/maven-antrun-plugin-1.8-SNAPSHOT.jar> to /home/hudson/hudson/jobs/maven-plugins/modules/org.apache.maven.plugins$maven-antrun-plugin/builds/2012-11-18_03-25-40/archive/org.apache.maven.plugins/maven-antrun-plugin/1.8-SNAPSHOT/maven-antrun-plugin-1.8-SNAPSHOT.jar
[JENKINS] Archiving <https://builds.apache.org/job/maven-plugins/ws/maven-changes-plugin/pom.xml> to /home/hudson/hudson/jobs/maven-plugins/modules/org.apache.maven.plugins$maven-changes-plugin/builds/2012-11-18_03-25-46/archive/org.apache.maven.plugins/maven-changes-plugin/2.9-SNAPSHOT/maven-changes-plugin-2.9-SNAPSHOT.pom
[JENKINS] Archiving <https://builds.apache.org/job/maven-plugins/ws/maven-changes-plugin/target/maven-changes-plugin-2.9-SNAPSHOT.jar> to /home/hudson/hudson/jobs/maven-plugins/modules/org.apache.maven.plugins$maven-changes-plugin/builds/2012-11-18_03-25-46/archive/org.apache.maven.plugins/maven-changes-plugin/2.9-SNAPSHOT/maven-changes-plugin-2.9-SNAPSHOT.jar
[JENKINS] Archiving <https://builds.apache.org/job/maven-plugins/ws/maven-rar-plugin/pom.xml> to /home/hudson/hudson/jobs/maven-plugins/modules/org.apache.maven.plugins$maven-rar-plugin/builds/2012-11-18_03-26-03/archive/org.apache.maven.plugins/maven-rar-plugin/2.3-SNAPSHOT/maven-rar-plugin-2.3-SNAPSHOT.pom
[JENKINS] Archiving <https://builds.apache.org/job/maven-plugins/ws/maven-rar-plugin/target/maven-rar-plugin-2.3-SNAPSHOT.jar> to /home/hudson/hudson/jobs/maven-plugins/modules/org.apache.maven.plugins$maven-rar-plugin/builds/2012-11-18_03-26-03/archive/org.apache.maven.plugins/maven-rar-plugin/2.3-SNAPSHOT/maven-rar-plugin-2.3-SNAPSHOT.jar
[JENKINS] Archiving <https://builds.apache.org/job/maven-plugins/ws/maven-jarsigner-plugin/pom.xml> to /home/hudson/hudson/jobs/maven-plugins/modules/org.apache.maven.plugins$maven-jarsigner-plugin/builds/2012-11-18_03-25-57/archive/org.apache.maven.plugins/maven-jarsigner-plugin/1.3-SNAPSHOT/maven-jarsigner-plugin-1.3-SNAPSHOT.pom
[JENKINS] Archiving <https://builds.apache.org/job/maven-plugins/ws/maven-jarsigner-plugin/target/maven-jarsigner-plugin-1.3-SNAPSHOT.jar> to /home/hudson/hudson/jobs/maven-plugins/modules/org.apache.maven.plugins$maven-jarsigner-plugin/builds/2012-11-18_03-25-57/archive/org.apache.maven.plugins/maven-jarsigner-plugin/1.3-SNAPSHOT/maven-jarsigner-plugin-1.3-SNAPSHOT.jar
[JENKINS] Archiving <https://builds.apache.org/job/maven-plugins/ws/maven-ear-plugin/pom.xml> to /home/hudson/hudson/jobs/maven-plugins/modules/org.apache.maven.plugins$maven-ear-plugin/builds/2012-11-18_03-25-52/archive/org.apache.maven.plugins/maven-ear-plugin/2.9-SNAPSHOT/maven-ear-plugin-2.9-SNAPSHOT.pom
[JENKINS] Archiving <https://builds.apache.org/job/maven-plugins/ws/maven-ear-plugin/target/maven-ear-plugin-2.9-SNAPSHOT.jar> to /home/hudson/hudson/jobs/maven-plugins/modules/org.apache.maven.plugins$maven-ear-plugin/builds/2012-11-18_03-25-52/archive/org.apache.maven.plugins/maven-ear-plugin/2.9-SNAPSHOT/maven-ear-plugin-2.9-SNAPSHOT.jar
[JENKINS] Archiving <https://builds.apache.org/job/maven-plugins/ws/maven-changelog-plugin/pom.xml> to /home/hudson/hudson/jobs/maven-plugins/modules/org.apache.maven.plugins$maven-changelog-plugin/builds/2012-11-18_03-25-46/archive/org.apache.maven.plugins/maven-changelog-plugin/2.3-SNAPSHOT/maven-changelog-plugin-2.3-SNAPSHOT.pom
[JENKINS] Archiving <https://builds.apache.org/job/maven-plugins/ws/maven-changelog-plugin/target/maven-changelog-plugin-2.3-SNAPSHOT.jar> to /home/hudson/hudson/jobs/maven-plugins/modules/org.apache.maven.plugins$maven-changelog-plugin/builds/2012-11-18_03-25-46/archive/org.apache.maven.plugins/maven-changelog-plugin/2.3-SNAPSHOT/maven-changelog-plugin-2.3-SNAPSHOT.jar
[JENKINS] Archiving <https://builds.apache.org/job/maven-plugins/ws/maven-verifier-plugin/pom.xml> to /home/hudson/hudson/jobs/maven-plugins/modules/org.apache.maven.plugins$maven-verifier-plugin/builds/2012-11-18_03-26-07/archive/org.apache.maven.plugins/maven-verifier-plugin/1.1-SNAPSHOT/maven-verifier-plugin-1.1-SNAPSHOT.pom
[JENKINS] Archiving <https://builds.apache.org/job/maven-plugins/ws/maven-verifier-plugin/target/maven-verifier-plugin-1.1-SNAPSHOT.jar> to /home/hudson/hudson/jobs/maven-plugins/modules/org.apache.maven.plugins$maven-verifier-plugin/builds/2012-11-18_03-26-07/archive/org.apache.maven.plugins/maven-verifier-plugin/1.1-SNAPSHOT/maven-verifier-plugin-1.1-SNAPSHOT.jar
[JENKINS] Archiving <https://builds.apache.org/job/maven-plugins/ws/maven-ant-plugin/pom.xml> to /home/hudson/hudson/jobs/maven-plugins/modules/org.apache.maven.plugins$maven-ant-plugin/builds/2012-11-18_03-25-40/archive/org.apache.maven.plugins/maven-ant-plugin/2.4-SNAPSHOT/maven-ant-plugin-2.4-SNAPSHOT.pom
[JENKINS] Archiving <https://builds.apache.org/job/maven-plugins/ws/maven-ant-plugin/target/maven-ant-plugin-2.4-SNAPSHOT.jar> to /home/hudson/hudson/jobs/maven-plugins/modules/org.apache.maven.plugins$maven-ant-plugin/builds/2012-11-18_03-25-40/archive/org.apache.maven.plugins/maven-ant-plugin/2.4-SNAPSHOT/maven-ant-plugin-2.4-SNAPSHOT.jar
[JENKINS] Archiving <https://builds.apache.org/job/maven-plugins/ws/maven-ejb-plugin/pom.xml> to /home/hudson/hudson/jobs/maven-plugins/modules/org.apache.maven.plugins$maven-ejb-plugin/builds/2012-11-18_03-25-53/archive/org.apache.maven.plugins/maven-ejb-plugin/2.4-SNAPSHOT/maven-ejb-plugin-2.4-SNAPSHOT.pom
[JENKINS] Archiving <https://builds.apache.org/job/maven-plugins/ws/maven-ejb-plugin/target/maven-ejb-plugin-2.4-SNAPSHOT.jar> to /home/hudson/hudson/jobs/maven-plugins/modules/org.apache.maven.plugins$maven-ejb-plugin/builds/2012-11-18_03-25-53/archive/org.apache.maven.plugins/maven-ejb-plugin/2.4-SNAPSHOT/maven-ejb-plugin-2.4-SNAPSHOT.jar
[JENKINS] Archiving <https://builds.apache.org/job/maven-plugins/ws/maven-stage-plugin/pom.xml> to /home/hudson/hudson/jobs/maven-plugins/modules/org.apache.maven.plugins$maven-stage-plugin/builds/2012-11-18_03-26-06/archive/org.apache.maven.plugins/maven-stage-plugin/1.0-SNAPSHOT/maven-stage-plugin-1.0-SNAPSHOT.pom
[JENKINS] Archiving <https://builds.apache.org/job/maven-plugins/ws/maven-stage-plugin/target/maven-stage-plugin-1.0-SNAPSHOT.jar> to /home/hudson/hudson/jobs/maven-plugins/modules/org.apache.maven.plugins$maven-stage-plugin/builds/2012-11-18_03-26-06/archive/org.apache.maven.plugins/maven-stage-plugin/1.0-SNAPSHOT/maven-stage-plugin-1.0-SNAPSHOT.jar
[JENKINS] Archiving <https://builds.apache.org/job/maven-plugins/ws/maven-scm-publish-plugin/pom.xml> to /home/hudson/hudson/jobs/maven-plugins/modules/org.apache.maven.plugins$maven-scm-publish-plugin/builds/2012-11-18_03-26-07/archive/org.apache.maven.plugins/maven-scm-publish-plugin/1.0-SNAPSHOT/maven-scm-publish-plugin-1.0-SNAPSHOT.pom
[JENKINS] Archiving <https://builds.apache.org/job/maven-plugins/ws/maven-scm-publish-plugin/target/maven-scm-publish-plugin-1.0-SNAPSHOT.jar> to /home/hudson/hudson/jobs/maven-plugins/modules/org.apache.maven.plugins$maven-scm-publish-plugin/builds/2012-11-18_03-26-07/archive/org.apache.maven.plugins/maven-scm-publish-plugin/1.0-SNAPSHOT/maven-scm-publish-plugin-1.0-SNAPSHOT.jar
[JENKINS] Archiving <https://builds.apache.org/job/maven-plugins/ws/maven-compiler-plugin/pom.xml> to /home/hudson/hudson/jobs/maven-plugins/modules/org.apache.maven.plugins$maven-compiler-plugin/builds/2012-11-18_03-25-47/archive/org.apache.maven.plugins/maven-compiler-plugin/3.1-SNAPSHOT/maven-compiler-plugin-3.1-SNAPSHOT.pom
[JENKINS] Archiving <https://builds.apache.org/job/maven-plugins/ws/maven-reactor-plugin/pom.xml> to /home/hudson/hudson/jobs/maven-plugins/modules/org.apache.maven.plugins$maven-reactor-plugin/builds/2012-11-18_03-26-05/archive/org.apache.maven.plugins/maven-reactor-plugin/1.1-SNAPSHOT/maven-reactor-plugin-1.1-SNAPSHOT.pom
[JENKINS] Archiving <https://builds.apache.org/job/maven-plugins/ws/maven-reactor-plugin/target/maven-reactor-plugin-1.1-SNAPSHOT.jar> to /home/hudson/hudson/jobs/maven-plugins/modules/org.apache.maven.plugins$maven-reactor-plugin/builds/2012-11-18_03-26-05/archive/org.apache.maven.plugins/maven-reactor-plugin/1.1-SNAPSHOT/maven-reactor-plugin-1.1-SNAPSHOT.jar
[JENKINS] Archiving <https://builds.apache.org/job/maven-plugins/ws/maven-doap-plugin/pom.xml> to /home/hudson/hudson/jobs/maven-plugins/modules/org.apache.maven.plugins$maven-doap-plugin/builds/2012-11-18_03-25-50/archive/org.apache.maven.plugins/maven-doap-plugin/1.2-SNAPSHOT/maven-doap-plugin-1.2-SNAPSHOT.pom
[JENKINS] Archiving <https://builds.apache.org/job/maven-plugins/ws/maven-doap-plugin/target/maven-doap-plugin-1.2-SNAPSHOT.jar> to /home/hudson/hudson/jobs/maven-plugins/modules/org.apache.maven.plugins$maven-doap-plugin/builds/2012-11-18_03-25-50/archive/org.apache.maven.plugins/maven-doap-plugin/1.2-SNAPSHOT/maven-doap-plugin-1.2-SNAPSHOT.jar
[JENKINS] Archiving <https://builds.apache.org/job/maven-plugins/ws/maven-checkstyle-plugin/pom.xml> to /home/hudson/hudson/jobs/maven-plugins/modules/org.apache.maven.plugins$maven-checkstyle-plugin/builds/2012-11-18_03-25-46/archive/org.apache.maven.plugins/maven-checkstyle-plugin/2.10-SNAPSHOT/maven-checkstyle-plugin-2.10-SNAPSHOT.pom
[JENKINS] Archiving <https://builds.apache.org/job/maven-plugins/ws/maven-checkstyle-plugin/target/maven-checkstyle-plugin-2.10-SNAPSHOT.jar> to /home/hudson/hudson/jobs/maven-plugins/modules/org.apache.maven.plugins$maven-checkstyle-plugin/builds/2012-11-18_03-25-46/archive/org.apache.maven.plugins/maven-checkstyle-plugin/2.10-SNAPSHOT/maven-checkstyle-plugin-2.10-SNAPSHOT.jar
[JENKINS] Archiving <https://builds.apache.org/job/maven-plugins/ws/maven-source-plugin/pom.xml> to /home/hudson/hudson/jobs/maven-plugins/modules/org.apache.maven.plugins$maven-source-plugin/builds/2012-11-18_03-26-06/archive/org.apache.maven.plugins/maven-source-plugin/2.3-SNAPSHOT/maven-source-plugin-2.3-SNAPSHOT.pom
[JENKINS] Archiving <https://builds.apache.org/job/maven-plugins/ws/maven-source-plugin/target/maven-source-plugin-2.3-SNAPSHOT.jar> to /home/hudson/hudson/jobs/maven-plugins/modules/org.apache.maven.plugins$maven-source-plugin/builds/2012-11-18_03-26-06/archive/org.apache.maven.plugins/maven-source-plugin/2.3-SNAPSHOT/maven-source-plugin-2.3-SNAPSHOT.jar
[JENKINS] Archiving <https://builds.apache.org/job/maven-plugins/ws/maven-dependency-plugin/pom.xml> to /home/hudson/hudson/jobs/maven-plugins/modules/org.apache.maven.plugins$maven-dependency-plugin/builds/2012-11-18_03-25-47/archive/org.apache.maven.plugins/maven-dependency-plugin/2.7-SNAPSHOT/maven-dependency-plugin-2.7-SNAPSHOT.pom
[JENKINS] Archiving <https://builds.apache.org/job/maven-plugins/ws/maven-dependency-plugin/target/maven-dependency-plugin-2.7-SNAPSHOT.jar> to /home/hudson/hudson/jobs/maven-plugins/modules/org.apache.maven.plugins$maven-dependency-plugin/builds/2012-11-18_03-25-47/archive/org.apache.maven.plugins/maven-dependency-plugin/2.7-SNAPSHOT/maven-dependency-plugin-2.7-SNAPSHOT.jar
[JENKINS] Archiving <https://builds.apache.org/job/maven-plugins/ws/maven-javadoc-plugin/pom.xml> to /home/hudson/hudson/jobs/maven-plugins/modules/org.apache.maven.plugins$maven-javadoc-plugin/builds/2012-11-18_03-25-57/archive/org.apache.maven.plugins/maven-javadoc-plugin/2.10-SNAPSHOT/maven-javadoc-plugin-2.10-SNAPSHOT.pom
[JENKINS] Archiving <https://builds.apache.org/job/maven-plugins/ws/maven-javadoc-plugin/target/maven-javadoc-plugin-2.10-SNAPSHOT.jar> to /home/hudson/hudson/jobs/maven-plugins/modules/org.apache.maven.plugins$maven-javadoc-plugin/builds/2012-11-18_03-25-57/archive/org.apache.maven.plugins/maven-javadoc-plugin/2.10-SNAPSHOT/maven-javadoc-plugin-2.10-SNAPSHOT.jar
[JENKINS] Archiving <https://builds.apache.org/job/maven-plugins/ws/maven-deploy-plugin/pom.xml> to /home/hudson/hudson/jobs/maven-plugins/modules/org.apache.maven.plugins$maven-deploy-plugin/builds/2012-11-18_03-25-47/archive/org.apache.maven.plugins/maven-deploy-plugin/2.8-SNAPSHOT/maven-deploy-plugin-2.8-SNAPSHOT.pom
[JENKINS] Archiving <https://builds.apache.org/job/maven-plugins/ws/maven-deploy-plugin/target/maven-deploy-plugin-2.8-SNAPSHOT.jar> to /home/hudson/hudson/jobs/maven-plugins/modules/org.apache.maven.plugins$maven-deploy-plugin/builds/2012-11-18_03-25-47/archive/org.apache.maven.plugins/maven-deploy-plugin/2.8-SNAPSHOT/maven-deploy-plugin-2.8-SNAPSHOT.jar
[JENKINS] Archiving <https://builds.apache.org/job/maven-plugins/ws/maven-acr-plugin/pom.xml> to /home/hudson/hudson/jobs/maven-plugins/modules/org.apache.maven.plugins$maven-acr-plugin/builds/2012-11-18_03-25-36/archive/org.apache.maven.plugins/maven-acr-plugin/1.0.1-SNAPSHOT/maven-acr-plugin-1.0.1-SNAPSHOT.pom
[JENKINS] Archiving <https://builds.apache.org/job/maven-plugins/ws/maven-acr-plugin/target/maven-acr-plugin-1.0.1-SNAPSHOT.jar> to /home/hudson/hudson/jobs/maven-plugins/modules/org.apache.maven.plugins$maven-acr-plugin/builds/2012-11-18_03-25-36/archive/org.apache.maven.plugins/maven-acr-plugin/1.0.1-SNAPSHOT/maven-acr-plugin-1.0.1-SNAPSHOT.jar
[JENKINS] Archiving <https://builds.apache.org/job/maven-plugins/ws/maven-repository-plugin/pom.xml> to /home/hudson/hudson/jobs/maven-plugins/modules/org.apache.maven.plugins$maven-repository-plugin/builds/2012-11-18_03-26-06/archive/org.apache.maven.plugins/maven-repository-plugin/2.3.2-SNAPSHOT/maven-repository-plugin-2.3.2-SNAPSHOT.pom
[JENKINS] Archiving <https://builds.apache.org/job/maven-plugins/ws/maven-repository-plugin/target/maven-repository-plugin-2.3.2-SNAPSHOT.jar> to /home/hudson/hudson/jobs/maven-plugins/modules/org.apache.maven.plugins$maven-repository-plugin/builds/2012-11-18_03-26-06/archive/org.apache.maven.plugins/maven-repository-plugin/2.3.2-SNAPSHOT/maven-repository-plugin-2.3.2-SNAPSHOT.jar
[JENKINS] Archiving <https://builds.apache.org/job/maven-plugins/ws/maven-assembly-plugin/pom.xml> to /home/hudson/hudson/jobs/maven-plugins/modules/org.apache.maven.plugins$maven-assembly-plugin/builds/2012-11-18_03-25-46/archive/org.apache.maven.plugins/maven-assembly-plugin/2.5-SNAPSHOT/maven-assembly-plugin-2.5-SNAPSHOT.pom
[JENKINS] Archiving <https://builds.apache.org/job/maven-plugins/ws/maven-assembly-plugin/target/maven-assembly-plugin-2.5-SNAPSHOT.jar> to /home/hudson/hudson/jobs/maven-plugins/modules/org.apache.maven.plugins$maven-assembly-plugin/builds/2012-11-18_03-25-46/archive/org.apache.maven.plugins/maven-assembly-plugin/2.5-SNAPSHOT/maven-assembly-plugin-2.5-SNAPSHOT.jar
[JENKINS] Archiving <https://builds.apache.org/job/maven-plugins/ws/maven-project-info-reports-plugin/pom.xml> to /home/hudson/hudson/jobs/maven-plugins/modules/org.apache.maven.plugins$maven-project-info-reports-plugin/builds/2012-11-18_03-26-09/archive/org.apache.maven.plugins/maven-project-info-reports-plugin/2.7-SNAPSHOT/maven-project-info-reports-plugin-2.7-SNAPSHOT.pom
[JENKINS] Archiving <https://builds.apache.org/job/maven-plugins/ws/maven-project-info-reports-plugin/target/maven-project-info-reports-plugin-2.7-SNAPSHOT.jar> to /home/hudson/hudson/jobs/maven-plugins/modules/org.apache.maven.plugins$maven-project-info-reports-plugin/builds/2012-11-18_03-26-09/archive/org.apache.maven.plugins/maven-project-info-reports-plugin/2.7-SNAPSHOT/maven-project-info-reports-plugin-2.7-SNAPSHOT.jar
[JENKINS] Archiving <https://builds.apache.org/job/maven-plugins/ws/maven-one-plugin/pom.xml> to /home/hudson/hudson/jobs/maven-plugins/modules/org.apache.maven.plugins$maven-one-plugin/builds/2012-11-18_03-26-02/archive/org.apache.maven.plugins/maven-one-plugin/1.3-SNAPSHOT/maven-one-plugin-1.3-SNAPSHOT.pom
[JENKINS] Archiving <https://builds.apache.org/job/maven-plugins/ws/maven-one-plugin/target/maven-one-plugin-1.3-SNAPSHOT.jar> to /home/hudson/hudson/jobs/maven-plugins/modules/org.apache.maven.plugins$maven-one-plugin/builds/2012-11-18_03-26-02/archive/org.apache.maven.plugins/maven-one-plugin/1.3-SNAPSHOT/maven-one-plugin-1.3-SNAPSHOT.jar
[JENKINS] Archiving <https://builds.apache.org/job/maven-plugins/ws/maven-help-plugin/pom.xml> to /home/hudson/hudson/jobs/maven-plugins/modules/org.apache.maven.plugins$maven-help-plugin/builds/2012-11-18_03-25-56/archive/org.apache.maven.plugins/maven-help-plugin/2.2-SNAPSHOT/maven-help-plugin-2.2-SNAPSHOT.pom
[JENKINS] Archiving <https://builds.apache.org/job/maven-plugins/ws/maven-help-plugin/target/maven-help-plugin-2.2-SNAPSHOT.jar> to /home/hudson/hudson/jobs/maven-plugins/modules/org.apache.maven.plugins$maven-help-plugin/builds/2012-11-18_03-25-56/archive/org.apache.maven.plugins/maven-help-plugin/2.2-SNAPSHOT/maven-help-plugin-2.2-SNAPSHOT.jar
[JENKINS] Archiving <https://builds.apache.org/job/maven-plugins/ws/maven-invoker-plugin/pom.xml> to /home/hudson/hudson/jobs/maven-plugins/modules/org.apache.maven.plugins$maven-invoker-plugin/builds/2012-11-18_03-26-07/archive/org.apache.maven.plugins/maven-invoker-plugin/1.8-SNAPSHOT/maven-invoker-plugin-1.8-SNAPSHOT.pom
[JENKINS] Archiving <https://builds.apache.org/job/maven-plugins/ws/maven-invoker-plugin/target/maven-invoker-plugin-1.8-SNAPSHOT.jar> to /home/hudson/hudson/jobs/maven-plugins/modules/org.apache.maven.plugins$maven-invoker-plugin/builds/2012-11-18_03-26-07/archive/org.apache.maven.plugins/maven-invoker-plugin/1.8-SNAPSHOT/maven-invoker-plugin-1.8-SNAPSHOT.jar
[JENKINS] Archiving <https://builds.apache.org/job/maven-plugins/ws/maven-remote-resources-plugin/pom.xml> to /home/hudson/hudson/jobs/maven-plugins/modules/org.apache.maven.plugins$maven-remote-resources-plugin/builds/2012-11-18_03-26-09/archive/org.apache.maven.plugins/maven-remote-resources-plugin/1.5-SNAPSHOT/maven-remote-resources-plugin-1.5-SNAPSHOT.pom
[JENKINS] Archiving <https://builds.apache.org/job/maven-plugins/ws/maven-remote-resources-plugin/target/maven-remote-resources-plugin-1.5-SNAPSHOT.jar> to /home/hudson/hudson/jobs/maven-plugins/modules/org.apache.maven.plugins$maven-remote-resources-plugin/builds/2012-11-18_03-26-09/archive/org.apache.maven.plugins/maven-remote-resources-plugin/1.5-SNAPSHOT/maven-remote-resources-plugin-1.5-SNAPSHOT.jar
[JENKINS] Archiving <https://builds.apache.org/job/maven-plugins/ws/maven-pdf-plugin/pom.xml> to /home/hudson/hudson/jobs/maven-plugins/modules/org.apache.maven.plugins$maven-pdf-plugin/builds/2012-11-18_03-26-03/archive/org.apache.maven.plugins/maven-pdf-plugin/1.3-SNAPSHOT/maven-pdf-plugin-1.3-SNAPSHOT.pom
[JENKINS] Archiving <https://builds.apache.org/job/maven-plugins/ws/maven-pdf-plugin/target/maven-pdf-plugin-1.3-SNAPSHOT.jar> to /home/hudson/hudson/jobs/maven-plugins/modules/org.apache.maven.plugins$maven-pdf-plugin/builds/2012-11-18_03-26-03/archive/org.apache.maven.plugins/maven-pdf-plugin/1.3-SNAPSHOT/maven-pdf-plugin-1.3-SNAPSHOT.jar
[JENKINS] Archiving <https://builds.apache.org/job/maven-plugins/ws/maven-shade-plugin/pom.xml> to /home/hudson/hudson/jobs/maven-plugins/modules/org.apache.maven.plugins$maven-shade-plugin/builds/2012-11-18_03-26-10/archive/org.apache.maven.plugins/maven-shade-plugin/2.0.1-SNAPSHOT/maven-shade-plugin-2.0.1-SNAPSHOT.pom
[JENKINS] Archiving <https://builds.apache.org/job/maven-plugins/ws/maven-shade-plugin/target/maven-shade-plugin-2.0.1-SNAPSHOT.jar> to /home/hudson/hudson/jobs/maven-plugins/modules/org.apache.maven.plugins$maven-shade-plugin/builds/2012-11-18_03-26-10/archive/org.apache.maven.plugins/maven-shade-plugin/2.0.1-SNAPSHOT/maven-shade-plugin-2.0.1-SNAPSHOT.jar
[JENKINS] Archiving <https://builds.apache.org/job/maven-plugins/ws/maven-plugins/pom.xml> to /home/hudson/hudson/jobs/maven-plugins/modules/org.apache.maven.plugins$maven-plugins/builds/2012-11-18_03-25-33/archive/org.apache.maven.plugins/maven-plugins/24-SNAPSHOT/maven-plugins-24-SNAPSHOT.pom
[JENKINS] Archiving <https://builds.apache.org/job/maven-plugins/ws/maven-plugins/target/maven-plugins-24-SNAPSHOT-site.xml> to /home/hudson/hudson/jobs/maven-plugins/modules/org.apache.maven.plugins$maven-plugins/builds/2012-11-18_03-25-33/archive/org.apache.maven.plugins/maven-plugins/24-SNAPSHOT/maven-plugins-24-SNAPSHOT-site.xml
[JENKINS] Archiving <https://builds.apache.org/job/maven-plugins/ws/maven-linkcheck-plugin/pom.xml> to /home/hudson/hudson/jobs/maven-plugins/modules/org.apache.maven.plugins$maven-linkcheck-plugin/builds/2012-11-18_03-26-02/archive/org.apache.maven.plugins/maven-linkcheck-plugin/1.2-SNAPSHOT/maven-linkcheck-plugin-1.2-SNAPSHOT.pom
[JENKINS] Archiving <https://builds.apache.org/job/maven-plugins/ws/maven-linkcheck-plugin/target/maven-linkcheck-plugin-1.2-SNAPSHOT.jar> to /home/hudson/hudson/jobs/maven-plugins/modules/org.apache.maven.plugins$maven-linkcheck-plugin/builds/2012-11-18_03-26-02/archive/org.apache.maven.plugins/maven-linkcheck-plugin/1.2-SNAPSHOT/maven-linkcheck-plugin-1.2-SNAPSHOT.jar
[JENKINS] Archiving <https://builds.apache.org/job/maven-plugins/ws/maven-resources-plugin/pom.xml> to /home/hudson/hudson/jobs/maven-plugins/modules/org.apache.maven.plugins$maven-resources-plugin/builds/2012-11-18_03-26-06/archive/org.apache.maven.plugins/maven-resources-plugin/2.7-SNAPSHOT/maven-resources-plugin-2.7-SNAPSHOT.pom
[JENKINS] Archiving <https://builds.apache.org/job/maven-plugins/ws/maven-resources-plugin/target/maven-resources-plugin-2.7-SNAPSHOT.jar> to /home/hudson/hudson/jobs/maven-plugins/modules/org.apache.maven.plugins$maven-resources-plugin/builds/2012-11-18_03-26-06/archive/org.apache.maven.plugins/maven-resources-plugin/2.7-SNAPSHOT/maven-resources-plugin-2.7-SNAPSHOT.jar
Waiting for Jenkins to finish collecting data
mavenExecutionResult exceptions not empty
message : Failed to execute goal on project maven-compiler-plugin: Could not resolve dependencies for project org.apache.maven.plugins:maven-compiler-plugin:maven-plugin:3.1-SNAPSHOT: Could not find artifact org.apache.maven.shared:maven-shared-incremental:jar:1.0 in central (http://repo.maven.apache.org/maven2)
cause : Could not resolve dependencies for project org.apache.maven.plugins:maven-compiler-plugin:maven-plugin:3.1-SNAPSHOT: Could not find artifact org.apache.maven.shared:maven-shared-incremental:jar:1.0 in central (http://repo.maven.apache.org/maven2)
Stack trace :
org.apache.maven.lifecycle.LifecycleExecutionException: Failed to execute goal on project maven-compiler-plugin: Could not resolve dependencies for project org.apache.maven.plugins:maven-compiler-plugin:maven-plugin:3.1-SNAPSHOT: Could not find artifact org.apache.maven.shared:maven-shared-incremental:jar:1.0 in central (http://repo.maven.apache.org/maven2)
at org.apache.maven.lifecycle.internal.LifecycleDependencyResolver.getDependencies(LifecycleDependencyResolver.java:210)
at org.apache.maven.lifecycle.internal.LifecycleDependencyResolver.resolveProjectDependencies(LifecycleDependencyResolver.java:117)
at org.apache.maven.lifecycle.internal.MojoExecutor.ensureDependenciesAreResolved(MojoExecutor.java:258)
at org.apache.maven.lifecycle.internal.MojoExecutor.execute(MojoExecutor.java:201)
at org.apache.maven.lifecycle.internal.MojoExecutor.execute(MojoExecutor.java:153)
at org.apache.maven.lifecycle.internal.MojoExecutor.execute(MojoExecutor.java:145)
at org.apache.maven.lifecycle.internal.LifecycleModuleBuilder.buildProject(LifecycleModuleBuilder.java:84)
at org.apache.maven.lifecycle.internal.LifecycleThreadedBuilder$1.call(LifecycleThreadedBuilder.java:167)
at org.apache.maven.lifecycle.internal.LifecycleThreadedBuilder$1.call(LifecycleThreadedBuilder.java:163)
at java.util.concurrent.FutureTask$Sync.innerRun(FutureTask.java:269)
at java.util.concurrent.FutureTask.run(FutureTask.java:123)
at java.util.concurrent.ThreadPoolExecutor$Worker.runTask(ThreadPoolExecutor.java:651)
at java.util.concurrent.ThreadPoolExecutor$Worker.run(ThreadPoolExecutor.java:676)
at java.lang.Thread.run(Thread.java:595)
Caused by: org.apache.maven.project.DependencyResolutionException: Could not resolve dependencies for project org.apache.maven.plugins:maven-compiler-plugin:maven-plugin:3.1-SNAPSHOT: Could not find artifact org.apache.maven.shared:maven-shared-incremental:jar:1.0 in central (http://repo.maven.apache.org/maven2)
at org.apache.maven.project.DefaultProjectDependenciesResolver.resolve(DefaultProjectDependenciesResolver.java:189)
at org.apache.maven.lifecycle.internal.LifecycleDependencyResolver.getDependencies(LifecycleDependencyResolver.java:185)
... 13 more
Caused by: org.sonatype.aether.resolution.DependencyResolutionException: Could not find artifact org.apache.maven.shared:maven-shared-incremental:jar:1.0 in central (http://repo.maven.apache.org/maven2)
at org.sonatype.aether.impl.internal.DefaultRepositorySystem.resolveDependencies(DefaultRepositorySystem.java:375)
at org.apache.maven.project.DefaultProjectDependenciesResolver.resolve(DefaultProjectDependenciesResolver.java:183)
... 14 more
Caused by: org.sonatype.aether.resolution.ArtifactResolutionException: Could not find artifact org.apache.maven.shared:maven-shared-incremental:jar:1.0 in central (http://repo.maven.apache.org/maven2)
at org.sonatype.aether.impl.internal.DefaultArtifactResolver.resolve(DefaultArtifactResolver.java:538)
at org.sonatype.aether.impl.internal.DefaultArtifactResolver.resolveArtifacts(DefaultArtifactResolver.java:216)
at org.sonatype.aether.impl.internal.DefaultRepositorySystem.resolveDependencies(DefaultRepositorySystem.java:358)
... 15 more
Caused by: org.sonatype.aether.transfer.ArtifactNotFoundException: Could not find artifact org.apache.maven.shared:maven-shared-incremental:jar:1.0 in central (http://repo.maven.apache.org/maven2)
at org.sonatype.aether.connector.wagon.WagonRepositoryConnector$4.wrap(WagonRepositoryConnector.java:947)
at org.sonatype.aether.connector.wagon.WagonRepositoryConnector$4.wrap(WagonRepositoryConnector.java:941)
at org.sonatype.aether.connector.wagon.WagonRepositoryConnector$GetTask.run(WagonRepositoryConnector.java:669)
at org.sonatype.aether.util.concurrency.RunnableErrorForwarder$1.run(RunnableErrorForwarder.java:60)
... 3 more
Sending e-mails to: notifications@maven.apache.org
channel stopped
[WARNINGS] Skipping publisher since build result is FAILURE
Build failed in Jenkins: maven-plugins #1284
Posted by Apache Jenkins Server <je...@builds.apache.org>.
See <https://builds.apache.org/job/maven-plugins/1284/changes>
Changes:
[Robert Scholte] [MINVOKER-133] Using mergeUserSettings configuration parameter with multiple executions causes IllegalStateException
------------------------------------------
[...truncated 604 lines...]
[INFO]
[INFO] --- maven-compiler-plugin:2.5.1:compile (default-compile) @ maven-assembly-plugin ---
mojoSucceeded org.apache.maven.plugins:maven-compiler-plugin:2.5.1(default-compile)
[INFO] Using 'UTF-8' encoding to copy filtered resources.
mojoStarted org.apache.maven.plugins:maven-resources-plugin:2.3(default-testResources)
[INFO]
[INFO] --- maven-resources-plugin:2.3:testResources (default-testResources) @ maven-eclipse-plugin ---
mojoStarted org.apache.maven.plugins:maven-jar-plugin:2.4(default-jar)
[INFO]
[INFO] --- maven-jar-plugin:2.4:jar (default-jar) @ maven-ant-plugin ---
[INFO] Building jar: <https://builds.apache.org/job/maven-plugins/ws/maven-ant-plugin/target/maven-ant-plugin-2.4-SNAPSHOT.jar>
mojoSucceeded org.apache.maven.plugins:maven-jar-plugin:2.4(default-jar)
mojoSucceeded org.apache.maven.plugins:maven-compiler-plugin:2.5.1(default-compile)
mojoStarted org.apache.maven.plugins:maven-plugin-plugin:3.2(default-addPluginArtifactMetadata)
[INFO]
[INFO] --- maven-plugin-plugin:3.2:addPluginArtifactMetadata (default-addPluginArtifactMetadata) @ maven-ant-plugin ---
mojoSucceeded org.apache.maven.plugins:maven-plugin-plugin:3.2(default-addPluginArtifactMetadata)
mojoStarted org.codehaus.plexus:plexus-component-metadata:1.5.5(descriptors)
[INFO]
[INFO] --- plexus-component-metadata:1.5.5:generate-metadata (descriptors) @ maven-assembly-plugin ---
mojoStarted org.apache.maven.plugins:maven-install-plugin:2.3.1(default-install)
[INFO]
[INFO] --- maven-install-plugin:2.3.1:install (default-install) @ maven-ant-plugin ---
[INFO] Installing <https://builds.apache.org/job/maven-plugins/ws/maven-ant-plugin/target/maven-ant-plugin-2.4-SNAPSHOT.jar> to /home/jenkins/jenkins-slave/maven-repositories/0/org/apache/maven/plugins/maven-ant-plugin/2.4-SNAPSHOT/maven-ant-plugin-2.4-SNAPSHOT.jar
[INFO] Installing <https://builds.apache.org/job/maven-plugins/ws/maven-ant-plugin/pom.xml> to /home/jenkins/jenkins-slave/maven-repositories/0/org/apache/maven/plugins/maven-ant-plugin/2.4-SNAPSHOT/maven-ant-plugin-2.4-SNAPSHOT.pom
mojoSucceeded org.apache.maven.plugins:maven-install-plugin:2.3.1(default-install)
projectSucceeded org.apache.maven.plugins:maven-ant-plugin:2.4-SNAPSHOT
[INFO] Discovered 10 component descriptors(s)
projectStarted org.apache.maven.plugins:maven-changelog-plugin:2.3-SNAPSHOT
[INFO]
[INFO] ------------------------------------------------------------------------
[INFO] Building Maven Changelog Plugin 2.3-SNAPSHOT
[INFO] ------------------------------------------------------------------------
mojoSucceeded org.codehaus.plexus:plexus-component-metadata:1.5.5(descriptors)
mojoStarted org.apache.maven.plugins:maven-plugin-plugin:3.2(mojo-descriptor)[INFO] Using 'UTF-8' encoding to read mojo metadata.
[INFO] Applying mojo extractor for language: java
[INFO]
[INFO] --- maven-plugin-plugin:3.2:descriptor (mojo-descriptor) @ maven-assembly-plugin ---
[INFO] Mojo extractor for language: java found 0 mojo descriptors.
[INFO] Applying mojo extractor for language: bsh
[INFO] Mojo extractor for language: bsh found 0 mojo descriptors.
[INFO] Applying mojo extractor for language: java-annotations
[INFO] Mojo extractor for language: java-annotations found 8 mojo descriptors.
mojoStarted org.apache.maven.plugins:maven-clean-plugin:2.5(default-clean)[INFO] Deleting <https://builds.apache.org/job/maven-plugins/ws/maven-changelog-plugin/target>
[INFO]
[INFO] --- maven-clean-plugin:2.5:clean (default-clean) @ maven-changelog-plugin ---
mojoSucceeded org.apache.maven.plugins:maven-plugin-plugin:3.2(mojo-descriptor)
[debug] execute contextualize
mojoStarted org.apache.maven.plugins:maven-resources-plugin:2.5(default-testResources)[INFO] Using 'UTF-8' encoding to copy filtered resources.
[INFO]
[INFO] --- maven-resources-plugin:2.5:testResources (default-testResources) @ maven-assembly-plugin ---
[INFO] Copying 1 resource
[INFO] Copying 3 resources
mojoSucceeded org.apache.maven.plugins:maven-resources-plugin:2.5(default-testResources)
mojoStarted org.apache.maven.plugins:maven-compiler-plugin:2.5.1(default-testCompile)[INFO] Compiling 34 source files to <https://builds.apache.org/job/maven-plugins/ws/maven-assembly-plugin/target/test-classes>
[INFO]
[INFO] --- maven-compiler-plugin:2.5.1:testCompile (default-testCompile) @ maven-assembly-plugin ---
mojoSucceeded org.apache.maven.plugins:maven-compiler-plugin:2.5.1(default-testCompile)
mojoStarted org.codehaus.plexus:plexus-component-metadata:1.5.5(descriptors)
[INFO]
[INFO] --- plexus-component-metadata:1.5.5:generate-test-metadata (descriptors) @ maven-assembly-plugin ---
mojoSucceeded org.codehaus.plexus:plexus-component-metadata:1.5.5(descriptors)
[INFO] Surefire report directory: <https://builds.apache.org/job/maven-plugins/ws/maven-assembly-plugin/target/surefire-reports>
mojoStarted org.apache.maven.plugins:maven-surefire-plugin:2.12(default-test)
[INFO]
[INFO] --- maven-surefire-plugin:2.12:test (default-test) @ maven-assembly-plugin ---
-------------------------------------------------------
T E S T S
-------------------------------------------------------
Running org.apache.maven.plugin.assembly.io.DefaultAssemblyReaderTest
Tests run: 24, Failures: 0, Errors: 0, Skipped: 0, Time elapsed: 0.625 sec
Running org.apache.maven.plugin.assembly.io.PrefixedClasspathLocatorStrategyTest
Tests run: 4, Failures: 0, Errors: 0, Skipped: 0, Time elapsed: 0.001 sec
Running org.apache.maven.plugin.assembly.interpolation.AssemblyExpressionEvaluatorTest
Tests run: 5, Failures: 0, Errors: 0, Skipped: 0, Time elapsed: 0.12 sec
Running org.apache.maven.plugin.assembly.interpolation.AssemblyInterpolatorTest
Tests run: 7, Failures: 0, Errors: 0, Skipped: 0, Time elapsed: 0.004 sec
Running org.apache.maven.plugin.assembly.artifact.DefaultDependencyResolverTest
Tests run: 4, Failures: 0, Errors: 0, Skipped: 0, Time elapsed: 0.798 sec
Running org.apache.maven.plugin.assembly.filter.ComponentsXmlArchiverFileFilterTest
Tests run: 7, Failures: 0, Errors: 0, Skipped: 0, Time elapsed: 0.509 sec
Running org.apache.maven.plugin.assembly.utils.AssemblyFileUtilsTest
Tests run: 9, Failures: 0, Errors: 0, Skipped: 0, Time elapsed: 0.037 sec
Running org.apache.maven.plugin.assembly.utils.TypeConversionUtilsTest
Tests run: 6, Failures: 0, Errors: 0, Skipped: 0, Time elapsed: 0.003 sec
Running org.apache.maven.plugin.assembly.utils.AssemblyFormatUtilsTest
Tests run: 67, Failures: 0, Errors: 0, Skipped: 0, Time elapsed: 0.104 sec
Running org.apache.maven.plugin.assembly.utils.ProjectUtilsTest
Tests run: 5, Failures: 0, Errors: 0, Skipped: 0, Time elapsed: 0.001 sec
Running org.apache.maven.plugin.assembly.utils.FilterUtilsTest
Tests run: 12, Failures: 0, Errors: 0, Skipped: 0, Time elapsed: 0.013 sec
Running org.apache.maven.plugin.assembly.archive.ManifestCreationFinalizerTest
Tests run: 4, Failures: 0, Errors: 0, Skipped: 0, Time elapsed: 0.049 sec
Running org.apache.maven.plugin.assembly.archive.phase.FileItemAssemblyPhaseTest
mojoSucceeded org.apache.maven.plugins:maven-clean-plugin:2.5(default-clean)Tests run: 6, Failures: 0, Errors: 0, Skipped: 0, Time elapsed: 0.245 sec
Running org.apache.maven.plugin.assembly.archive.phase.RepositoryAssemblyPhaseTest
Tests run: 2, Failures: 0, Errors: 0, Skipped: 0, Time elapsed: 0.056 sec
Running org.apache.maven.plugin.assembly.archive.phase.FileSetAssemblyPhaseTest
Tests run: 2, Failures: 0, Errors: 0, Skipped: 0, Time elapsed: 0.064 sec
Running org.apache.maven.plugin.assembly.archive.phase.DependencySetAssemblyPhaseTest
mojoStarted org.apache.maven.plugins:maven-enforcer-plugin:1.0.1(ensure-no-container-api)Tests run: 2, Failures: 0, Errors: 0, Skipped: 0, Time elapsed: 0.013 sec
Running org.apache.maven.plugin.assembly.archive.phase.ModuleSetAssemblyPhaseTest
[INFO]
[INFO] --- maven-enforcer-plugin:1.0.1:enforce (ensure-no-container-api) @ maven-changelog-plugin ---
mojoSucceeded org.apache.maven.plugins:maven-enforcer-plugin:1.0.1(ensure-no-container-api)
Tests run: 26, Failures: 0, Errors: 0, Skipped: 0, Time elapsed: 0.468 sec
Running org.apache.maven.plugin.assembly.archive.task.AddDependencySetsTaskTest
Tests run: 8, Failures: 0, Errors: 0, Skipped: 0, Time elapsed: 0.018 sec
Running org.apache.maven.plugin.assembly.archive.task.AddDirectoryTaskTest
Tests run: 4, Failures: 0, Errors: 0, Skipped: 0, Time elapsed: 0.062 sec
Running org.apache.maven.plugin.assembly.archive.task.AddFileSetsTaskTest
Tests run: 9, Failures: 0, Errors: 0, Skipped: 0, Time elapsed: 0.309 sec
Running org.apache.maven.plugin.assembly.archive.task.AddArtifactTaskTest
Tests run: 5, Failures: 0, Errors: 0, Skipped: 0, Time elapsed: 0.009 sec
Running org.apache.maven.plugin.assembly.archive.DefaultAssemblyArchiverTest
Tests run: 11, Failures: 0, Errors: 0, Skipped: 0, Time elapsed: 0.688 sec
Running org.apache.maven.plugin.assembly.archive.archiver.AssemblyProxyArchiverTest
Tests run: 4, Failures: 0, Errors: 0, Skipped: 0, Time elapsed: 0.106 sec
Running org.apache.maven.plugin.assembly.format.FileFormatterTest
[INFO] Using 'UTF-8' encoding to read mojo metadata.
mojoStarted org.apache.maven.plugins:maven-plugin-plugin:3.2(generated-helpmojo)[INFO] Applying mojo extractor for language: java
[INFO]
[INFO] --- maven-plugin-plugin:3.2:helpmojo (generated-helpmojo) @ maven-changelog-plugin ---
[INFO] Mojo extractor for language: java found 0 mojo descriptors.
[INFO] Applying mojo extractor for language: bsh
[INFO] Mojo extractor for language: bsh found 0 mojo descriptors.
[INFO] Applying mojo extractor for language: java-annotations
Tests run: 14, Failures: 0, Errors: 0, Skipped: 0, Time elapsed: 1.082 sec
Running org.apache.maven.plugin.assembly.format.FileSetFormatterTest
[INFO] Mojo extractor for language: java-annotations found 0 mojo descriptors.
mojoSucceeded org.apache.maven.plugins:maven-plugin-plugin:3.2(generated-helpmojo)
[INFO] Using 'UTF-8' encoding to read mojo metadata.
mojoStarted org.apache.maven.plugins:maven-plugin-plugin:3.2(default-descriptor)[INFO] Applying mojo extractor for language: java
[INFO] Mojo extractor for language: java found 0 mojo descriptors.
[INFO] Applying mojo extractor for language: bsh
[INFO] Mojo extractor for language: bsh found 0 mojo descriptors.
[INFO] Applying mojo extractor for language: java-annotations
[INFO]
[INFO] --- maven-plugin-plugin:3.2:descriptor (default-descriptor) @ maven-changelog-plugin ---
[INFO] Mojo extractor for language: java-annotations found 0 mojo descriptors.
mojoSucceeded org.apache.maven.plugins:maven-plugin-plugin:3.2(default-descriptor)
mojoStarted org.apache.maven.plugins:maven-remote-resources-plugin:1.3(default)
[INFO]
[INFO] --- maven-remote-resources-plugin:1.3:process (default) @ maven-changelog-plugin ---
mojoSucceeded org.apache.maven.plugins:maven-remote-resources-plugin:1.3(default)
mojoStarted org.apache.maven.plugins:maven-resources-plugin:2.5(default-resources)[debug] execute contextualize
[INFO] Using 'UTF-8' encoding to copy filtered resources.
[INFO] Copying 6 resources
[INFO] Copying 3 resources
[INFO]
[INFO] --- maven-resources-plugin:2.5:resources (default-resources) @ maven-changelog-plugin ---
mojoSucceeded org.apache.maven.plugins:maven-resources-plugin:2.5(default-resources)
mojoStarted org.apache.maven.plugins:maven-compiler-plugin:2.5.1(default-compile)[INFO] Compiling 7 source files to <https://builds.apache.org/job/maven-plugins/ws/maven-changelog-plugin/target/classes>
[INFO]
[INFO] --- maven-compiler-plugin:2.5.1:compile (default-compile) @ maven-changelog-plugin ---
mojoSucceeded org.apache.maven.plugins:maven-compiler-plugin:2.5.1(default-compile)
[INFO] Using 'UTF-8' encoding to read mojo metadata.
mojoStarted org.apache.maven.plugins:maven-plugin-plugin:3.2(mojo-descriptor)[INFO] Applying mojo extractor for language: java
[INFO] Mojo extractor for language: java found 0 mojo descriptors.
[INFO] Applying mojo extractor for language: bsh
[INFO] Mojo extractor for language: bsh found 0 mojo descriptors.
[INFO] Applying mojo extractor for language: java-annotations
[INFO]
[INFO] --- maven-plugin-plugin:3.2:descriptor (mojo-descriptor) @ maven-changelog-plugin ---
[INFO] Mojo extractor for language: java-annotations found 4 mojo descriptors.
mojoSucceeded org.apache.maven.plugins:maven-plugin-plugin:3.2(mojo-descriptor)
mojoStarted org.apache.maven.plugins:maven-resources-plugin:2.5(default-testResources)[debug] execute contextualize
[INFO] Using 'UTF-8' encoding to copy filtered resources.
[INFO] skip non existing resourceDirectory <https://builds.apache.org/job/maven-plugins/ws/maven-changelog-plugin/src/test/resources>
[INFO] Copying 3 resources
[INFO]
[INFO] --- maven-resources-plugin:2.5:testResources (default-testResources) @ maven-changelog-plugin ---
mojoSucceeded org.apache.maven.plugins:maven-resources-plugin:2.5(default-testResources)
mojoStarted org.apache.maven.plugins:maven-compiler-plugin:2.5.1(default-testCompile)
[INFO]
[INFO] --- maven-compiler-plugin:2.5.1:testCompile (default-testCompile) @ maven-changelog-plugin ---
[INFO] Compiling 16 source files to <https://builds.apache.org/job/maven-plugins/ws/maven-changelog-plugin/target/test-classes>
mojoSucceeded org.apache.maven.plugins:maven-compiler-plugin:2.5.1(default-testCompile)
mojoStarted org.apache.maven.plugins:maven-surefire-plugin:2.12(default-test)[INFO] Surefire report directory: <https://builds.apache.org/job/maven-plugins/ws/maven-changelog-plugin/target/surefire-reports>
-------------------------------------------------------
T E S T S
-------------------------------------------------------
[INFO]
[INFO] --- maven-surefire-plugin:2.12:test (default-test) @ maven-changelog-plugin ---
Running org.apache.maven.plugin.changelog.FileActivityReportTest
[INFO] Using existing changelog.xml...
Tests run: 2, Failures: 0, Errors: 0, Skipped: 0, Time elapsed: 1.408 sec
Running org.apache.maven.plugin.changelog.ChangeLogTest
Tests run: 1, Failures: 0, Errors: 0, Skipped: 0, Time elapsed: 0.006 sec
Running org.apache.maven.plugin.changelog.FileActivityComparatorTest
Tests run: 3, Failures: 0, Errors: 0, Skipped: 0, Time elapsed: 0 sec
Running org.apache.maven.plugin.changelog.ChangeLogReportTest
[INFO] Generating changed sets xml to: <https://builds.apache.org/job/maven-plugins/ws/maven-changelog-plugin/target/test-harness/4/changelog.xml>
[INFO] Generating changed sets xml to: <https://builds.apache.org/job/maven-plugins/ws/maven-changelog-plugin/target/test-harness/5/changelog.xml>
[ERROR] Provider message:
[ERROR] Provider Stub Error Message
[ERROR] Command output:
[ERROR] Provider Stub Commandline
[INFO] Using existing changelog.xml...
[INFO] Generating changed sets xml to: <https://builds.apache.org/job/maven-plugins/ws/maven-changelog-plugin/target/test-harness/8/changelog.xml>
[INFO] Generating changed sets xml to: <https://builds.apache.org/job/maven-plugins/ws/maven-changelog-plugin/target/test-harness/9/changelog.xml>
[INFO] Generating changed sets xml to: <https://builds.apache.org/job/maven-plugins/ws/maven-changelog-plugin/target/test-harness/10/changelog.xml>
[INFO] Generating changed sets xml to: <https://builds.apache.org/job/maven-plugins/ws/maven-changelog-plugin/target/test-harness/11/changelog.xml>
[INFO] Generating changed sets xml to: <https://builds.apache.org/job/maven-plugins/ws/maven-changelog-plugin/target/test-harness/12/changelog.xml>
[INFO] Generating changed sets xml to: <https://builds.apache.org/job/maven-plugins/ws/maven-changelog-plugin/target/test-harness/13/changelog.xml>
[INFO] Generating changed sets xml to: <https://builds.apache.org/job/maven-plugins/ws/maven-changelog-plugin/target/test-harness/14/changelog.xml>
[INFO] Generating changed sets xml to: <https://builds.apache.org/job/maven-plugins/ws/maven-changelog-plugin/target/test-harness/15/changelog.xml>
Tests run: 13, Failures: 0, Errors: 0, Skipped: 0, Time elapsed: 2.003 sec
Running org.apache.maven.plugin.changelog.DeveloperActivityReportTest
[INFO] Using existing changelog.xml...
Tests run: 2, Failures: 0, Errors: 0, Skipped: 0, Time elapsed: 0.446 sec
Results :
Tests run: 21, Failures: 0, Errors: 0, Skipped: 0
mojoSucceeded org.apache.maven.plugins:maven-surefire-plugin:2.12(default-test)
[JENKINS] Recording test results
mojoStarted org.apache.maven.plugins:maven-jar-plugin:2.4(default-jar)
[INFO]
[INFO] --- maven-jar-plugin:2.4:jar (default-jar) @ maven-changelog-plugin ---
Nov 17, 2012 10:06:23 PM hudson.remoting.SynchronousCommandTransport$ReaderThread run
SEVERE: I/O error in channel channel
java.io.StreamCorruptedException
at java.io.ObjectInputStream.readObject0(ObjectInputStream.java:1332)
at java.io.ObjectInputStream.readObject(ObjectInputStream.java:348)
at hudson.remoting.Command.readFrom(Command.java:90)
at hudson.remoting.ClassicCommandTransport.read(ClassicCommandTransport.java:59)
at hudson.remoting.SynchronousCommandTransport$ReaderThread.run(SynchronousCommandTransport.java:48)
channel stopped
Sending e-mails to: notifications@maven.apache.org
ERROR: Maven JVM terminated unexpectedly with exit code 0
[WARNINGS] Skipping publisher since build result is FAILURE
Build failed in Jenkins: maven-plugins #1283
Posted by Apache Jenkins Server <je...@builds.apache.org>.
See <https://builds.apache.org/job/maven-plugins/1283/>
------------------------------------------
[...truncated 7830 lines...]
Running org.apache.maven.plugins.shade.relocation.SimpleRelocatorTest
Tests run: 7, Failures: 0, Errors: 0, Skipped: 0, Time elapsed: 0.007 sec
Running org.apache.maven.plugins.shade.relocation.SimpleRelocatorParameterTest
Tests run: 2, Failures: 0, Errors: 0, Skipped: 0, Time elapsed: 0.001 sec
Results :
Tests run: 27, Failures: 0, Errors: 0, Skipped: 0
mojoSucceeded org.apache.maven.plugins:maven-surefire-plugin:2.12(default-test)
2012-11-17 14:19:32.792::INFO: Shutdown hook complete
[JENKINS] Recording test results
mojoStarted org.apache.maven.plugins:maven-jar-plugin:2.4(default-jar)
[INFO]
[INFO] --- maven-jar-plugin:2.4:jar (default-jar) @ maven-shade-plugin ---
[INFO] Building jar: <https://builds.apache.org/job/maven-plugins/ws/maven-shade-plugin/target/maven-shade-plugin-2.0.1-SNAPSHOT.jar>
mojoSucceeded org.apache.maven.plugins:maven-jar-plugin:2.4(default-jar)
2012-11-17 14:19:33.792::INFO: Shutdown hook complete
mojoStarted org.apache.maven.plugins:maven-plugin-plugin:3.2(default-addPluginArtifactMetadata)
[INFO]
[INFO] --- maven-plugin-plugin:3.2:addPluginArtifactMetadata (default-addPluginArtifactMetadata) @ maven-shade-plugin ---
mojoSucceeded org.apache.maven.plugins:maven-plugin-plugin:3.2(default-addPluginArtifactMetadata)
mojoStarted org.apache.maven.plugins:maven-install-plugin:2.3.1(default-install)[INFO] Installing <https://builds.apache.org/job/maven-plugins/ws/maven-shade-plugin/target/maven-shade-plugin-2.0.1-SNAPSHOT.jar> to /home/jenkins/jenkins-slave/maven-repositories/1/org/apache/maven/plugins/maven-shade-plugin/2.0.1-SNAPSHOT/maven-shade-plugin-2.0.1-SNAPSHOT.jar
[INFO]
[INFO] --- maven-install-plugin:2.3.1:install (default-install) @ maven-shade-plugin ---
[INFO] Installing <https://builds.apache.org/job/maven-plugins/ws/maven-shade-plugin/pom.xml> to /home/jenkins/jenkins-slave/maven-repositories/1/org/apache/maven/plugins/maven-shade-plugin/2.0.1-SNAPSHOT/maven-shade-plugin-2.0.1-SNAPSHOT.pom
mojoSucceeded org.apache.maven.plugins:maven-install-plugin:2.3.1(default-install)
projectSucceeded org.apache.maven.plugins:maven-shade-plugin:2.0.1-SNAPSHOT
Results :
Tests run: 17, Failures: 0, Errors: 0, Skipped: 0
mojoSucceeded org.apache.maven.plugins:maven-surefire-plugin:2.12(default-test)
[JENKINS] Recording test results
mojoStarted org.apache.maven.plugins:maven-jar-plugin:2.4(default-jar)
[INFO]
[INFO] --- maven-jar-plugin:2.4:jar (default-jar) @ maven-project-info-reports-plugin ---
[INFO] Building jar: <https://builds.apache.org/job/maven-plugins/ws/maven-project-info-reports-plugin/target/maven-project-info-reports-plugin-2.7-SNAPSHOT.jar>
mojoSucceeded org.apache.maven.plugins:maven-jar-plugin:2.4(default-jar)
mojoStarted org.apache.maven.plugins:maven-plugin-plugin:3.2(default-addPluginArtifactMetadata)
[INFO]
[INFO] --- maven-plugin-plugin:3.2:addPluginArtifactMetadata (default-addPluginArtifactMetadata) @ maven-project-info-reports-plugin ---
mojoSucceeded org.apache.maven.plugins:maven-plugin-plugin:3.2(default-addPluginArtifactMetadata)
mojoStarted org.apache.maven.plugins:maven-jarsigner-plugin:1.2(sign)
[INFO]
[INFO] --- maven-jarsigner-plugin:1.2:sign (sign) @ maven-project-info-reports-plugin ---
[INFO] 1 archive(s) processed
mojoSucceeded org.apache.maven.plugins:maven-jarsigner-plugin:1.2(sign)
mojoStarted org.apache.maven.plugins:maven-jarsigner-plugin:1.2(verify)
[INFO]
[INFO] --- maven-jarsigner-plugin:1.2:verify (verify) @ maven-project-info-reports-plugin ---
[INFO] 1 archive(s) processed
mojoSucceeded org.apache.maven.plugins:maven-jarsigner-plugin:1.2(verify)
mojoStarted org.apache.maven.plugins:maven-install-plugin:2.3.1(default-install)[INFO] Installing <https://builds.apache.org/job/maven-plugins/ws/maven-project-info-reports-plugin/target/maven-project-info-reports-plugin-2.7-SNAPSHOT.jar> to /home/jenkins/jenkins-slave/maven-repositories/1/org/apache/maven/plugins/maven-project-info-reports-plugin/2.7-SNAPSHOT/maven-project-info-reports-plugin-2.7-SNAPSHOT.jar
[INFO]
[INFO] --- maven-install-plugin:2.3.1:install (default-install) @ maven-project-info-reports-plugin ---
[INFO] Installing <https://builds.apache.org/job/maven-plugins/ws/maven-project-info-reports-plugin/pom.xml> to /home/jenkins/jenkins-slave/maven-repositories/1/org/apache/maven/plugins/maven-project-info-reports-plugin/2.7-SNAPSHOT/maven-project-info-reports-plugin-2.7-SNAPSHOT.pom
mojoSucceeded org.apache.maven.plugins:maven-install-plugin:2.3.1(default-install)
projectSucceeded org.apache.maven.plugins:maven-project-info-reports-plugin:2.7-SNAPSHOT
sessionEnded
[INFO] ------------------------------------------------------------------------
[INFO] Reactor Summary:
[INFO]
[INFO] Maven Plugins ..................................... SUCCESS [1:00.216s]
[INFO] Maven ACR Plugin .................................. SUCCESS [1:06.766s]
[INFO] Maven Ant Plugin .................................. SUCCESS [1:16.500s]
[INFO] Maven AntRun Plugin ............................... SUCCESS [5.824s]
[INFO] Maven Eclipse Plugin .............................. SUCCESS [29.733s]
[INFO] Maven Assembly Plugin ............................. SUCCESS [25.588s]
[INFO] Maven Changelog Plugin ............................ SUCCESS [16.216s]
[INFO] Maven Changes Report Plugin ....................... SUCCESS [19.392s]
[INFO] Maven Checkstyle Plugin ........................... SUCCESS [20.917s]
[INFO] Maven Clean Plugin ................................ SUCCESS [6.931s]
[INFO] Maven Compiler Plugin ............................. FAILURE [0.790s]
[INFO] Maven Dependency Plugin ........................... SUCCESS [1:18.615s]
[INFO] Maven Deploy Plugin ............................... SUCCESS [7.646s]
[INFO] Maven DOAP Plugin ................................. SUCCESS [15.748s]
[INFO] Maven Documentation Checker Plugin ................ SUCCESS [5.330s]
[INFO] Maven EAR Plugin .................................. SUCCESS [13.871s]
[INFO] Maven EJB Plugin .................................. SUCCESS [10.840s]
[INFO] Maven GPG Plugin .................................. SUCCESS [3.605s]
[INFO] Maven Help Plugin ................................. SUCCESS [6.441s]
[INFO] Maven IDEA Plugin ................................. SUCCESS [14.268s]
[INFO] Maven Install Plugin .............................. SUCCESS [15.387s]
[INFO] Maven JAR Plugin .................................. SUCCESS [7.533s]
[INFO] Maven Jarsigner Plugin ............................ SUCCESS [3.929s]
[INFO] Maven Javadoc Plugin .............................. SUCCESS [2:02.985s]
[INFO] Maven Linkcheck Plugin ............................ SUCCESS [13.323s]
[INFO] Maven One Plugin .................................. SUCCESS [12.167s]
[INFO] Maven Patch Plugin ................................ SUCCESS [11.238s]
[INFO] Maven PDF Plugin .................................. SUCCESS [26.736s]
[INFO] Maven PMD Plugin .................................. SUCCESS [24.467s]
[INFO] Maven RAR Plugin .................................. SUCCESS [6.353s]
[INFO] Maven Reactor Plugin .............................. SUCCESS [7.366s]
[INFO] Maven Repository Plugin ........................... SUCCESS [16.483s]
[INFO] Maven Resources Plugin ............................ SUCCESS [7.484s]
[INFO] Maven Site Plugin 3 ............................... SUCCESS [14.810s]
[INFO] Maven Source Plugin ............................... SUCCESS [7.544s]
[INFO] Maven Stage Plugin ................................ SUCCESS [5.095s]
[INFO] Maven Toolchains Plugin ........................... SUCCESS [4.166s]
[INFO] Maven Verifier Plugin ............................. SUCCESS [4.261s]
[INFO] Maven WAR Plugin .................................. SUCCESS [33.039s]
[INFO] SCM Publish Maven Plugin .......................... SUCCESS [13.924s]
[INFO] Maven Invoker Plugin .............................. SUCCESS [19.093s]
[INFO] Maven Project Info Reports Plugin ................. SUCCESS [27.716s]
[INFO] Maven Remote Resources Plugin ..................... SUCCESS [11.405s]
[INFO] Maven Shade Plugin ................................ SUCCESS [12.109s]
[INFO] Maven Plugins Aggregator .......................... SUCCESS [0.521s]
[INFO] ------------------------------------------------------------------------
[INFO] BUILD FAILURE
[INFO] ------------------------------------------------------------------------
[INFO] Total time: 5:21.434s (Wall Clock)
[INFO] Finished at: Sat Nov 17 14:19:40 UTC 2012
[INFO] Final Memory: 77M/407M
[INFO] ------------------------------------------------------------------------
Projects to build: [MavenProject: org.apache.maven.plugins:maven-plugins:24-SNAPSHOT @ <https://builds.apache.org/job/maven-plugins/ws/maven-plugins/pom.xml,> MavenProject: org.apache.maven.plugins:maven-acr-plugin:1.0.1-SNAPSHOT @ <https://builds.apache.org/job/maven-plugins/ws/maven-acr-plugin/pom.xml,> MavenProject: org.apache.maven.plugins:maven-ant-plugin:2.4-SNAPSHOT @ <https://builds.apache.org/job/maven-plugins/ws/maven-ant-plugin/pom.xml,> MavenProject: org.apache.maven.plugins:maven-antrun-plugin:1.8-SNAPSHOT @ <https://builds.apache.org/job/maven-plugins/ws/maven-antrun-plugin/pom.xml,> MavenProject: org.apache.maven.plugins:maven-eclipse-plugin:2.10-SNAPSHOT @ <https://builds.apache.org/job/maven-plugins/ws/maven-eclipse-plugin/pom.xml,> MavenProject: org.apache.maven.plugins:maven-assembly-plugin:2.5-SNAPSHOT @ <https://builds.apache.org/job/maven-plugins/ws/maven-assembly-plugin/pom.xml,> MavenProject: org.apache.maven.plugins:maven-changelog-plugin:2.3-SNAPSHOT @ <https://builds.apache.org/job/maven-plugins/ws/maven-changelog-plugin/pom.xml,> MavenProject: org.apache.maven.plugins:maven-changes-plugin:2.9-SNAPSHOT @ <https://builds.apache.org/job/maven-plugins/ws/maven-changes-plugin/pom.xml,> MavenProject: org.apache.maven.plugins:maven-checkstyle-plugin:2.10-SNAPSHOT @ <https://builds.apache.org/job/maven-plugins/ws/maven-checkstyle-plugin/pom.xml,> MavenProject: org.apache.maven.plugins:maven-clean-plugin:2.6-SNAPSHOT @ <https://builds.apache.org/job/maven-plugins/ws/maven-clean-plugin/pom.xml,> MavenProject: org.apache.maven.plugins:maven-compiler-plugin:3.1-SNAPSHOT @ <https://builds.apache.org/job/maven-plugins/ws/maven-compiler-plugin/pom.xml,> MavenProject: org.apache.maven.plugins:maven-dependency-plugin:2.7-SNAPSHOT @ <https://builds.apache.org/job/maven-plugins/ws/maven-dependency-plugin/pom.xml,> MavenProject: org.apache.maven.plugins:maven-deploy-plugin:2.8-SNAPSHOT @ <https://builds.apache.org/job/maven-plugins/ws/maven-deploy-plugin/pom.xml,> MavenProject: org.apache.maven.plugins:maven-doap-plugin:1.2-SNAPSHOT @ <https://builds.apache.org/job/maven-plugins/ws/maven-doap-plugin/pom.xml,> MavenProject: org.apache.maven.plugins:maven-docck-plugin:1.1-SNAPSHOT @ <https://builds.apache.org/job/maven-plugins/ws/maven-docck-plugin/pom.xml,> MavenProject: org.apache.maven.plugins:maven-ear-plugin:2.9-SNAPSHOT @ <https://builds.apache.org/job/maven-plugins/ws/maven-ear-plugin/pom.xml,> MavenProject: org.apache.maven.plugins:maven-ejb-plugin:2.4-SNAPSHOT @ <https://builds.apache.org/job/maven-plugins/ws/maven-ejb-plugin/pom.xml,> MavenProject: org.apache.maven.plugins:maven-gpg-plugin:1.5-SNAPSHOT @ <https://builds.apache.org/job/maven-plugins/ws/maven-gpg-plugin/pom.xml,> MavenProject: org.apache.maven.plugins:maven-help-plugin:2.2-SNAPSHOT @ <https://builds.apache.org/job/maven-plugins/ws/maven-help-plugin/pom.xml,> MavenProject: org.apache.maven.plugins:maven-idea-plugin:2.3-SNAPSHOT @ <https://builds.apache.org/job/maven-plugins/ws/maven-idea-plugin/pom.xml,> MavenProject: org.apache.maven.plugins:maven-install-plugin:2.5-SNAPSHOT @ <https://builds.apache.org/job/maven-plugins/ws/maven-install-plugin/pom.xml,> MavenProject: org.apache.maven.plugins:maven-jar-plugin:2.5-SNAPSHOT @ <https://builds.apache.org/job/maven-plugins/ws/maven-jar-plugin/pom.xml,> MavenProject: org.apache.maven.plugins:maven-jarsigner-plugin:1.3-SNAPSHOT @ <https://builds.apache.org/job/maven-plugins/ws/maven-jarsigner-plugin/pom.xml,> MavenProject: org.apache.maven.plugins:maven-javadoc-plugin:2.10-SNAPSHOT @ <https://builds.apache.org/job/maven-plugins/ws/maven-javadoc-plugin/pom.xml,> MavenProject: org.apache.maven.plugins:maven-linkcheck-plugin:1.2-SNAPSHOT @ <https://builds.apache.org/job/maven-plugins/ws/maven-linkcheck-plugin/pom.xml,> MavenProject: org.apache.maven.plugins:maven-one-plugin:1.3-SNAPSHOT @ <https://builds.apache.org/job/maven-plugins/ws/maven-one-plugin/pom.xml,> MavenProject: org.apache.maven.plugins:maven-patch-plugin:1.1.2-SNAPSHOT @ <https://builds.apache.org/job/maven-plugins/ws/maven-patch-plugin/pom.xml,> MavenProject: org.apache.maven.plugins:maven-pdf-plugin:1.3-SNAPSHOT @ <https://builds.apache.org/job/maven-plugins/ws/maven-pdf-plugin/pom.xml,> MavenProject: org.apache.maven.plugins:maven-pmd-plugin:2.8-SNAPSHOT @ <https://builds.apache.org/job/maven-plugins/ws/maven-pmd-plugin/pom.xml,> MavenProject: org.apache.maven.plugins:maven-rar-plugin:2.3-SNAPSHOT @ <https://builds.apache.org/job/maven-plugins/ws/maven-rar-plugin/pom.xml,> MavenProject: org.apache.maven.plugins:maven-reactor-plugin:1.1-SNAPSHOT @ <https://builds.apache.org/job/maven-plugins/ws/maven-reactor-plugin/pom.xml,> MavenProject: org.apache.maven.plugins:maven-repository-plugin:2.3.2-SNAPSHOT @ <https://builds.apache.org/job/maven-plugins/ws/maven-repository-plugin/pom.xml,> MavenProject: org.apache.maven.plugins:maven-resources-plugin:2.7-SNAPSHOT @ <https://builds.apache.org/job/maven-plugins/ws/maven-resources-plugin/pom.xml,> MavenProject: org.apache.maven.plugins:maven-site-plugin:3.3-SNAPSHOT @ <https://builds.apache.org/job/maven-plugins/ws/maven-site-plugin/dependency-reduced-pom.xml,> MavenProject: org.apache.maven.plugins:maven-source-plugin:2.3-SNAPSHOT @ <https://builds.apache.org/job/maven-plugins/ws/maven-source-plugin/pom.xml,> MavenProject: org.apache.maven.plugins:maven-stage-plugin:1.0-SNAPSHOT @ <https://builds.apache.org/job/maven-plugins/ws/maven-stage-plugin/pom.xml,> MavenProject: org.apache.maven.plugins:maven-toolchains-plugin:1.1-SNAPSHOT @ <https://builds.apache.org/job/maven-plugins/ws/maven-toolchains-plugin/pom.xml,> MavenProject: org.apache.maven.plugins:maven-verifier-plugin:1.1-SNAPSHOT @ <https://builds.apache.org/job/maven-plugins/ws/maven-verifier-plugin/pom.xml,> MavenProject: org.apache.maven.plugins:maven-war-plugin:2.4-SNAPSHOT @ <https://builds.apache.org/job/maven-plugins/ws/maven-war-plugin/pom.xml,> MavenProject: org.apache.maven.plugins:maven-scm-publish-plugin:1.0-SNAPSHOT @ <https://builds.apache.org/job/maven-plugins/ws/maven-scm-publish-plugin/pom.xml,> MavenProject: org.apache.maven.plugins:maven-invoker-plugin:1.8-SNAPSHOT @ <https://builds.apache.org/job/maven-plugins/ws/maven-invoker-plugin/pom.xml,> MavenProject: org.apache.maven.plugins:maven-project-info-reports-plugin:2.7-SNAPSHOT @ <https://builds.apache.org/job/maven-plugins/ws/maven-project-info-reports-plugin/pom.xml,> MavenProject: org.apache.maven.plugins:maven-remote-resources-plugin:1.5-SNAPSHOT @ <https://builds.apache.org/job/maven-plugins/ws/maven-remote-resources-plugin/pom.xml,> MavenProject: org.apache.maven.plugins:maven-shade-plugin:2.0.1-SNAPSHOT @ <https://builds.apache.org/job/maven-plugins/ws/maven-shade-plugin/pom.xml,> MavenProject: org.apache.maven.plugins:maven-plugins-aggregator:1-SNAPSHOT @ <https://builds.apache.org/job/maven-plugins/ws/pom.xml]>
[JENKINS] Archiving <https://builds.apache.org/job/maven-plugins/ws/maven-war-plugin/pom.xml> to /home/hudson/hudson/jobs/maven-plugins/modules/org.apache.maven.plugins$maven-war-plugin/builds/2012-11-17_14-13-43/archive/org.apache.maven.plugins/maven-war-plugin/2.4-SNAPSHOT/maven-war-plugin-2.4-SNAPSHOT.pom
[JENKINS] Archiving <https://builds.apache.org/job/maven-plugins/ws/maven-war-plugin/target/maven-war-plugin-2.4-SNAPSHOT.jar> to /home/hudson/hudson/jobs/maven-plugins/modules/org.apache.maven.plugins$maven-war-plugin/builds/2012-11-17_14-13-43/archive/org.apache.maven.plugins/maven-war-plugin/2.4-SNAPSHOT/maven-war-plugin-2.4-SNAPSHOT.jar
[JENKINS] Archiving <https://builds.apache.org/job/maven-plugins/ws/maven-docck-plugin/pom.xml> to /home/hudson/hudson/jobs/maven-plugins/modules/org.apache.maven.plugins$maven-docck-plugin/builds/2012-11-17_14-13-20/archive/org.apache.maven.plugins/maven-docck-plugin/1.1-SNAPSHOT/maven-docck-plugin-1.1-SNAPSHOT.pom
[JENKINS] Archiving <https://builds.apache.org/job/maven-plugins/ws/maven-docck-plugin/target/maven-docck-plugin-1.1-SNAPSHOT.jar> to /home/hudson/hudson/jobs/maven-plugins/modules/org.apache.maven.plugins$maven-docck-plugin/builds/2012-11-17_14-13-20/archive/org.apache.maven.plugins/maven-docck-plugin/1.1-SNAPSHOT/maven-docck-plugin-1.1-SNAPSHOT.jar
[JENKINS] Archiving <https://builds.apache.org/job/maven-plugins/ws/pom.xml> to /home/hudson/hudson/jobs/maven-plugins/modules/org.apache.maven.plugins$maven-plugins-aggregator/builds/2012-11-17_14-13-15/archive/org.apache.maven.plugins/maven-plugins-aggregator/1-SNAPSHOT/maven-plugins-aggregator-1-SNAPSHOT.pom
[JENKINS] Archiving <https://builds.apache.org/job/maven-plugins/ws/maven-idea-plugin/pom.xml> to /home/hudson/hudson/jobs/maven-plugins/modules/org.apache.maven.plugins$maven-idea-plugin/builds/2012-11-17_14-13-25/archive/org.apache.maven.plugins/maven-idea-plugin/2.3-SNAPSHOT/maven-idea-plugin-2.3-SNAPSHOT.pom
[JENKINS] Archiving <https://builds.apache.org/job/maven-plugins/ws/maven-idea-plugin/target/maven-idea-plugin-2.3-SNAPSHOT.jar> to /home/hudson/hudson/jobs/maven-plugins/modules/org.apache.maven.plugins$maven-idea-plugin/builds/2012-11-17_14-13-25/archive/org.apache.maven.plugins/maven-idea-plugin/2.3-SNAPSHOT/maven-idea-plugin-2.3-SNAPSHOT.jar
[JENKINS] Archiving <https://builds.apache.org/job/maven-plugins/ws/maven-toolchains-plugin/pom.xml> to /home/hudson/hudson/jobs/maven-plugins/modules/org.apache.maven.plugins$maven-toolchains-plugin/builds/2012-11-17_14-13-42/archive/org.apache.maven.plugins/maven-toolchains-plugin/1.1-SNAPSHOT/maven-toolchains-plugin-1.1-SNAPSHOT.pom
[JENKINS] Archiving <https://builds.apache.org/job/maven-plugins/ws/maven-toolchains-plugin/target/maven-toolchains-plugin-1.1-SNAPSHOT.jar> to /home/hudson/hudson/jobs/maven-plugins/modules/org.apache.maven.plugins$maven-toolchains-plugin/builds/2012-11-17_14-13-42/archive/org.apache.maven.plugins/maven-toolchains-plugin/1.1-SNAPSHOT/maven-toolchains-plugin-1.1-SNAPSHOT.jar
[JENKINS] Archiving <https://builds.apache.org/job/maven-plugins/ws/maven-pmd-plugin/pom.xml> to /home/hudson/hudson/jobs/maven-plugins/modules/org.apache.maven.plugins$maven-pmd-plugin/builds/2012-11-17_14-13-33/archive/org.apache.maven.plugins/maven-pmd-plugin/2.8-SNAPSHOT/maven-pmd-plugin-2.8-SNAPSHOT.pom
[JENKINS] Archiving <https://builds.apache.org/job/maven-plugins/ws/maven-pmd-plugin/target/maven-pmd-plugin-2.8-SNAPSHOT.jar> to /home/hudson/hudson/jobs/maven-plugins/modules/org.apache.maven.plugins$maven-pmd-plugin/builds/2012-11-17_14-13-33/archive/org.apache.maven.plugins/maven-pmd-plugin/2.8-SNAPSHOT/maven-pmd-plugin-2.8-SNAPSHOT.jar
[JENKINS] Archiving <https://builds.apache.org/job/maven-plugins/ws/maven-eclipse-plugin/pom.xml> to /home/hudson/hudson/jobs/maven-plugins/modules/org.apache.maven.plugins$maven-eclipse-plugin/builds/2012-11-17_14-13-16/archive/org.apache.maven.plugins/maven-eclipse-plugin/2.10-SNAPSHOT/maven-eclipse-plugin-2.10-SNAPSHOT.pom
[JENKINS] Archiving <https://builds.apache.org/job/maven-plugins/ws/maven-eclipse-plugin/target/maven-eclipse-plugin-2.10-SNAPSHOT.jar> to /home/hudson/hudson/jobs/maven-plugins/modules/org.apache.maven.plugins$maven-eclipse-plugin/builds/2012-11-17_14-13-16/archive/org.apache.maven.plugins/maven-eclipse-plugin/2.10-SNAPSHOT/maven-eclipse-plugin-2.10-SNAPSHOT.jar
[JENKINS] Archiving <https://builds.apache.org/job/maven-plugins/ws/maven-gpg-plugin/pom.xml> to /home/hudson/hudson/jobs/maven-plugins/modules/org.apache.maven.plugins$maven-gpg-plugin/builds/2012-11-17_14-13-23/archive/org.apache.maven.plugins/maven-gpg-plugin/1.5-SNAPSHOT/maven-gpg-plugin-1.5-SNAPSHOT.pom
[JENKINS] Archiving <https://builds.apache.org/job/maven-plugins/ws/maven-gpg-plugin/target/maven-gpg-plugin-1.5-SNAPSHOT.jar> to /home/hudson/hudson/jobs/maven-plugins/modules/org.apache.maven.plugins$maven-gpg-plugin/builds/2012-11-17_14-13-23/archive/org.apache.maven.plugins/maven-gpg-plugin/1.5-SNAPSHOT/maven-gpg-plugin-1.5-SNAPSHOT.jar
[JENKINS] Archiving <https://builds.apache.org/job/maven-plugins/ws/maven-clean-plugin/pom.xml> to /home/hudson/hudson/jobs/maven-plugins/modules/org.apache.maven.plugins$maven-clean-plugin/builds/2012-11-17_14-13-16/archive/org.apache.maven.plugins/maven-clean-plugin/2.6-SNAPSHOT/maven-clean-plugin-2.6-SNAPSHOT.pom
[JENKINS] Archiving <https://builds.apache.org/job/maven-plugins/ws/maven-clean-plugin/target/maven-clean-plugin-2.6-SNAPSHOT.jar> to /home/hudson/hudson/jobs/maven-plugins/modules/org.apache.maven.plugins$maven-clean-plugin/builds/2012-11-17_14-13-16/archive/org.apache.maven.plugins/maven-clean-plugin/2.6-SNAPSHOT/maven-clean-plugin-2.6-SNAPSHOT.jar
[JENKINS] Archiving <https://builds.apache.org/job/maven-plugins/ws/maven-jar-plugin/pom.xml> to /home/hudson/hudson/jobs/maven-plugins/modules/org.apache.maven.plugins$maven-jar-plugin/builds/2012-11-17_14-13-28/archive/org.apache.maven.plugins/maven-jar-plugin/2.5-SNAPSHOT/maven-jar-plugin-2.5-SNAPSHOT.pom
[JENKINS] Archiving <https://builds.apache.org/job/maven-plugins/ws/maven-jar-plugin/target/maven-jar-plugin-2.5-SNAPSHOT.jar> to /home/hudson/hudson/jobs/maven-plugins/modules/org.apache.maven.plugins$maven-jar-plugin/builds/2012-11-17_14-13-28/archive/org.apache.maven.plugins/maven-jar-plugin/2.5-SNAPSHOT/maven-jar-plugin-2.5-SNAPSHOT.jar
[JENKINS] Archiving <https://builds.apache.org/job/maven-plugins/ws/maven-site-plugin/dependency-reduced-pom.xml> to /home/hudson/hudson/jobs/maven-plugins/modules/org.apache.maven.plugins$maven-site-plugin/builds/2012-11-17_14-13-41/archive/org.apache.maven.plugins/maven-site-plugin/3.3-SNAPSHOT/maven-site-plugin-3.3-SNAPSHOT.pom
[JENKINS] Archiving <https://builds.apache.org/job/maven-plugins/ws/maven-site-plugin/target/maven-site-plugin-3.3-SNAPSHOT.jar> to /home/hudson/hudson/jobs/maven-plugins/modules/org.apache.maven.plugins$maven-site-plugin/builds/2012-11-17_14-13-41/archive/org.apache.maven.plugins/maven-site-plugin/3.3-SNAPSHOT/maven-site-plugin-3.3-SNAPSHOT.jar
[JENKINS] Archiving <https://builds.apache.org/job/maven-plugins/ws/maven-patch-plugin/pom.xml> to /home/hudson/hudson/jobs/maven-plugins/modules/org.apache.maven.plugins$maven-patch-plugin/builds/2012-11-17_14-13-31/archive/org.apache.maven.plugins/maven-patch-plugin/1.1.2-SNAPSHOT/maven-patch-plugin-1.1.2-SNAPSHOT.pom
[JENKINS] Archiving <https://builds.apache.org/job/maven-plugins/ws/maven-patch-plugin/target/maven-patch-plugin-1.1.2-SNAPSHOT.jar> to /home/hudson/hudson/jobs/maven-plugins/modules/org.apache.maven.plugins$maven-patch-plugin/builds/2012-11-17_14-13-31/archive/org.apache.maven.plugins/maven-patch-plugin/1.1.2-SNAPSHOT/maven-patch-plugin-1.1.2-SNAPSHOT.jar
[JENKINS] Archiving <https://builds.apache.org/job/maven-plugins/ws/maven-install-plugin/pom.xml> to /home/hudson/hudson/jobs/maven-plugins/modules/org.apache.maven.plugins$maven-install-plugin/builds/2012-11-17_14-13-28/archive/org.apache.maven.plugins/maven-install-plugin/2.5-SNAPSHOT/maven-install-plugin-2.5-SNAPSHOT.pom
[JENKINS] Archiving <https://builds.apache.org/job/maven-plugins/ws/maven-install-plugin/target/maven-install-plugin-2.5-SNAPSHOT.jar> to /home/hudson/hudson/jobs/maven-plugins/modules/org.apache.maven.plugins$maven-install-plugin/builds/2012-11-17_14-13-28/archive/org.apache.maven.plugins/maven-install-plugin/2.5-SNAPSHOT/maven-install-plugin-2.5-SNAPSHOT.jar
[JENKINS] Archiving <https://builds.apache.org/job/maven-plugins/ws/maven-antrun-plugin/pom.xml> to /home/hudson/hudson/jobs/maven-plugins/modules/org.apache.maven.plugins$maven-antrun-plugin/builds/2012-11-17_14-13-16/archive/org.apache.maven.plugins/maven-antrun-plugin/1.8-SNAPSHOT/maven-antrun-plugin-1.8-SNAPSHOT.pom
[JENKINS] Archiving <https://builds.apache.org/job/maven-plugins/ws/maven-antrun-plugin/target/maven-antrun-plugin-1.8-SNAPSHOT.jar> to /home/hudson/hudson/jobs/maven-plugins/modules/org.apache.maven.plugins$maven-antrun-plugin/builds/2012-11-17_14-13-16/archive/org.apache.maven.plugins/maven-antrun-plugin/1.8-SNAPSHOT/maven-antrun-plugin-1.8-SNAPSHOT.jar
[JENKINS] Archiving <https://builds.apache.org/job/maven-plugins/ws/maven-changes-plugin/pom.xml> to /home/hudson/hudson/jobs/maven-plugins/modules/org.apache.maven.plugins$maven-changes-plugin/builds/2012-11-17_14-13-16/archive/org.apache.maven.plugins/maven-changes-plugin/2.9-SNAPSHOT/maven-changes-plugin-2.9-SNAPSHOT.pom
[JENKINS] Archiving <https://builds.apache.org/job/maven-plugins/ws/maven-changes-plugin/target/maven-changes-plugin-2.9-SNAPSHOT.jar> to /home/hudson/hudson/jobs/maven-plugins/modules/org.apache.maven.plugins$maven-changes-plugin/builds/2012-11-17_14-13-16/archive/org.apache.maven.plugins/maven-changes-plugin/2.9-SNAPSHOT/maven-changes-plugin-2.9-SNAPSHOT.jar
[JENKINS] Archiving <https://builds.apache.org/job/maven-plugins/ws/maven-rar-plugin/pom.xml> to /home/hudson/hudson/jobs/maven-plugins/modules/org.apache.maven.plugins$maven-rar-plugin/builds/2012-11-17_14-13-35/archive/org.apache.maven.plugins/maven-rar-plugin/2.3-SNAPSHOT/maven-rar-plugin-2.3-SNAPSHOT.pom
[JENKINS] Archiving <https://builds.apache.org/job/maven-plugins/ws/maven-rar-plugin/target/maven-rar-plugin-2.3-SNAPSHOT.jar> to /home/hudson/hudson/jobs/maven-plugins/modules/org.apache.maven.plugins$maven-rar-plugin/builds/2012-11-17_14-13-35/archive/org.apache.maven.plugins/maven-rar-plugin/2.3-SNAPSHOT/maven-rar-plugin-2.3-SNAPSHOT.jar
[JENKINS] Archiving <https://builds.apache.org/job/maven-plugins/ws/maven-jarsigner-plugin/pom.xml> to /home/hudson/hudson/jobs/maven-plugins/modules/org.apache.maven.plugins$maven-jarsigner-plugin/builds/2012-11-17_14-13-28/archive/org.apache.maven.plugins/maven-jarsigner-plugin/1.3-SNAPSHOT/maven-jarsigner-plugin-1.3-SNAPSHOT.pom
[JENKINS] Archiving <https://builds.apache.org/job/maven-plugins/ws/maven-jarsigner-plugin/target/maven-jarsigner-plugin-1.3-SNAPSHOT.jar> to /home/hudson/hudson/jobs/maven-plugins/modules/org.apache.maven.plugins$maven-jarsigner-plugin/builds/2012-11-17_14-13-28/archive/org.apache.maven.plugins/maven-jarsigner-plugin/1.3-SNAPSHOT/maven-jarsigner-plugin-1.3-SNAPSHOT.jar
[JENKINS] Archiving <https://builds.apache.org/job/maven-plugins/ws/maven-ear-plugin/pom.xml> to /home/hudson/hudson/jobs/maven-plugins/modules/org.apache.maven.plugins$maven-ear-plugin/builds/2012-11-17_14-13-20/archive/org.apache.maven.plugins/maven-ear-plugin/2.9-SNAPSHOT/maven-ear-plugin-2.9-SNAPSHOT.pom
[JENKINS] Archiving <https://builds.apache.org/job/maven-plugins/ws/maven-ear-plugin/target/maven-ear-plugin-2.9-SNAPSHOT.jar> to /home/hudson/hudson/jobs/maven-plugins/modules/org.apache.maven.plugins$maven-ear-plugin/builds/2012-11-17_14-13-20/archive/org.apache.maven.plugins/maven-ear-plugin/2.9-SNAPSHOT/maven-ear-plugin-2.9-SNAPSHOT.jar
[JENKINS] Archiving <https://builds.apache.org/job/maven-plugins/ws/maven-changelog-plugin/pom.xml> to /home/hudson/hudson/jobs/maven-plugins/modules/org.apache.maven.plugins$maven-changelog-plugin/builds/2012-11-17_14-13-16/archive/org.apache.maven.plugins/maven-changelog-plugin/2.3-SNAPSHOT/maven-changelog-plugin-2.3-SNAPSHOT.pom
[JENKINS] Archiving <https://builds.apache.org/job/maven-plugins/ws/maven-changelog-plugin/target/maven-changelog-plugin-2.3-SNAPSHOT.jar> to /home/hudson/hudson/jobs/maven-plugins/modules/org.apache.maven.plugins$maven-changelog-plugin/builds/2012-11-17_14-13-16/archive/org.apache.maven.plugins/maven-changelog-plugin/2.3-SNAPSHOT/maven-changelog-plugin-2.3-SNAPSHOT.jar
[JENKINS] Archiving <https://builds.apache.org/job/maven-plugins/ws/maven-verifier-plugin/pom.xml> to /home/hudson/hudson/jobs/maven-plugins/modules/org.apache.maven.plugins$maven-verifier-plugin/builds/2012-11-17_14-13-42/archive/org.apache.maven.plugins/maven-verifier-plugin/1.1-SNAPSHOT/maven-verifier-plugin-1.1-SNAPSHOT.pom
[JENKINS] Archiving <https://builds.apache.org/job/maven-plugins/ws/maven-verifier-plugin/target/maven-verifier-plugin-1.1-SNAPSHOT.jar> to /home/hudson/hudson/jobs/maven-plugins/modules/org.apache.maven.plugins$maven-verifier-plugin/builds/2012-11-17_14-13-42/archive/org.apache.maven.plugins/maven-verifier-plugin/1.1-SNAPSHOT/maven-verifier-plugin-1.1-SNAPSHOT.jar
[JENKINS] Archiving <https://builds.apache.org/job/maven-plugins/ws/maven-ant-plugin/pom.xml> to /home/hudson/hudson/jobs/maven-plugins/modules/org.apache.maven.plugins$maven-ant-plugin/builds/2012-11-17_14-13-15/archive/org.apache.maven.plugins/maven-ant-plugin/2.4-SNAPSHOT/maven-ant-plugin-2.4-SNAPSHOT.pom
[JENKINS] Archiving <https://builds.apache.org/job/maven-plugins/ws/maven-ant-plugin/target/maven-ant-plugin-2.4-SNAPSHOT.jar> to /home/hudson/hudson/jobs/maven-plugins/modules/org.apache.maven.plugins$maven-ant-plugin/builds/2012-11-17_14-13-15/archive/org.apache.maven.plugins/maven-ant-plugin/2.4-SNAPSHOT/maven-ant-plugin-2.4-SNAPSHOT.jar
[JENKINS] Archiving <https://builds.apache.org/job/maven-plugins/ws/maven-ejb-plugin/pom.xml> to /home/hudson/hudson/jobs/maven-plugins/modules/org.apache.maven.plugins$maven-ejb-plugin/builds/2012-11-17_14-13-21/archive/org.apache.maven.plugins/maven-ejb-plugin/2.4-SNAPSHOT/maven-ejb-plugin-2.4-SNAPSHOT.pom
[JENKINS] Archiving <https://builds.apache.org/job/maven-plugins/ws/maven-ejb-plugin/target/maven-ejb-plugin-2.4-SNAPSHOT.jar> to /home/hudson/hudson/jobs/maven-plugins/modules/org.apache.maven.plugins$maven-ejb-plugin/builds/2012-11-17_14-13-21/archive/org.apache.maven.plugins/maven-ejb-plugin/2.4-SNAPSHOT/maven-ejb-plugin-2.4-SNAPSHOT.jar
[JENKINS] Archiving <https://builds.apache.org/job/maven-plugins/ws/maven-stage-plugin/pom.xml> to /home/hudson/hudson/jobs/maven-plugins/modules/org.apache.maven.plugins$maven-stage-plugin/builds/2012-11-17_14-13-42/archive/org.apache.maven.plugins/maven-stage-plugin/1.0-SNAPSHOT/maven-stage-plugin-1.0-SNAPSHOT.pom
[JENKINS] Archiving <https://builds.apache.org/job/maven-plugins/ws/maven-stage-plugin/target/maven-stage-plugin-1.0-SNAPSHOT.jar> to /home/hudson/hudson/jobs/maven-plugins/modules/org.apache.maven.plugins$maven-stage-plugin/builds/2012-11-17_14-13-42/archive/org.apache.maven.plugins/maven-stage-plugin/1.0-SNAPSHOT/maven-stage-plugin-1.0-SNAPSHOT.jar
[JENKINS] Archiving <https://builds.apache.org/job/maven-plugins/ws/maven-scm-publish-plugin/pom.xml> to /home/hudson/hudson/jobs/maven-plugins/modules/org.apache.maven.plugins$maven-scm-publish-plugin/builds/2012-11-17_14-13-43/archive/org.apache.maven.plugins/maven-scm-publish-plugin/1.0-SNAPSHOT/maven-scm-publish-plugin-1.0-SNAPSHOT.pom
[JENKINS] Archiving <https://builds.apache.org/job/maven-plugins/ws/maven-scm-publish-plugin/target/maven-scm-publish-plugin-1.0-SNAPSHOT.jar> to /home/hudson/hudson/jobs/maven-plugins/modules/org.apache.maven.plugins$maven-scm-publish-plugin/builds/2012-11-17_14-13-43/archive/org.apache.maven.plugins/maven-scm-publish-plugin/1.0-SNAPSHOT/maven-scm-publish-plugin-1.0-SNAPSHOT.jar
[JENKINS] Archiving <https://builds.apache.org/job/maven-plugins/ws/maven-compiler-plugin/pom.xml> to /home/hudson/hudson/jobs/maven-plugins/modules/org.apache.maven.plugins$maven-compiler-plugin/builds/2012-11-17_14-13-16/archive/org.apache.maven.plugins/maven-compiler-plugin/3.1-SNAPSHOT/maven-compiler-plugin-3.1-SNAPSHOT.pom
[JENKINS] Archiving <https://builds.apache.org/job/maven-plugins/ws/maven-reactor-plugin/pom.xml> to /home/hudson/hudson/jobs/maven-plugins/modules/org.apache.maven.plugins$maven-reactor-plugin/builds/2012-11-17_14-13-35/archive/org.apache.maven.plugins/maven-reactor-plugin/1.1-SNAPSHOT/maven-reactor-plugin-1.1-SNAPSHOT.pom
[JENKINS] Archiving <https://builds.apache.org/job/maven-plugins/ws/maven-reactor-plugin/target/maven-reactor-plugin-1.1-SNAPSHOT.jar> to /home/hudson/hudson/jobs/maven-plugins/modules/org.apache.maven.plugins$maven-reactor-plugin/builds/2012-11-17_14-13-35/archive/org.apache.maven.plugins/maven-reactor-plugin/1.1-SNAPSHOT/maven-reactor-plugin-1.1-SNAPSHOT.jar
[JENKINS] Archiving <https://builds.apache.org/job/maven-plugins/ws/maven-doap-plugin/pom.xml> to /home/hudson/hudson/jobs/maven-plugins/modules/org.apache.maven.plugins$maven-doap-plugin/builds/2012-11-17_14-13-17/archive/org.apache.maven.plugins/maven-doap-plugin/1.2-SNAPSHOT/maven-doap-plugin-1.2-SNAPSHOT.pom
[JENKINS] Archiving <https://builds.apache.org/job/maven-plugins/ws/maven-doap-plugin/target/maven-doap-plugin-1.2-SNAPSHOT.jar> to /home/hudson/hudson/jobs/maven-plugins/modules/org.apache.maven.plugins$maven-doap-plugin/builds/2012-11-17_14-13-17/archive/org.apache.maven.plugins/maven-doap-plugin/1.2-SNAPSHOT/maven-doap-plugin-1.2-SNAPSHOT.jar
[JENKINS] Archiving <https://builds.apache.org/job/maven-plugins/ws/maven-checkstyle-plugin/pom.xml> to /home/hudson/hudson/jobs/maven-plugins/modules/org.apache.maven.plugins$maven-checkstyle-plugin/builds/2012-11-17_14-13-16/archive/org.apache.maven.plugins/maven-checkstyle-plugin/2.10-SNAPSHOT/maven-checkstyle-plugin-2.10-SNAPSHOT.pom
[JENKINS] Archiving <https://builds.apache.org/job/maven-plugins/ws/maven-checkstyle-plugin/target/maven-checkstyle-plugin-2.10-SNAPSHOT.jar> to /home/hudson/hudson/jobs/maven-plugins/modules/org.apache.maven.plugins$maven-checkstyle-plugin/builds/2012-11-17_14-13-16/archive/org.apache.maven.plugins/maven-checkstyle-plugin/2.10-SNAPSHOT/maven-checkstyle-plugin-2.10-SNAPSHOT.jar
[JENKINS] Archiving <https://builds.apache.org/job/maven-plugins/ws/maven-source-plugin/pom.xml> to /home/hudson/hudson/jobs/maven-plugins/modules/org.apache.maven.plugins$maven-source-plugin/builds/2012-11-17_14-13-42/archive/org.apache.maven.plugins/maven-source-plugin/2.3-SNAPSHOT/maven-source-plugin-2.3-SNAPSHOT.pom
[JENKINS] Archiving <https://builds.apache.org/job/maven-plugins/ws/maven-source-plugin/target/maven-source-plugin-2.3-SNAPSHOT.jar> to /home/hudson/hudson/jobs/maven-plugins/modules/org.apache.maven.plugins$maven-source-plugin/builds/2012-11-17_14-13-42/archive/org.apache.maven.plugins/maven-source-plugin/2.3-SNAPSHOT/maven-source-plugin-2.3-SNAPSHOT.jar
[JENKINS] Archiving <https://builds.apache.org/job/maven-plugins/ws/maven-dependency-plugin/pom.xml> to /home/hudson/hudson/jobs/maven-plugins/modules/org.apache.maven.plugins$maven-dependency-plugin/builds/2012-11-17_14-13-17/archive/org.apache.maven.plugins/maven-dependency-plugin/2.7-SNAPSHOT/maven-dependency-plugin-2.7-SNAPSHOT.pom
[JENKINS] Archiving <https://builds.apache.org/job/maven-plugins/ws/maven-dependency-plugin/target/maven-dependency-plugin-2.7-SNAPSHOT.jar> to /home/hudson/hudson/jobs/maven-plugins/modules/org.apache.maven.plugins$maven-dependency-plugin/builds/2012-11-17_14-13-17/archive/org.apache.maven.plugins/maven-dependency-plugin/2.7-SNAPSHOT/maven-dependency-plugin-2.7-SNAPSHOT.jar
[JENKINS] Archiving <https://builds.apache.org/job/maven-plugins/ws/maven-javadoc-plugin/pom.xml> to /home/hudson/hudson/jobs/maven-plugins/modules/org.apache.maven.plugins$maven-javadoc-plugin/builds/2012-11-17_14-13-30/archive/org.apache.maven.plugins/maven-javadoc-plugin/2.10-SNAPSHOT/maven-javadoc-plugin-2.10-SNAPSHOT.pom
[JENKINS] Archiving <https://builds.apache.org/job/maven-plugins/ws/maven-javadoc-plugin/target/maven-javadoc-plugin-2.10-SNAPSHOT.jar> to /home/hudson/hudson/jobs/maven-plugins/modules/org.apache.maven.plugins$maven-javadoc-plugin/builds/2012-11-17_14-13-30/archive/org.apache.maven.plugins/maven-javadoc-plugin/2.10-SNAPSHOT/maven-javadoc-plugin-2.10-SNAPSHOT.jar
[JENKINS] Archiving <https://builds.apache.org/job/maven-plugins/ws/maven-deploy-plugin/pom.xml> to /home/hudson/hudson/jobs/maven-plugins/modules/org.apache.maven.plugins$maven-deploy-plugin/builds/2012-11-17_14-13-17/archive/org.apache.maven.plugins/maven-deploy-plugin/2.8-SNAPSHOT/maven-deploy-plugin-2.8-SNAPSHOT.pom
[JENKINS] Archiving <https://builds.apache.org/job/maven-plugins/ws/maven-deploy-plugin/target/maven-deploy-plugin-2.8-SNAPSHOT.jar> to /home/hudson/hudson/jobs/maven-plugins/modules/org.apache.maven.plugins$maven-deploy-plugin/builds/2012-11-17_14-13-17/archive/org.apache.maven.plugins/maven-deploy-plugin/2.8-SNAPSHOT/maven-deploy-plugin-2.8-SNAPSHOT.jar
[JENKINS] Archiving <https://builds.apache.org/job/maven-plugins/ws/maven-acr-plugin/pom.xml> to /home/hudson/hudson/jobs/maven-plugins/modules/org.apache.maven.plugins$maven-acr-plugin/builds/2012-11-17_14-13-15/archive/org.apache.maven.plugins/maven-acr-plugin/1.0.1-SNAPSHOT/maven-acr-plugin-1.0.1-SNAPSHOT.pom
[JENKINS] Archiving <https://builds.apache.org/job/maven-plugins/ws/maven-acr-plugin/target/maven-acr-plugin-1.0.1-SNAPSHOT.jar> to /home/hudson/hudson/jobs/maven-plugins/modules/org.apache.maven.plugins$maven-acr-plugin/builds/2012-11-17_14-13-15/archive/org.apache.maven.plugins/maven-acr-plugin/1.0.1-SNAPSHOT/maven-acr-plugin-1.0.1-SNAPSHOT.jar
[JENKINS] Archiving <https://builds.apache.org/job/maven-plugins/ws/maven-repository-plugin/pom.xml> to /home/hudson/hudson/jobs/maven-plugins/modules/org.apache.maven.plugins$maven-repository-plugin/builds/2012-11-17_14-13-36/archive/org.apache.maven.plugins/maven-repository-plugin/2.3.2-SNAPSHOT/maven-repository-plugin-2.3.2-SNAPSHOT.pom
[JENKINS] Archiving <https://builds.apache.org/job/maven-plugins/ws/maven-repository-plugin/target/maven-repository-plugin-2.3.2-SNAPSHOT.jar> to /home/hudson/hudson/jobs/maven-plugins/modules/org.apache.maven.plugins$maven-repository-plugin/builds/2012-11-17_14-13-36/archive/org.apache.maven.plugins/maven-repository-plugin/2.3.2-SNAPSHOT/maven-repository-plugin-2.3.2-SNAPSHOT.jar
[JENKINS] Archiving <https://builds.apache.org/job/maven-plugins/ws/maven-assembly-plugin/pom.xml> to /home/hudson/hudson/jobs/maven-plugins/modules/org.apache.maven.plugins$maven-assembly-plugin/builds/2012-11-17_14-13-16/archive/org.apache.maven.plugins/maven-assembly-plugin/2.5-SNAPSHOT/maven-assembly-plugin-2.5-SNAPSHOT.pom
[JENKINS] Archiving <https://builds.apache.org/job/maven-plugins/ws/maven-assembly-plugin/target/maven-assembly-plugin-2.5-SNAPSHOT.jar> to /home/hudson/hudson/jobs/maven-plugins/modules/org.apache.maven.plugins$maven-assembly-plugin/builds/2012-11-17_14-13-16/archive/org.apache.maven.plugins/maven-assembly-plugin/2.5-SNAPSHOT/maven-assembly-plugin-2.5-SNAPSHOT.jar
[JENKINS] Archiving <https://builds.apache.org/job/maven-plugins/ws/maven-project-info-reports-plugin/pom.xml> to /home/hudson/hudson/jobs/maven-plugins/modules/org.apache.maven.plugins$maven-project-info-reports-plugin/builds/2012-11-17_14-13-45/archive/org.apache.maven.plugins/maven-project-info-reports-plugin/2.7-SNAPSHOT/maven-project-info-reports-plugin-2.7-SNAPSHOT.pom
[JENKINS] Archiving <https://builds.apache.org/job/maven-plugins/ws/maven-project-info-reports-plugin/target/maven-project-info-reports-plugin-2.7-SNAPSHOT.jar> to /home/hudson/hudson/jobs/maven-plugins/modules/org.apache.maven.plugins$maven-project-info-reports-plugin/builds/2012-11-17_14-13-45/archive/org.apache.maven.plugins/maven-project-info-reports-plugin/2.7-SNAPSHOT/maven-project-info-reports-plugin-2.7-SNAPSHOT.jar
[JENKINS] Archiving <https://builds.apache.org/job/maven-plugins/ws/maven-one-plugin/pom.xml> to /home/hudson/hudson/jobs/maven-plugins/modules/org.apache.maven.plugins$maven-one-plugin/builds/2012-11-17_14-13-31/archive/org.apache.maven.plugins/maven-one-plugin/1.3-SNAPSHOT/maven-one-plugin-1.3-SNAPSHOT.pom
[JENKINS] Archiving <https://builds.apache.org/job/maven-plugins/ws/maven-one-plugin/target/maven-one-plugin-1.3-SNAPSHOT.jar> to /home/hudson/hudson/jobs/maven-plugins/modules/org.apache.maven.plugins$maven-one-plugin/builds/2012-11-17_14-13-31/archive/org.apache.maven.plugins/maven-one-plugin/1.3-SNAPSHOT/maven-one-plugin-1.3-SNAPSHOT.jar
[JENKINS] Archiving <https://builds.apache.org/job/maven-plugins/ws/maven-help-plugin/pom.xml> to /home/hudson/hudson/jobs/maven-plugins/modules/org.apache.maven.plugins$maven-help-plugin/builds/2012-11-17_14-13-25/archive/org.apache.maven.plugins/maven-help-plugin/2.2-SNAPSHOT/maven-help-plugin-2.2-SNAPSHOT.pom
[JENKINS] Archiving <https://builds.apache.org/job/maven-plugins/ws/maven-help-plugin/target/maven-help-plugin-2.2-SNAPSHOT.jar> to /home/hudson/hudson/jobs/maven-plugins/modules/org.apache.maven.plugins$maven-help-plugin/builds/2012-11-17_14-13-25/archive/org.apache.maven.plugins/maven-help-plugin/2.2-SNAPSHOT/maven-help-plugin-2.2-SNAPSHOT.jar
[JENKINS] Archiving <https://builds.apache.org/job/maven-plugins/ws/maven-invoker-plugin/pom.xml> to /home/hudson/hudson/jobs/maven-plugins/modules/org.apache.maven.plugins$maven-invoker-plugin/builds/2012-11-17_14-13-45/archive/org.apache.maven.plugins/maven-invoker-plugin/1.8-SNAPSHOT/maven-invoker-plugin-1.8-SNAPSHOT.pom
[JENKINS] Archiving <https://builds.apache.org/job/maven-plugins/ws/maven-invoker-plugin/target/maven-invoker-plugin-1.8-SNAPSHOT.jar> to /home/hudson/hudson/jobs/maven-plugins/modules/org.apache.maven.plugins$maven-invoker-plugin/builds/2012-11-17_14-13-45/archive/org.apache.maven.plugins/maven-invoker-plugin/1.8-SNAPSHOT/maven-invoker-plugin-1.8-SNAPSHOT.jar
[JENKINS] Archiving <https://builds.apache.org/job/maven-plugins/ws/maven-remote-resources-plugin/pom.xml> to /home/hudson/hudson/jobs/maven-plugins/modules/org.apache.maven.plugins$maven-remote-resources-plugin/builds/2012-11-17_14-13-45/archive/org.apache.maven.plugins/maven-remote-resources-plugin/1.5-SNAPSHOT/maven-remote-resources-plugin-1.5-SNAPSHOT.pom
[JENKINS] Archiving <https://builds.apache.org/job/maven-plugins/ws/maven-remote-resources-plugin/target/maven-remote-resources-plugin-1.5-SNAPSHOT.jar> to /home/hudson/hudson/jobs/maven-plugins/modules/org.apache.maven.plugins$maven-remote-resources-plugin/builds/2012-11-17_14-13-45/archive/org.apache.maven.plugins/maven-remote-resources-plugin/1.5-SNAPSHOT/maven-remote-resources-plugin-1.5-SNAPSHOT.jar
[JENKINS] Archiving <https://builds.apache.org/job/maven-plugins/ws/maven-pdf-plugin/pom.xml> to /home/hudson/hudson/jobs/maven-plugins/modules/org.apache.maven.plugins$maven-pdf-plugin/builds/2012-11-17_14-13-33/archive/org.apache.maven.plugins/maven-pdf-plugin/1.3-SNAPSHOT/maven-pdf-plugin-1.3-SNAPSHOT.pom
[JENKINS] Archiving <https://builds.apache.org/job/maven-plugins/ws/maven-pdf-plugin/target/maven-pdf-plugin-1.3-SNAPSHOT.jar> to /home/hudson/hudson/jobs/maven-plugins/modules/org.apache.maven.plugins$maven-pdf-plugin/builds/2012-11-17_14-13-33/archive/org.apache.maven.plugins/maven-pdf-plugin/1.3-SNAPSHOT/maven-pdf-plugin-1.3-SNAPSHOT.jar
[JENKINS] Archiving <https://builds.apache.org/job/maven-plugins/ws/maven-shade-plugin/pom.xml> to /home/hudson/hudson/jobs/maven-plugins/modules/org.apache.maven.plugins$maven-shade-plugin/builds/2012-11-17_14-13-45/archive/org.apache.maven.plugins/maven-shade-plugin/2.0.1-SNAPSHOT/maven-shade-plugin-2.0.1-SNAPSHOT.pom
[JENKINS] Archiving <https://builds.apache.org/job/maven-plugins/ws/maven-shade-plugin/target/maven-shade-plugin-2.0.1-SNAPSHOT.jar> to /home/hudson/hudson/jobs/maven-plugins/modules/org.apache.maven.plugins$maven-shade-plugin/builds/2012-11-17_14-13-45/archive/org.apache.maven.plugins/maven-shade-plugin/2.0.1-SNAPSHOT/maven-shade-plugin-2.0.1-SNAPSHOT.jar
[JENKINS] Archiving <https://builds.apache.org/job/maven-plugins/ws/maven-plugins/pom.xml> to /home/hudson/hudson/jobs/maven-plugins/modules/org.apache.maven.plugins$maven-plugins/builds/2012-11-17_14-13-15/archive/org.apache.maven.plugins/maven-plugins/24-SNAPSHOT/maven-plugins-24-SNAPSHOT.pom
[JENKINS] Archiving <https://builds.apache.org/job/maven-plugins/ws/maven-plugins/target/maven-plugins-24-SNAPSHOT-site.xml> to /home/hudson/hudson/jobs/maven-plugins/modules/org.apache.maven.plugins$maven-plugins/builds/2012-11-17_14-13-15/archive/org.apache.maven.plugins/maven-plugins/24-SNAPSHOT/maven-plugins-24-SNAPSHOT-site.xml
[JENKINS] Archiving <https://builds.apache.org/job/maven-plugins/ws/maven-linkcheck-plugin/pom.xml> to /home/hudson/hudson/jobs/maven-plugins/modules/org.apache.maven.plugins$maven-linkcheck-plugin/builds/2012-11-17_14-13-30/archive/org.apache.maven.plugins/maven-linkcheck-plugin/1.2-SNAPSHOT/maven-linkcheck-plugin-1.2-SNAPSHOT.pom
[JENKINS] Archiving <https://builds.apache.org/job/maven-plugins/ws/maven-linkcheck-plugin/target/maven-linkcheck-plugin-1.2-SNAPSHOT.jar> to /home/hudson/hudson/jobs/maven-plugins/modules/org.apache.maven.plugins$maven-linkcheck-plugin/builds/2012-11-17_14-13-30/archive/org.apache.maven.plugins/maven-linkcheck-plugin/1.2-SNAPSHOT/maven-linkcheck-plugin-1.2-SNAPSHOT.jar
[JENKINS] Archiving <https://builds.apache.org/job/maven-plugins/ws/maven-resources-plugin/pom.xml> to /home/hudson/hudson/jobs/maven-plugins/modules/org.apache.maven.plugins$maven-resources-plugin/builds/2012-11-17_14-13-38/archive/org.apache.maven.plugins/maven-resources-plugin/2.7-SNAPSHOT/maven-resources-plugin-2.7-SNAPSHOT.pom
[JENKINS] Archiving <https://builds.apache.org/job/maven-plugins/ws/maven-resources-plugin/target/maven-resources-plugin-2.7-SNAPSHOT.jar> to /home/hudson/hudson/jobs/maven-plugins/modules/org.apache.maven.plugins$maven-resources-plugin/builds/2012-11-17_14-13-38/archive/org.apache.maven.plugins/maven-resources-plugin/2.7-SNAPSHOT/maven-resources-plugin-2.7-SNAPSHOT.jar
Waiting for Jenkins to finish collecting data
mavenExecutionResult exceptions not empty
message : Failed to execute goal on project maven-compiler-plugin: Could not resolve dependencies for project org.apache.maven.plugins:maven-compiler-plugin:maven-plugin:3.1-SNAPSHOT: Could not find artifact org.apache.maven.shared:maven-shared-incremental:jar:1.0 in central (http://repo.maven.apache.org/maven2)
cause : Could not resolve dependencies for project org.apache.maven.plugins:maven-compiler-plugin:maven-plugin:3.1-SNAPSHOT: Could not find artifact org.apache.maven.shared:maven-shared-incremental:jar:1.0 in central (http://repo.maven.apache.org/maven2)
Stack trace :
org.apache.maven.lifecycle.LifecycleExecutionException: Failed to execute goal on project maven-compiler-plugin: Could not resolve dependencies for project org.apache.maven.plugins:maven-compiler-plugin:maven-plugin:3.1-SNAPSHOT: Could not find artifact org.apache.maven.shared:maven-shared-incremental:jar:1.0 in central (http://repo.maven.apache.org/maven2)
at org.apache.maven.lifecycle.internal.LifecycleDependencyResolver.getDependencies(LifecycleDependencyResolver.java:210)
at org.apache.maven.lifecycle.internal.LifecycleDependencyResolver.resolveProjectDependencies(LifecycleDependencyResolver.java:117)
at org.apache.maven.lifecycle.internal.MojoExecutor.ensureDependenciesAreResolved(MojoExecutor.java:258)
at org.apache.maven.lifecycle.internal.MojoExecutor.execute(MojoExecutor.java:201)
at org.apache.maven.lifecycle.internal.MojoExecutor.execute(MojoExecutor.java:153)
at org.apache.maven.lifecycle.internal.MojoExecutor.execute(MojoExecutor.java:145)
at org.apache.maven.lifecycle.internal.LifecycleModuleBuilder.buildProject(LifecycleModuleBuilder.java:84)
at org.apache.maven.lifecycle.internal.LifecycleThreadedBuilder$1.call(LifecycleThreadedBuilder.java:167)
at org.apache.maven.lifecycle.internal.LifecycleThreadedBuilder$1.call(LifecycleThreadedBuilder.java:163)
at java.util.concurrent.FutureTask$Sync.innerRun(FutureTask.java:269)
at java.util.concurrent.FutureTask.run(FutureTask.java:123)
at java.util.concurrent.ThreadPoolExecutor$Worker.runTask(ThreadPoolExecutor.java:651)
at java.util.concurrent.ThreadPoolExecutor$Worker.run(ThreadPoolExecutor.java:676)
at java.lang.Thread.run(Thread.java:595)
Caused by: org.apache.maven.project.DependencyResolutionException: Could not resolve dependencies for project org.apache.maven.plugins:maven-compiler-plugin:maven-plugin:3.1-SNAPSHOT: Could not find artifact org.apache.maven.shared:maven-shared-incremental:jar:1.0 in central (http://repo.maven.apache.org/maven2)
at org.apache.maven.project.DefaultProjectDependenciesResolver.resolve(DefaultProjectDependenciesResolver.java:189)
at org.apache.maven.lifecycle.internal.LifecycleDependencyResolver.getDependencies(LifecycleDependencyResolver.java:185)
... 13 more
Caused by: org.sonatype.aether.resolution.DependencyResolutionException: Could not find artifact org.apache.maven.shared:maven-shared-incremental:jar:1.0 in central (http://repo.maven.apache.org/maven2)
at org.sonatype.aether.impl.internal.DefaultRepositorySystem.resolveDependencies(DefaultRepositorySystem.java:375)
at org.apache.maven.project.DefaultProjectDependenciesResolver.resolve(DefaultProjectDependenciesResolver.java:183)
... 14 more
Caused by: org.sonatype.aether.resolution.ArtifactResolutionException: Could not find artifact org.apache.maven.shared:maven-shared-incremental:jar:1.0 in central (http://repo.maven.apache.org/maven2)
at org.sonatype.aether.impl.internal.DefaultArtifactResolver.resolve(DefaultArtifactResolver.java:538)
at org.sonatype.aether.impl.internal.DefaultArtifactResolver.resolveArtifacts(DefaultArtifactResolver.java:216)
at org.sonatype.aether.impl.internal.DefaultRepositorySystem.resolveDependencies(DefaultRepositorySystem.java:358)
... 15 more
Caused by: org.sonatype.aether.transfer.ArtifactNotFoundException: Could not find artifact org.apache.maven.shared:maven-shared-incremental:jar:1.0 in central (http://repo.maven.apache.org/maven2)
at org.sonatype.aether.connector.wagon.WagonRepositoryConnector$4.wrap(WagonRepositoryConnector.java:947)
at org.sonatype.aether.connector.wagon.WagonRepositoryConnector$4.wrap(WagonRepositoryConnector.java:941)
at org.sonatype.aether.connector.wagon.WagonRepositoryConnector$GetTask.run(WagonRepositoryConnector.java:669)
at org.sonatype.aether.util.concurrency.RunnableErrorForwarder$1.run(RunnableErrorForwarder.java:60)
... 3 more
Sending e-mails to: notifications@maven.apache.org
channel stopped
[WARNINGS] Skipping publisher since build result is FAILURE
Build failed in Jenkins: maven-plugins #1282
Posted by Apache Jenkins Server <je...@builds.apache.org>.
See <https://builds.apache.org/job/maven-plugins/1282/changes>
Changes:
[olamy] add contributor
[olamy] [MANT-65] Invalid check for junit
Submitted by Martin O'Connor
------------------------------------------
[...truncated 7851 lines...]
Tests run: 2, Failures: 0, Errors: 0, Skipped: 0, Time elapsed: 0 sec
Running org.apache.maven.plugins.shade.relocation.SimpleRelocatorTest
Tests run: 7, Failures: 0, Errors: 0, Skipped: 0, Time elapsed: 0.003 sec
Running org.apache.maven.plugins.shade.DefaultShaderTest
2012-11-16 22:58:24.505::INFO: Shutdown hook complete
Tests run: 4, Failures: 0, Errors: 0, Skipped: 0, Time elapsed: 0.874 sec
Results :
Tests run: 27, Failures: 0, Errors: 0, Skipped: 0
mojoSucceeded org.apache.maven.plugins:maven-surefire-plugin:2.12(default-test)
[JENKINS] Recording test results
mojoStarted org.apache.maven.plugins:maven-jar-plugin:2.4(default-jar)
[INFO]
[INFO] --- maven-jar-plugin:2.4:jar (default-jar) @ maven-shade-plugin ---
[INFO] Building jar: <https://builds.apache.org/job/maven-plugins/ws/maven-shade-plugin/target/maven-shade-plugin-2.0.1-SNAPSHOT.jar>
mojoSucceeded org.apache.maven.plugins:maven-jar-plugin:2.4(default-jar)
Results :
Tests run: 17, Failures: 0, Errors: 0, Skipped: 0
mojoSucceeded org.apache.maven.plugins:maven-surefire-plugin:2.12(default-test)
mojoStarted org.apache.maven.plugins:maven-plugin-plugin:3.2(default-addPluginArtifactMetadata)
[INFO]
[INFO] --- maven-plugin-plugin:3.2:addPluginArtifactMetadata (default-addPluginArtifactMetadata) @ maven-shade-plugin ---
mojoSucceeded org.apache.maven.plugins:maven-plugin-plugin:3.2(default-addPluginArtifactMetadata)
[JENKINS] Recording test results
[INFO] Installing <https://builds.apache.org/job/maven-plugins/ws/maven-shade-plugin/target/maven-shade-plugin-2.0.1-SNAPSHOT.jar> to /home/jenkins/jenkins-slave/maven-repositories/0/org/apache/maven/plugins/maven-shade-plugin/2.0.1-SNAPSHOT/maven-shade-plugin-2.0.1-SNAPSHOT.jar
mojoStarted org.apache.maven.plugins:maven-install-plugin:2.3.1(default-install)
[INFO]
[INFO] --- maven-install-plugin:2.3.1:install (default-install) @ maven-shade-plugin ---
[INFO] Installing <https://builds.apache.org/job/maven-plugins/ws/maven-shade-plugin/pom.xml> to /home/jenkins/jenkins-slave/maven-repositories/0/org/apache/maven/plugins/maven-shade-plugin/2.0.1-SNAPSHOT/maven-shade-plugin-2.0.1-SNAPSHOT.pom
mojoSucceeded org.apache.maven.plugins:maven-install-plugin:2.3.1(default-install)
mojoStarted org.apache.maven.plugins:maven-jar-plugin:2.4(default-jar)
projectSucceeded org.apache.maven.plugins:maven-shade-plugin:2.0.1-SNAPSHOT
[INFO]
[INFO] --- maven-jar-plugin:2.4:jar (default-jar) @ maven-project-info-reports-plugin ---
[INFO] Building jar: <https://builds.apache.org/job/maven-plugins/ws/maven-project-info-reports-plugin/target/maven-project-info-reports-plugin-2.7-SNAPSHOT.jar>
mojoSucceeded org.apache.maven.plugins:maven-jar-plugin:2.4(default-jar)
mojoStarted org.apache.maven.plugins:maven-plugin-plugin:3.2(default-addPluginArtifactMetadata)
[INFO]
[INFO] --- maven-plugin-plugin:3.2:addPluginArtifactMetadata (default-addPluginArtifactMetadata) @ maven-project-info-reports-plugin ---
mojoSucceeded org.apache.maven.plugins:maven-plugin-plugin:3.2(default-addPluginArtifactMetadata)
mojoStarted org.apache.maven.plugins:maven-jarsigner-plugin:1.2(sign)
[INFO]
[INFO] --- maven-jarsigner-plugin:1.2:sign (sign) @ maven-project-info-reports-plugin ---
[INFO] 1 archive(s) processed
mojoSucceeded org.apache.maven.plugins:maven-jarsigner-plugin:1.2(sign)
mojoStarted org.apache.maven.plugins:maven-jarsigner-plugin:1.2(verify)
[INFO]
[INFO] --- maven-jarsigner-plugin:1.2:verify (verify) @ maven-project-info-reports-plugin ---
[INFO] 1 archive(s) processed
mojoSucceeded org.apache.maven.plugins:maven-jarsigner-plugin:1.2(verify)
[INFO] Installing <https://builds.apache.org/job/maven-plugins/ws/maven-project-info-reports-plugin/target/maven-project-info-reports-plugin-2.7-SNAPSHOT.jar> to /home/jenkins/jenkins-slave/maven-repositories/0/org/apache/maven/plugins/maven-project-info-reports-plugin/2.7-SNAPSHOT/maven-project-info-reports-plugin-2.7-SNAPSHOT.jar
mojoStarted org.apache.maven.plugins:maven-install-plugin:2.3.1(default-install)
[INFO]
[INFO] --- maven-install-plugin:2.3.1:install (default-install) @ maven-project-info-reports-plugin ---
[INFO] Installing <https://builds.apache.org/job/maven-plugins/ws/maven-project-info-reports-plugin/pom.xml> to /home/jenkins/jenkins-slave/maven-repositories/0/org/apache/maven/plugins/maven-project-info-reports-plugin/2.7-SNAPSHOT/maven-project-info-reports-plugin-2.7-SNAPSHOT.pom
mojoSucceeded org.apache.maven.plugins:maven-install-plugin:2.3.1(default-install)
projectSucceeded org.apache.maven.plugins:maven-project-info-reports-plugin:2.7-SNAPSHOT
sessionEnded
[INFO] ------------------------------------------------------------------------
[INFO] Reactor Summary:
[INFO]
[INFO] Maven Plugins ..................................... SUCCESS [34.031s]
[INFO] Maven ACR Plugin .................................. SUCCESS [40.652s]
[INFO] Maven Ant Plugin .................................. SUCCESS [48.981s]
[INFO] Maven AntRun Plugin ............................... SUCCESS [6.247s]
[INFO] Maven Eclipse Plugin .............................. SUCCESS [31.674s]
[INFO] Maven Assembly Plugin ............................. SUCCESS [27.708s]
[INFO] Maven Changelog Plugin ............................ SUCCESS [15.265s]
[INFO] Maven Changes Report Plugin ....................... SUCCESS [18.225s]
[INFO] Maven Checkstyle Plugin ........................... SUCCESS [21.409s]
[INFO] Maven Clean Plugin ................................ SUCCESS [4.816s]
[INFO] Maven Compiler Plugin ............................. FAILURE [2.350s]
[INFO] Maven Dependency Plugin ........................... SUCCESS [1:21.961s]
[INFO] Maven Deploy Plugin ............................... SUCCESS [14.004s]
[INFO] Maven DOAP Plugin ................................. SUCCESS [14.206s]
[INFO] Maven Documentation Checker Plugin ................ SUCCESS [4.056s]
[INFO] Maven EAR Plugin .................................. SUCCESS [8.396s]
[INFO] Maven EJB Plugin .................................. SUCCESS [9.895s]
[INFO] Maven GPG Plugin .................................. SUCCESS [4.144s]
[INFO] Maven Help Plugin ................................. SUCCESS [7.321s]
[INFO] Maven IDEA Plugin ................................. SUCCESS [13.935s]
[INFO] Maven Install Plugin .............................. SUCCESS [6.644s]
[INFO] Maven JAR Plugin .................................. SUCCESS [5.086s]
[INFO] Maven Jarsigner Plugin ............................ SUCCESS [3.449s]
[INFO] Maven Javadoc Plugin .............................. SUCCESS [1:49.049s]
[INFO] Maven Linkcheck Plugin ............................ SUCCESS [5.470s]
[INFO] Maven One Plugin .................................. SUCCESS [4.714s]
[INFO] Maven Patch Plugin ................................ SUCCESS [3.173s]
[INFO] Maven PDF Plugin .................................. SUCCESS [27.303s]
[INFO] Maven PMD Plugin .................................. SUCCESS [22.082s]
[INFO] Maven RAR Plugin .................................. SUCCESS [6.625s]
[INFO] Maven Reactor Plugin .............................. SUCCESS [5.823s]
[INFO] Maven Repository Plugin ........................... SUCCESS [7.013s]
[INFO] Maven Resources Plugin ............................ SUCCESS [9.149s]
[INFO] Maven Site Plugin 3 ............................... SUCCESS [15.780s]
[INFO] Maven Source Plugin ............................... SUCCESS [6.715s]
[INFO] Maven Stage Plugin ................................ SUCCESS [5.637s]
[INFO] Maven Toolchains Plugin ........................... SUCCESS [4.346s]
[INFO] Maven Verifier Plugin ............................. SUCCESS [4.600s]
[INFO] Maven WAR Plugin .................................. SUCCESS [23.928s]
[INFO] SCM Publish Maven Plugin .......................... SUCCESS [14.021s]
[INFO] Maven Invoker Plugin .............................. SUCCESS [18.052s]
[INFO] Maven Project Info Reports Plugin ................. SUCCESS [25.230s]
[INFO] Maven Remote Resources Plugin ..................... SUCCESS [7.188s]
[INFO] Maven Shade Plugin ................................ SUCCESS [10.261s]
[INFO] Maven Plugins Aggregator .......................... SUCCESS [1.080s]
[INFO] ------------------------------------------------------------------------
[INFO] BUILD FAILURE
[INFO] ------------------------------------------------------------------------
[INFO] Total time: 4:27.430s (Wall Clock)
[INFO] Finished at: Fri Nov 16 22:58:28 UTC 2012
[INFO] Final Memory: 78M/424M
[INFO] ------------------------------------------------------------------------
Projects to build: [MavenProject: org.apache.maven.plugins:maven-plugins:24-SNAPSHOT @ <https://builds.apache.org/job/maven-plugins/ws/maven-plugins/pom.xml,> MavenProject: org.apache.maven.plugins:maven-acr-plugin:1.0.1-SNAPSHOT @ <https://builds.apache.org/job/maven-plugins/ws/maven-acr-plugin/pom.xml,> MavenProject: org.apache.maven.plugins:maven-ant-plugin:2.4-SNAPSHOT @ <https://builds.apache.org/job/maven-plugins/ws/maven-ant-plugin/pom.xml,> MavenProject: org.apache.maven.plugins:maven-antrun-plugin:1.8-SNAPSHOT @ <https://builds.apache.org/job/maven-plugins/ws/maven-antrun-plugin/pom.xml,> MavenProject: org.apache.maven.plugins:maven-eclipse-plugin:2.10-SNAPSHOT @ <https://builds.apache.org/job/maven-plugins/ws/maven-eclipse-plugin/pom.xml,> MavenProject: org.apache.maven.plugins:maven-assembly-plugin:2.5-SNAPSHOT @ <https://builds.apache.org/job/maven-plugins/ws/maven-assembly-plugin/pom.xml,> MavenProject: org.apache.maven.plugins:maven-changelog-plugin:2.3-SNAPSHOT @ <https://builds.apache.org/job/maven-plugins/ws/maven-changelog-plugin/pom.xml,> MavenProject: org.apache.maven.plugins:maven-changes-plugin:2.9-SNAPSHOT @ <https://builds.apache.org/job/maven-plugins/ws/maven-changes-plugin/pom.xml,> MavenProject: org.apache.maven.plugins:maven-checkstyle-plugin:2.10-SNAPSHOT @ <https://builds.apache.org/job/maven-plugins/ws/maven-checkstyle-plugin/pom.xml,> MavenProject: org.apache.maven.plugins:maven-clean-plugin:2.6-SNAPSHOT @ <https://builds.apache.org/job/maven-plugins/ws/maven-clean-plugin/pom.xml,> MavenProject: org.apache.maven.plugins:maven-compiler-plugin:3.1-SNAPSHOT @ <https://builds.apache.org/job/maven-plugins/ws/maven-compiler-plugin/pom.xml,> MavenProject: org.apache.maven.plugins:maven-dependency-plugin:2.7-SNAPSHOT @ <https://builds.apache.org/job/maven-plugins/ws/maven-dependency-plugin/pom.xml,> MavenProject: org.apache.maven.plugins:maven-deploy-plugin:2.8-SNAPSHOT @ <https://builds.apache.org/job/maven-plugins/ws/maven-deploy-plugin/pom.xml,> MavenProject: org.apache.maven.plugins:maven-doap-plugin:1.2-SNAPSHOT @ <https://builds.apache.org/job/maven-plugins/ws/maven-doap-plugin/pom.xml,> MavenProject: org.apache.maven.plugins:maven-docck-plugin:1.1-SNAPSHOT @ <https://builds.apache.org/job/maven-plugins/ws/maven-docck-plugin/pom.xml,> MavenProject: org.apache.maven.plugins:maven-ear-plugin:2.9-SNAPSHOT @ <https://builds.apache.org/job/maven-plugins/ws/maven-ear-plugin/pom.xml,> MavenProject: org.apache.maven.plugins:maven-ejb-plugin:2.4-SNAPSHOT @ <https://builds.apache.org/job/maven-plugins/ws/maven-ejb-plugin/pom.xml,> MavenProject: org.apache.maven.plugins:maven-gpg-plugin:1.5-SNAPSHOT @ <https://builds.apache.org/job/maven-plugins/ws/maven-gpg-plugin/pom.xml,> MavenProject: org.apache.maven.plugins:maven-help-plugin:2.2-SNAPSHOT @ <https://builds.apache.org/job/maven-plugins/ws/maven-help-plugin/pom.xml,> MavenProject: org.apache.maven.plugins:maven-idea-plugin:2.3-SNAPSHOT @ <https://builds.apache.org/job/maven-plugins/ws/maven-idea-plugin/pom.xml,> MavenProject: org.apache.maven.plugins:maven-install-plugin:2.5-SNAPSHOT @ <https://builds.apache.org/job/maven-plugins/ws/maven-install-plugin/pom.xml,> MavenProject: org.apache.maven.plugins:maven-jar-plugin:2.5-SNAPSHOT @ <https://builds.apache.org/job/maven-plugins/ws/maven-jar-plugin/pom.xml,> MavenProject: org.apache.maven.plugins:maven-jarsigner-plugin:1.3-SNAPSHOT @ <https://builds.apache.org/job/maven-plugins/ws/maven-jarsigner-plugin/pom.xml,> MavenProject: org.apache.maven.plugins:maven-javadoc-plugin:2.10-SNAPSHOT @ <https://builds.apache.org/job/maven-plugins/ws/maven-javadoc-plugin/pom.xml,> MavenProject: org.apache.maven.plugins:maven-linkcheck-plugin:1.2-SNAPSHOT @ <https://builds.apache.org/job/maven-plugins/ws/maven-linkcheck-plugin/pom.xml,> MavenProject: org.apache.maven.plugins:maven-one-plugin:1.3-SNAPSHOT @ <https://builds.apache.org/job/maven-plugins/ws/maven-one-plugin/pom.xml,> MavenProject: org.apache.maven.plugins:maven-patch-plugin:1.1.2-SNAPSHOT @ <https://builds.apache.org/job/maven-plugins/ws/maven-patch-plugin/pom.xml,> MavenProject: org.apache.maven.plugins:maven-pdf-plugin:1.3-SNAPSHOT @ <https://builds.apache.org/job/maven-plugins/ws/maven-pdf-plugin/pom.xml,> MavenProject: org.apache.maven.plugins:maven-pmd-plugin:2.8-SNAPSHOT @ <https://builds.apache.org/job/maven-plugins/ws/maven-pmd-plugin/pom.xml,> MavenProject: org.apache.maven.plugins:maven-rar-plugin:2.3-SNAPSHOT @ <https://builds.apache.org/job/maven-plugins/ws/maven-rar-plugin/pom.xml,> MavenProject: org.apache.maven.plugins:maven-reactor-plugin:1.1-SNAPSHOT @ <https://builds.apache.org/job/maven-plugins/ws/maven-reactor-plugin/pom.xml,> MavenProject: org.apache.maven.plugins:maven-repository-plugin:2.3.2-SNAPSHOT @ <https://builds.apache.org/job/maven-plugins/ws/maven-repository-plugin/pom.xml,> MavenProject: org.apache.maven.plugins:maven-resources-plugin:2.7-SNAPSHOT @ <https://builds.apache.org/job/maven-plugins/ws/maven-resources-plugin/pom.xml,> MavenProject: org.apache.maven.plugins:maven-site-plugin:3.3-SNAPSHOT @ <https://builds.apache.org/job/maven-plugins/ws/maven-site-plugin/dependency-reduced-pom.xml,> MavenProject: org.apache.maven.plugins:maven-source-plugin:2.3-SNAPSHOT @ <https://builds.apache.org/job/maven-plugins/ws/maven-source-plugin/pom.xml,> MavenProject: org.apache.maven.plugins:maven-stage-plugin:1.0-SNAPSHOT @ <https://builds.apache.org/job/maven-plugins/ws/maven-stage-plugin/pom.xml,> MavenProject: org.apache.maven.plugins:maven-toolchains-plugin:1.1-SNAPSHOT @ <https://builds.apache.org/job/maven-plugins/ws/maven-toolchains-plugin/pom.xml,> MavenProject: org.apache.maven.plugins:maven-verifier-plugin:1.1-SNAPSHOT @ <https://builds.apache.org/job/maven-plugins/ws/maven-verifier-plugin/pom.xml,> MavenProject: org.apache.maven.plugins:maven-war-plugin:2.4-SNAPSHOT @ <https://builds.apache.org/job/maven-plugins/ws/maven-war-plugin/pom.xml,> MavenProject: org.apache.maven.plugins:maven-scm-publish-plugin:1.0-SNAPSHOT @ <https://builds.apache.org/job/maven-plugins/ws/maven-scm-publish-plugin/pom.xml,> MavenProject: org.apache.maven.plugins:maven-invoker-plugin:1.8-SNAPSHOT @ <https://builds.apache.org/job/maven-plugins/ws/maven-invoker-plugin/pom.xml,> MavenProject: org.apache.maven.plugins:maven-project-info-reports-plugin:2.7-SNAPSHOT @ <https://builds.apache.org/job/maven-plugins/ws/maven-project-info-reports-plugin/pom.xml,> MavenProject: org.apache.maven.plugins:maven-remote-resources-plugin:1.5-SNAPSHOT @ <https://builds.apache.org/job/maven-plugins/ws/maven-remote-resources-plugin/pom.xml,> MavenProject: org.apache.maven.plugins:maven-shade-plugin:2.0.1-SNAPSHOT @ <https://builds.apache.org/job/maven-plugins/ws/maven-shade-plugin/pom.xml,> MavenProject: org.apache.maven.plugins:maven-plugins-aggregator:1-SNAPSHOT @ <https://builds.apache.org/job/maven-plugins/ws/pom.xml]>
[JENKINS] Archiving <https://builds.apache.org/job/maven-plugins/ws/maven-war-plugin/pom.xml> to /home/hudson/hudson/jobs/maven-plugins/modules/org.apache.maven.plugins$maven-war-plugin/builds/2012-11-16_22-53-45/archive/org.apache.maven.plugins/maven-war-plugin/2.4-SNAPSHOT/maven-war-plugin-2.4-SNAPSHOT.pom
[JENKINS] Archiving <https://builds.apache.org/job/maven-plugins/ws/maven-war-plugin/target/maven-war-plugin-2.4-SNAPSHOT.jar> to /home/hudson/hudson/jobs/maven-plugins/modules/org.apache.maven.plugins$maven-war-plugin/builds/2012-11-16_22-53-45/archive/org.apache.maven.plugins/maven-war-plugin/2.4-SNAPSHOT/maven-war-plugin-2.4-SNAPSHOT.jar
[JENKINS] Archiving <https://builds.apache.org/job/maven-plugins/ws/maven-docck-plugin/pom.xml> to /home/hudson/hudson/jobs/maven-plugins/modules/org.apache.maven.plugins$maven-docck-plugin/builds/2012-11-16_22-53-42/archive/org.apache.maven.plugins/maven-docck-plugin/1.1-SNAPSHOT/maven-docck-plugin-1.1-SNAPSHOT.pom
[JENKINS] Archiving <https://builds.apache.org/job/maven-plugins/ws/maven-docck-plugin/target/maven-docck-plugin-1.1-SNAPSHOT.jar> to /home/hudson/hudson/jobs/maven-plugins/modules/org.apache.maven.plugins$maven-docck-plugin/builds/2012-11-16_22-53-42/archive/org.apache.maven.plugins/maven-docck-plugin/1.1-SNAPSHOT/maven-docck-plugin-1.1-SNAPSHOT.jar
[JENKINS] Archiving <https://builds.apache.org/job/maven-plugins/ws/pom.xml> to /home/hudson/hudson/jobs/maven-plugins/modules/org.apache.maven.plugins$maven-plugins-aggregator/builds/2012-11-16_22-53-39/archive/org.apache.maven.plugins/maven-plugins-aggregator/1-SNAPSHOT/maven-plugins-aggregator-1-SNAPSHOT.pom
[JENKINS] Archiving <https://builds.apache.org/job/maven-plugins/ws/maven-idea-plugin/pom.xml> to /home/hudson/hudson/jobs/maven-plugins/modules/org.apache.maven.plugins$maven-idea-plugin/builds/2012-11-16_22-53-43/archive/org.apache.maven.plugins/maven-idea-plugin/2.3-SNAPSHOT/maven-idea-plugin-2.3-SNAPSHOT.pom
[JENKINS] Archiving <https://builds.apache.org/job/maven-plugins/ws/maven-idea-plugin/target/maven-idea-plugin-2.3-SNAPSHOT.jar> to /home/hudson/hudson/jobs/maven-plugins/modules/org.apache.maven.plugins$maven-idea-plugin/builds/2012-11-16_22-53-43/archive/org.apache.maven.plugins/maven-idea-plugin/2.3-SNAPSHOT/maven-idea-plugin-2.3-SNAPSHOT.jar
[JENKINS] Archiving <https://builds.apache.org/job/maven-plugins/ws/maven-toolchains-plugin/pom.xml> to /home/hudson/hudson/jobs/maven-plugins/modules/org.apache.maven.plugins$maven-toolchains-plugin/builds/2012-11-16_22-53-44/archive/org.apache.maven.plugins/maven-toolchains-plugin/1.1-SNAPSHOT/maven-toolchains-plugin-1.1-SNAPSHOT.pom
[JENKINS] Archiving <https://builds.apache.org/job/maven-plugins/ws/maven-toolchains-plugin/target/maven-toolchains-plugin-1.1-SNAPSHOT.jar> to /home/hudson/hudson/jobs/maven-plugins/modules/org.apache.maven.plugins$maven-toolchains-plugin/builds/2012-11-16_22-53-44/archive/org.apache.maven.plugins/maven-toolchains-plugin/1.1-SNAPSHOT/maven-toolchains-plugin-1.1-SNAPSHOT.jar
[JENKINS] Archiving <https://builds.apache.org/job/maven-plugins/ws/maven-pmd-plugin/pom.xml> to /home/hudson/hudson/jobs/maven-plugins/modules/org.apache.maven.plugins$maven-pmd-plugin/builds/2012-11-16_22-53-44/archive/org.apache.maven.plugins/maven-pmd-plugin/2.8-SNAPSHOT/maven-pmd-plugin-2.8-SNAPSHOT.pom
[JENKINS] Archiving <https://builds.apache.org/job/maven-plugins/ws/maven-pmd-plugin/target/maven-pmd-plugin-2.8-SNAPSHOT.jar> to /home/hudson/hudson/jobs/maven-plugins/modules/org.apache.maven.plugins$maven-pmd-plugin/builds/2012-11-16_22-53-44/archive/org.apache.maven.plugins/maven-pmd-plugin/2.8-SNAPSHOT/maven-pmd-plugin-2.8-SNAPSHOT.jar
[JENKINS] Archiving <https://builds.apache.org/job/maven-plugins/ws/maven-eclipse-plugin/pom.xml> to /home/hudson/hudson/jobs/maven-plugins/modules/org.apache.maven.plugins$maven-eclipse-plugin/builds/2012-11-16_22-53-40/archive/org.apache.maven.plugins/maven-eclipse-plugin/2.10-SNAPSHOT/maven-eclipse-plugin-2.10-SNAPSHOT.pom
[JENKINS] Archiving <https://builds.apache.org/job/maven-plugins/ws/maven-eclipse-plugin/target/maven-eclipse-plugin-2.10-SNAPSHOT.jar> to /home/hudson/hudson/jobs/maven-plugins/modules/org.apache.maven.plugins$maven-eclipse-plugin/builds/2012-11-16_22-53-40/archive/org.apache.maven.plugins/maven-eclipse-plugin/2.10-SNAPSHOT/maven-eclipse-plugin-2.10-SNAPSHOT.jar
[JENKINS] Archiving <https://builds.apache.org/job/maven-plugins/ws/maven-gpg-plugin/pom.xml> to /home/hudson/hudson/jobs/maven-plugins/modules/org.apache.maven.plugins$maven-gpg-plugin/builds/2012-11-16_22-53-42/archive/org.apache.maven.plugins/maven-gpg-plugin/1.5-SNAPSHOT/maven-gpg-plugin-1.5-SNAPSHOT.pom
[JENKINS] Archiving <https://builds.apache.org/job/maven-plugins/ws/maven-gpg-plugin/target/maven-gpg-plugin-1.5-SNAPSHOT.jar> to /home/hudson/hudson/jobs/maven-plugins/modules/org.apache.maven.plugins$maven-gpg-plugin/builds/2012-11-16_22-53-42/archive/org.apache.maven.plugins/maven-gpg-plugin/1.5-SNAPSHOT/maven-gpg-plugin-1.5-SNAPSHOT.jar
[JENKINS] Archiving <https://builds.apache.org/job/maven-plugins/ws/maven-clean-plugin/pom.xml> to /home/hudson/hudson/jobs/maven-plugins/modules/org.apache.maven.plugins$maven-clean-plugin/builds/2012-11-16_22-53-42/archive/org.apache.maven.plugins/maven-clean-plugin/2.6-SNAPSHOT/maven-clean-plugin-2.6-SNAPSHOT.pom
[JENKINS] Archiving <https://builds.apache.org/job/maven-plugins/ws/maven-clean-plugin/target/maven-clean-plugin-2.6-SNAPSHOT.jar> to /home/hudson/hudson/jobs/maven-plugins/modules/org.apache.maven.plugins$maven-clean-plugin/builds/2012-11-16_22-53-42/archive/org.apache.maven.plugins/maven-clean-plugin/2.6-SNAPSHOT/maven-clean-plugin-2.6-SNAPSHOT.jar
[JENKINS] Archiving <https://builds.apache.org/job/maven-plugins/ws/maven-jar-plugin/pom.xml> to /home/hudson/hudson/jobs/maven-plugins/modules/org.apache.maven.plugins$maven-jar-plugin/builds/2012-11-16_22-53-43/archive/org.apache.maven.plugins/maven-jar-plugin/2.5-SNAPSHOT/maven-jar-plugin-2.5-SNAPSHOT.pom
[JENKINS] Archiving <https://builds.apache.org/job/maven-plugins/ws/maven-jar-plugin/target/maven-jar-plugin-2.5-SNAPSHOT.jar> to /home/hudson/hudson/jobs/maven-plugins/modules/org.apache.maven.plugins$maven-jar-plugin/builds/2012-11-16_22-53-43/archive/org.apache.maven.plugins/maven-jar-plugin/2.5-SNAPSHOT/maven-jar-plugin-2.5-SNAPSHOT.jar
[JENKINS] Archiving <https://builds.apache.org/job/maven-plugins/ws/maven-site-plugin/dependency-reduced-pom.xml> to /home/hudson/hudson/jobs/maven-plugins/modules/org.apache.maven.plugins$maven-site-plugin/builds/2012-11-16_22-53-44/archive/org.apache.maven.plugins/maven-site-plugin/3.3-SNAPSHOT/maven-site-plugin-3.3-SNAPSHOT.pom
[JENKINS] Archiving <https://builds.apache.org/job/maven-plugins/ws/maven-site-plugin/target/maven-site-plugin-3.3-SNAPSHOT.jar> to /home/hudson/hudson/jobs/maven-plugins/modules/org.apache.maven.plugins$maven-site-plugin/builds/2012-11-16_22-53-44/archive/org.apache.maven.plugins/maven-site-plugin/3.3-SNAPSHOT/maven-site-plugin-3.3-SNAPSHOT.jar
[JENKINS] Archiving <https://builds.apache.org/job/maven-plugins/ws/maven-patch-plugin/pom.xml> to /home/hudson/hudson/jobs/maven-plugins/modules/org.apache.maven.plugins$maven-patch-plugin/builds/2012-11-16_22-53-43/archive/org.apache.maven.plugins/maven-patch-plugin/1.1.2-SNAPSHOT/maven-patch-plugin-1.1.2-SNAPSHOT.pom
[JENKINS] Archiving <https://builds.apache.org/job/maven-plugins/ws/maven-patch-plugin/target/maven-patch-plugin-1.1.2-SNAPSHOT.jar> to /home/hudson/hudson/jobs/maven-plugins/modules/org.apache.maven.plugins$maven-patch-plugin/builds/2012-11-16_22-53-43/archive/org.apache.maven.plugins/maven-patch-plugin/1.1.2-SNAPSHOT/maven-patch-plugin-1.1.2-SNAPSHOT.jar
[JENKINS] Archiving <https://builds.apache.org/job/maven-plugins/ws/maven-install-plugin/pom.xml> to /home/hudson/hudson/jobs/maven-plugins/modules/org.apache.maven.plugins$maven-install-plugin/builds/2012-11-16_22-53-43/archive/org.apache.maven.plugins/maven-install-plugin/2.5-SNAPSHOT/maven-install-plugin-2.5-SNAPSHOT.pom
[JENKINS] Archiving <https://builds.apache.org/job/maven-plugins/ws/maven-install-plugin/target/maven-install-plugin-2.5-SNAPSHOT.jar> to /home/hudson/hudson/jobs/maven-plugins/modules/org.apache.maven.plugins$maven-install-plugin/builds/2012-11-16_22-53-43/archive/org.apache.maven.plugins/maven-install-plugin/2.5-SNAPSHOT/maven-install-plugin-2.5-SNAPSHOT.jar
[JENKINS] Archiving <https://builds.apache.org/job/maven-plugins/ws/maven-antrun-plugin/pom.xml> to /home/hudson/hudson/jobs/maven-plugins/modules/org.apache.maven.plugins$maven-antrun-plugin/builds/2012-11-16_22-53-40/archive/org.apache.maven.plugins/maven-antrun-plugin/1.8-SNAPSHOT/maven-antrun-plugin-1.8-SNAPSHOT.pom
[JENKINS] Archiving <https://builds.apache.org/job/maven-plugins/ws/maven-antrun-plugin/target/maven-antrun-plugin-1.8-SNAPSHOT.jar> to /home/hudson/hudson/jobs/maven-plugins/modules/org.apache.maven.plugins$maven-antrun-plugin/builds/2012-11-16_22-53-40/archive/org.apache.maven.plugins/maven-antrun-plugin/1.8-SNAPSHOT/maven-antrun-plugin-1.8-SNAPSHOT.jar
[JENKINS] Archiving <https://builds.apache.org/job/maven-plugins/ws/maven-changes-plugin/pom.xml> to /home/hudson/hudson/jobs/maven-plugins/modules/org.apache.maven.plugins$maven-changes-plugin/builds/2012-11-16_22-53-41/archive/org.apache.maven.plugins/maven-changes-plugin/2.9-SNAPSHOT/maven-changes-plugin-2.9-SNAPSHOT.pom
[JENKINS] Archiving <https://builds.apache.org/job/maven-plugins/ws/maven-changes-plugin/target/maven-changes-plugin-2.9-SNAPSHOT.jar> to /home/hudson/hudson/jobs/maven-plugins/modules/org.apache.maven.plugins$maven-changes-plugin/builds/2012-11-16_22-53-41/archive/org.apache.maven.plugins/maven-changes-plugin/2.9-SNAPSHOT/maven-changes-plugin-2.9-SNAPSHOT.jar
[JENKINS] Archiving <https://builds.apache.org/job/maven-plugins/ws/maven-rar-plugin/pom.xml> to /home/hudson/hudson/jobs/maven-plugins/modules/org.apache.maven.plugins$maven-rar-plugin/builds/2012-11-16_22-53-44/archive/org.apache.maven.plugins/maven-rar-plugin/2.3-SNAPSHOT/maven-rar-plugin-2.3-SNAPSHOT.pom
[JENKINS] Archiving <https://builds.apache.org/job/maven-plugins/ws/maven-rar-plugin/target/maven-rar-plugin-2.3-SNAPSHOT.jar> to /home/hudson/hudson/jobs/maven-plugins/modules/org.apache.maven.plugins$maven-rar-plugin/builds/2012-11-16_22-53-44/archive/org.apache.maven.plugins/maven-rar-plugin/2.3-SNAPSHOT/maven-rar-plugin-2.3-SNAPSHOT.jar
[JENKINS] Archiving <https://builds.apache.org/job/maven-plugins/ws/maven-jarsigner-plugin/pom.xml> to /home/hudson/hudson/jobs/maven-plugins/modules/org.apache.maven.plugins$maven-jarsigner-plugin/builds/2012-11-16_22-53-43/archive/org.apache.maven.plugins/maven-jarsigner-plugin/1.3-SNAPSHOT/maven-jarsigner-plugin-1.3-SNAPSHOT.pom
[JENKINS] Archiving <https://builds.apache.org/job/maven-plugins/ws/maven-jarsigner-plugin/target/maven-jarsigner-plugin-1.3-SNAPSHOT.jar> to /home/hudson/hudson/jobs/maven-plugins/modules/org.apache.maven.plugins$maven-jarsigner-plugin/builds/2012-11-16_22-53-43/archive/org.apache.maven.plugins/maven-jarsigner-plugin/1.3-SNAPSHOT/maven-jarsigner-plugin-1.3-SNAPSHOT.jar
[JENKINS] Archiving <https://builds.apache.org/job/maven-plugins/ws/maven-ear-plugin/pom.xml> to /home/hudson/hudson/jobs/maven-plugins/modules/org.apache.maven.plugins$maven-ear-plugin/builds/2012-11-16_22-53-42/archive/org.apache.maven.plugins/maven-ear-plugin/2.9-SNAPSHOT/maven-ear-plugin-2.9-SNAPSHOT.pom
[JENKINS] Archiving <https://builds.apache.org/job/maven-plugins/ws/maven-ear-plugin/target/maven-ear-plugin-2.9-SNAPSHOT.jar> to /home/hudson/hudson/jobs/maven-plugins/modules/org.apache.maven.plugins$maven-ear-plugin/builds/2012-11-16_22-53-42/archive/org.apache.maven.plugins/maven-ear-plugin/2.9-SNAPSHOT/maven-ear-plugin-2.9-SNAPSHOT.jar
[JENKINS] Archiving <https://builds.apache.org/job/maven-plugins/ws/maven-changelog-plugin/pom.xml> to /home/hudson/hudson/jobs/maven-plugins/modules/org.apache.maven.plugins$maven-changelog-plugin/builds/2012-11-16_22-53-41/archive/org.apache.maven.plugins/maven-changelog-plugin/2.3-SNAPSHOT/maven-changelog-plugin-2.3-SNAPSHOT.pom
[JENKINS] Archiving <https://builds.apache.org/job/maven-plugins/ws/maven-changelog-plugin/target/maven-changelog-plugin-2.3-SNAPSHOT.jar> to /home/hudson/hudson/jobs/maven-plugins/modules/org.apache.maven.plugins$maven-changelog-plugin/builds/2012-11-16_22-53-41/archive/org.apache.maven.plugins/maven-changelog-plugin/2.3-SNAPSHOT/maven-changelog-plugin-2.3-SNAPSHOT.jar
[JENKINS] Archiving <https://builds.apache.org/job/maven-plugins/ws/maven-verifier-plugin/pom.xml> to /home/hudson/hudson/jobs/maven-plugins/modules/org.apache.maven.plugins$maven-verifier-plugin/builds/2012-11-16_22-53-45/archive/org.apache.maven.plugins/maven-verifier-plugin/1.1-SNAPSHOT/maven-verifier-plugin-1.1-SNAPSHOT.pom
[JENKINS] Archiving <https://builds.apache.org/job/maven-plugins/ws/maven-verifier-plugin/target/maven-verifier-plugin-1.1-SNAPSHOT.jar> to /home/hudson/hudson/jobs/maven-plugins/modules/org.apache.maven.plugins$maven-verifier-plugin/builds/2012-11-16_22-53-45/archive/org.apache.maven.plugins/maven-verifier-plugin/1.1-SNAPSHOT/maven-verifier-plugin-1.1-SNAPSHOT.jar
[JENKINS] Archiving <https://builds.apache.org/job/maven-plugins/ws/maven-ant-plugin/pom.xml> to /home/hudson/hudson/jobs/maven-plugins/modules/org.apache.maven.plugins$maven-ant-plugin/builds/2012-11-16_22-53-40/archive/org.apache.maven.plugins/maven-ant-plugin/2.4-SNAPSHOT/maven-ant-plugin-2.4-SNAPSHOT.pom
[JENKINS] Archiving <https://builds.apache.org/job/maven-plugins/ws/maven-ant-plugin/target/maven-ant-plugin-2.4-SNAPSHOT.jar> to /home/hudson/hudson/jobs/maven-plugins/modules/org.apache.maven.plugins$maven-ant-plugin/builds/2012-11-16_22-53-40/archive/org.apache.maven.plugins/maven-ant-plugin/2.4-SNAPSHOT/maven-ant-plugin-2.4-SNAPSHOT.jar
[JENKINS] Archiving <https://builds.apache.org/job/maven-plugins/ws/maven-ejb-plugin/pom.xml> to /home/hudson/hudson/jobs/maven-plugins/modules/org.apache.maven.plugins$maven-ejb-plugin/builds/2012-11-16_22-53-42/archive/org.apache.maven.plugins/maven-ejb-plugin/2.4-SNAPSHOT/maven-ejb-plugin-2.4-SNAPSHOT.pom
[JENKINS] Archiving <https://builds.apache.org/job/maven-plugins/ws/maven-ejb-plugin/target/maven-ejb-plugin-2.4-SNAPSHOT.jar> to /home/hudson/hudson/jobs/maven-plugins/modules/org.apache.maven.plugins$maven-ejb-plugin/builds/2012-11-16_22-53-42/archive/org.apache.maven.plugins/maven-ejb-plugin/2.4-SNAPSHOT/maven-ejb-plugin-2.4-SNAPSHOT.jar
[JENKINS] Archiving <https://builds.apache.org/job/maven-plugins/ws/maven-stage-plugin/pom.xml> to /home/hudson/hudson/jobs/maven-plugins/modules/org.apache.maven.plugins$maven-stage-plugin/builds/2012-11-16_22-53-44/archive/org.apache.maven.plugins/maven-stage-plugin/1.0-SNAPSHOT/maven-stage-plugin-1.0-SNAPSHOT.pom
[JENKINS] Archiving <https://builds.apache.org/job/maven-plugins/ws/maven-stage-plugin/target/maven-stage-plugin-1.0-SNAPSHOT.jar> to /home/hudson/hudson/jobs/maven-plugins/modules/org.apache.maven.plugins$maven-stage-plugin/builds/2012-11-16_22-53-44/archive/org.apache.maven.plugins/maven-stage-plugin/1.0-SNAPSHOT/maven-stage-plugin-1.0-SNAPSHOT.jar
[JENKINS] Archiving <https://builds.apache.org/job/maven-plugins/ws/maven-scm-publish-plugin/pom.xml> to /home/hudson/hudson/jobs/maven-plugins/modules/org.apache.maven.plugins$maven-scm-publish-plugin/builds/2012-11-16_22-53-45/archive/org.apache.maven.plugins/maven-scm-publish-plugin/1.0-SNAPSHOT/maven-scm-publish-plugin-1.0-SNAPSHOT.pom
[JENKINS] Archiving <https://builds.apache.org/job/maven-plugins/ws/maven-scm-publish-plugin/target/maven-scm-publish-plugin-1.0-SNAPSHOT.jar> to /home/hudson/hudson/jobs/maven-plugins/modules/org.apache.maven.plugins$maven-scm-publish-plugin/builds/2012-11-16_22-53-45/archive/org.apache.maven.plugins/maven-scm-publish-plugin/1.0-SNAPSHOT/maven-scm-publish-plugin-1.0-SNAPSHOT.jar
[JENKINS] Archiving <https://builds.apache.org/job/maven-plugins/ws/maven-compiler-plugin/pom.xml> to /home/hudson/hudson/jobs/maven-plugins/modules/org.apache.maven.plugins$maven-compiler-plugin/builds/2012-11-16_22-53-42/archive/org.apache.maven.plugins/maven-compiler-plugin/3.1-SNAPSHOT/maven-compiler-plugin-3.1-SNAPSHOT.pom
[JENKINS] Archiving <https://builds.apache.org/job/maven-plugins/ws/maven-reactor-plugin/pom.xml> to /home/hudson/hudson/jobs/maven-plugins/modules/org.apache.maven.plugins$maven-reactor-plugin/builds/2012-11-16_22-53-44/archive/org.apache.maven.plugins/maven-reactor-plugin/1.1-SNAPSHOT/maven-reactor-plugin-1.1-SNAPSHOT.pom
[JENKINS] Archiving <https://builds.apache.org/job/maven-plugins/ws/maven-reactor-plugin/target/maven-reactor-plugin-1.1-SNAPSHOT.jar> to /home/hudson/hudson/jobs/maven-plugins/modules/org.apache.maven.plugins$maven-reactor-plugin/builds/2012-11-16_22-53-44/archive/org.apache.maven.plugins/maven-reactor-plugin/1.1-SNAPSHOT/maven-reactor-plugin-1.1-SNAPSHOT.jar
[JENKINS] Archiving <https://builds.apache.org/job/maven-plugins/ws/maven-doap-plugin/pom.xml> to /home/hudson/hudson/jobs/maven-plugins/modules/org.apache.maven.plugins$maven-doap-plugin/builds/2012-11-16_22-53-42/archive/org.apache.maven.plugins/maven-doap-plugin/1.2-SNAPSHOT/maven-doap-plugin-1.2-SNAPSHOT.pom
[JENKINS] Archiving <https://builds.apache.org/job/maven-plugins/ws/maven-doap-plugin/target/maven-doap-plugin-1.2-SNAPSHOT.jar> to /home/hudson/hudson/jobs/maven-plugins/modules/org.apache.maven.plugins$maven-doap-plugin/builds/2012-11-16_22-53-42/archive/org.apache.maven.plugins/maven-doap-plugin/1.2-SNAPSHOT/maven-doap-plugin-1.2-SNAPSHOT.jar
[JENKINS] Archiving <https://builds.apache.org/job/maven-plugins/ws/maven-checkstyle-plugin/pom.xml> to /home/hudson/hudson/jobs/maven-plugins/modules/org.apache.maven.plugins$maven-checkstyle-plugin/builds/2012-11-16_22-53-41/archive/org.apache.maven.plugins/maven-checkstyle-plugin/2.10-SNAPSHOT/maven-checkstyle-plugin-2.10-SNAPSHOT.pom
[JENKINS] Archiving <https://builds.apache.org/job/maven-plugins/ws/maven-checkstyle-plugin/target/maven-checkstyle-plugin-2.10-SNAPSHOT.jar> to /home/hudson/hudson/jobs/maven-plugins/modules/org.apache.maven.plugins$maven-checkstyle-plugin/builds/2012-11-16_22-53-41/archive/org.apache.maven.plugins/maven-checkstyle-plugin/2.10-SNAPSHOT/maven-checkstyle-plugin-2.10-SNAPSHOT.jar
[JENKINS] Archiving <https://builds.apache.org/job/maven-plugins/ws/maven-source-plugin/pom.xml> to /home/hudson/hudson/jobs/maven-plugins/modules/org.apache.maven.plugins$maven-source-plugin/builds/2012-11-16_22-53-44/archive/org.apache.maven.plugins/maven-source-plugin/2.3-SNAPSHOT/maven-source-plugin-2.3-SNAPSHOT.pom
[JENKINS] Archiving <https://builds.apache.org/job/maven-plugins/ws/maven-source-plugin/target/maven-source-plugin-2.3-SNAPSHOT.jar> to /home/hudson/hudson/jobs/maven-plugins/modules/org.apache.maven.plugins$maven-source-plugin/builds/2012-11-16_22-53-44/archive/org.apache.maven.plugins/maven-source-plugin/2.3-SNAPSHOT/maven-source-plugin-2.3-SNAPSHOT.jar
[JENKINS] Archiving <https://builds.apache.org/job/maven-plugins/ws/maven-dependency-plugin/pom.xml> to /home/hudson/hudson/jobs/maven-plugins/modules/org.apache.maven.plugins$maven-dependency-plugin/builds/2012-11-16_22-53-42/archive/org.apache.maven.plugins/maven-dependency-plugin/2.7-SNAPSHOT/maven-dependency-plugin-2.7-SNAPSHOT.pom
[JENKINS] Archiving <https://builds.apache.org/job/maven-plugins/ws/maven-dependency-plugin/target/maven-dependency-plugin-2.7-SNAPSHOT.jar> to /home/hudson/hudson/jobs/maven-plugins/modules/org.apache.maven.plugins$maven-dependency-plugin/builds/2012-11-16_22-53-42/archive/org.apache.maven.plugins/maven-dependency-plugin/2.7-SNAPSHOT/maven-dependency-plugin-2.7-SNAPSHOT.jar
[JENKINS] Archiving <https://builds.apache.org/job/maven-plugins/ws/maven-javadoc-plugin/pom.xml> to /home/hudson/hudson/jobs/maven-plugins/modules/org.apache.maven.plugins$maven-javadoc-plugin/builds/2012-11-16_22-53-43/archive/org.apache.maven.plugins/maven-javadoc-plugin/2.10-SNAPSHOT/maven-javadoc-plugin-2.10-SNAPSHOT.pom
[JENKINS] Archiving <https://builds.apache.org/job/maven-plugins/ws/maven-javadoc-plugin/target/maven-javadoc-plugin-2.10-SNAPSHOT.jar> to /home/hudson/hudson/jobs/maven-plugins/modules/org.apache.maven.plugins$maven-javadoc-plugin/builds/2012-11-16_22-53-43/archive/org.apache.maven.plugins/maven-javadoc-plugin/2.10-SNAPSHOT/maven-javadoc-plugin-2.10-SNAPSHOT.jar
[JENKINS] Archiving <https://builds.apache.org/job/maven-plugins/ws/maven-deploy-plugin/pom.xml> to /home/hudson/hudson/jobs/maven-plugins/modules/org.apache.maven.plugins$maven-deploy-plugin/builds/2012-11-16_22-53-42/archive/org.apache.maven.plugins/maven-deploy-plugin/2.8-SNAPSHOT/maven-deploy-plugin-2.8-SNAPSHOT.pom
[JENKINS] Archiving <https://builds.apache.org/job/maven-plugins/ws/maven-deploy-plugin/target/maven-deploy-plugin-2.8-SNAPSHOT.jar> to /home/hudson/hudson/jobs/maven-plugins/modules/org.apache.maven.plugins$maven-deploy-plugin/builds/2012-11-16_22-53-42/archive/org.apache.maven.plugins/maven-deploy-plugin/2.8-SNAPSHOT/maven-deploy-plugin-2.8-SNAPSHOT.jar
[JENKINS] Archiving <https://builds.apache.org/job/maven-plugins/ws/maven-acr-plugin/pom.xml> to /home/hudson/hudson/jobs/maven-plugins/modules/org.apache.maven.plugins$maven-acr-plugin/builds/2012-11-16_22-53-40/archive/org.apache.maven.plugins/maven-acr-plugin/1.0.1-SNAPSHOT/maven-acr-plugin-1.0.1-SNAPSHOT.pom
[JENKINS] Archiving <https://builds.apache.org/job/maven-plugins/ws/maven-acr-plugin/target/maven-acr-plugin-1.0.1-SNAPSHOT.jar> to /home/hudson/hudson/jobs/maven-plugins/modules/org.apache.maven.plugins$maven-acr-plugin/builds/2012-11-16_22-53-40/archive/org.apache.maven.plugins/maven-acr-plugin/1.0.1-SNAPSHOT/maven-acr-plugin-1.0.1-SNAPSHOT.jar
[JENKINS] Archiving <https://builds.apache.org/job/maven-plugins/ws/maven-repository-plugin/pom.xml> to /home/hudson/hudson/jobs/maven-plugins/modules/org.apache.maven.plugins$maven-repository-plugin/builds/2012-11-16_22-53-44/archive/org.apache.maven.plugins/maven-repository-plugin/2.3.2-SNAPSHOT/maven-repository-plugin-2.3.2-SNAPSHOT.pom
[JENKINS] Archiving <https://builds.apache.org/job/maven-plugins/ws/maven-repository-plugin/target/maven-repository-plugin-2.3.2-SNAPSHOT.jar> to /home/hudson/hudson/jobs/maven-plugins/modules/org.apache.maven.plugins$maven-repository-plugin/builds/2012-11-16_22-53-44/archive/org.apache.maven.plugins/maven-repository-plugin/2.3.2-SNAPSHOT/maven-repository-plugin-2.3.2-SNAPSHOT.jar
[JENKINS] Archiving <https://builds.apache.org/job/maven-plugins/ws/maven-assembly-plugin/pom.xml> to /home/hudson/hudson/jobs/maven-plugins/modules/org.apache.maven.plugins$maven-assembly-plugin/builds/2012-11-16_22-53-41/archive/org.apache.maven.plugins/maven-assembly-plugin/2.5-SNAPSHOT/maven-assembly-plugin-2.5-SNAPSHOT.pom
[JENKINS] Archiving <https://builds.apache.org/job/maven-plugins/ws/maven-assembly-plugin/target/maven-assembly-plugin-2.5-SNAPSHOT.jar> to /home/hudson/hudson/jobs/maven-plugins/modules/org.apache.maven.plugins$maven-assembly-plugin/builds/2012-11-16_22-53-41/archive/org.apache.maven.plugins/maven-assembly-plugin/2.5-SNAPSHOT/maven-assembly-plugin-2.5-SNAPSHOT.jar
[JENKINS] Archiving <https://builds.apache.org/job/maven-plugins/ws/maven-project-info-reports-plugin/pom.xml> to /home/hudson/hudson/jobs/maven-plugins/modules/org.apache.maven.plugins$maven-project-info-reports-plugin/builds/2012-11-16_22-53-45/archive/org.apache.maven.plugins/maven-project-info-reports-plugin/2.7-SNAPSHOT/maven-project-info-reports-plugin-2.7-SNAPSHOT.pom
[JENKINS] Archiving <https://builds.apache.org/job/maven-plugins/ws/maven-project-info-reports-plugin/target/maven-project-info-reports-plugin-2.7-SNAPSHOT.jar> to /home/hudson/hudson/jobs/maven-plugins/modules/org.apache.maven.plugins$maven-project-info-reports-plugin/builds/2012-11-16_22-53-45/archive/org.apache.maven.plugins/maven-project-info-reports-plugin/2.7-SNAPSHOT/maven-project-info-reports-plugin-2.7-SNAPSHOT.jar
[JENKINS] Archiving <https://builds.apache.org/job/maven-plugins/ws/maven-one-plugin/pom.xml> to /home/hudson/hudson/jobs/maven-plugins/modules/org.apache.maven.plugins$maven-one-plugin/builds/2012-11-16_22-53-43/archive/org.apache.maven.plugins/maven-one-plugin/1.3-SNAPSHOT/maven-one-plugin-1.3-SNAPSHOT.pom
[JENKINS] Archiving <https://builds.apache.org/job/maven-plugins/ws/maven-one-plugin/target/maven-one-plugin-1.3-SNAPSHOT.jar> to /home/hudson/hudson/jobs/maven-plugins/modules/org.apache.maven.plugins$maven-one-plugin/builds/2012-11-16_22-53-43/archive/org.apache.maven.plugins/maven-one-plugin/1.3-SNAPSHOT/maven-one-plugin-1.3-SNAPSHOT.jar
[JENKINS] Archiving <https://builds.apache.org/job/maven-plugins/ws/maven-help-plugin/pom.xml> to /home/hudson/hudson/jobs/maven-plugins/modules/org.apache.maven.plugins$maven-help-plugin/builds/2012-11-16_22-53-43/archive/org.apache.maven.plugins/maven-help-plugin/2.2-SNAPSHOT/maven-help-plugin-2.2-SNAPSHOT.pom
[JENKINS] Archiving <https://builds.apache.org/job/maven-plugins/ws/maven-help-plugin/target/maven-help-plugin-2.2-SNAPSHOT.jar> to /home/hudson/hudson/jobs/maven-plugins/modules/org.apache.maven.plugins$maven-help-plugin/builds/2012-11-16_22-53-43/archive/org.apache.maven.plugins/maven-help-plugin/2.2-SNAPSHOT/maven-help-plugin-2.2-SNAPSHOT.jar
[JENKINS] Archiving <https://builds.apache.org/job/maven-plugins/ws/maven-invoker-plugin/pom.xml> to /home/hudson/hudson/jobs/maven-plugins/modules/org.apache.maven.plugins$maven-invoker-plugin/builds/2012-11-16_22-53-45/archive/org.apache.maven.plugins/maven-invoker-plugin/1.8-SNAPSHOT/maven-invoker-plugin-1.8-SNAPSHOT.pom
[JENKINS] Archiving <https://builds.apache.org/job/maven-plugins/ws/maven-invoker-plugin/target/maven-invoker-plugin-1.8-SNAPSHOT.jar> to /home/hudson/hudson/jobs/maven-plugins/modules/org.apache.maven.plugins$maven-invoker-plugin/builds/2012-11-16_22-53-45/archive/org.apache.maven.plugins/maven-invoker-plugin/1.8-SNAPSHOT/maven-invoker-plugin-1.8-SNAPSHOT.jar
[JENKINS] Archiving <https://builds.apache.org/job/maven-plugins/ws/maven-remote-resources-plugin/pom.xml> to /home/hudson/hudson/jobs/maven-plugins/modules/org.apache.maven.plugins$maven-remote-resources-plugin/builds/2012-11-16_22-53-45/archive/org.apache.maven.plugins/maven-remote-resources-plugin/1.5-SNAPSHOT/maven-remote-resources-plugin-1.5-SNAPSHOT.pom
[JENKINS] Archiving <https://builds.apache.org/job/maven-plugins/ws/maven-remote-resources-plugin/target/maven-remote-resources-plugin-1.5-SNAPSHOT.jar> to /home/hudson/hudson/jobs/maven-plugins/modules/org.apache.maven.plugins$maven-remote-resources-plugin/builds/2012-11-16_22-53-45/archive/org.apache.maven.plugins/maven-remote-resources-plugin/1.5-SNAPSHOT/maven-remote-resources-plugin-1.5-SNAPSHOT.jar
[JENKINS] Archiving <https://builds.apache.org/job/maven-plugins/ws/maven-pdf-plugin/pom.xml> to /home/hudson/hudson/jobs/maven-plugins/modules/org.apache.maven.plugins$maven-pdf-plugin/builds/2012-11-16_22-53-44/archive/org.apache.maven.plugins/maven-pdf-plugin/1.3-SNAPSHOT/maven-pdf-plugin-1.3-SNAPSHOT.pom
[JENKINS] Archiving <https://builds.apache.org/job/maven-plugins/ws/maven-pdf-plugin/target/maven-pdf-plugin-1.3-SNAPSHOT.jar> to /home/hudson/hudson/jobs/maven-plugins/modules/org.apache.maven.plugins$maven-pdf-plugin/builds/2012-11-16_22-53-44/archive/org.apache.maven.plugins/maven-pdf-plugin/1.3-SNAPSHOT/maven-pdf-plugin-1.3-SNAPSHOT.jar
[JENKINS] Archiving <https://builds.apache.org/job/maven-plugins/ws/maven-shade-plugin/pom.xml> to /home/hudson/hudson/jobs/maven-plugins/modules/org.apache.maven.plugins$maven-shade-plugin/builds/2012-11-16_22-53-45/archive/org.apache.maven.plugins/maven-shade-plugin/2.0.1-SNAPSHOT/maven-shade-plugin-2.0.1-SNAPSHOT.pom
[JENKINS] Archiving <https://builds.apache.org/job/maven-plugins/ws/maven-shade-plugin/target/maven-shade-plugin-2.0.1-SNAPSHOT.jar> to /home/hudson/hudson/jobs/maven-plugins/modules/org.apache.maven.plugins$maven-shade-plugin/builds/2012-11-16_22-53-45/archive/org.apache.maven.plugins/maven-shade-plugin/2.0.1-SNAPSHOT/maven-shade-plugin-2.0.1-SNAPSHOT.jar
[JENKINS] Archiving <https://builds.apache.org/job/maven-plugins/ws/maven-plugins/pom.xml> to /home/hudson/hudson/jobs/maven-plugins/modules/org.apache.maven.plugins$maven-plugins/builds/2012-11-16_22-53-39/archive/org.apache.maven.plugins/maven-plugins/24-SNAPSHOT/maven-plugins-24-SNAPSHOT.pom
[JENKINS] Archiving <https://builds.apache.org/job/maven-plugins/ws/maven-plugins/target/maven-plugins-24-SNAPSHOT-site.xml> to /home/hudson/hudson/jobs/maven-plugins/modules/org.apache.maven.plugins$maven-plugins/builds/2012-11-16_22-53-39/archive/org.apache.maven.plugins/maven-plugins/24-SNAPSHOT/maven-plugins-24-SNAPSHOT-site.xml
[JENKINS] Archiving <https://builds.apache.org/job/maven-plugins/ws/maven-linkcheck-plugin/pom.xml> to /home/hudson/hudson/jobs/maven-plugins/modules/org.apache.maven.plugins$maven-linkcheck-plugin/builds/2012-11-16_22-53-43/archive/org.apache.maven.plugins/maven-linkcheck-plugin/1.2-SNAPSHOT/maven-linkcheck-plugin-1.2-SNAPSHOT.pom
[JENKINS] Archiving <https://builds.apache.org/job/maven-plugins/ws/maven-linkcheck-plugin/target/maven-linkcheck-plugin-1.2-SNAPSHOT.jar> to /home/hudson/hudson/jobs/maven-plugins/modules/org.apache.maven.plugins$maven-linkcheck-plugin/builds/2012-11-16_22-53-43/archive/org.apache.maven.plugins/maven-linkcheck-plugin/1.2-SNAPSHOT/maven-linkcheck-plugin-1.2-SNAPSHOT.jar
[JENKINS] Archiving <https://builds.apache.org/job/maven-plugins/ws/maven-resources-plugin/pom.xml> to /home/hudson/hudson/jobs/maven-plugins/modules/org.apache.maven.plugins$maven-resources-plugin/builds/2012-11-16_22-53-44/archive/org.apache.maven.plugins/maven-resources-plugin/2.7-SNAPSHOT/maven-resources-plugin-2.7-SNAPSHOT.pom
[JENKINS] Archiving <https://builds.apache.org/job/maven-plugins/ws/maven-resources-plugin/target/maven-resources-plugin-2.7-SNAPSHOT.jar> to /home/hudson/hudson/jobs/maven-plugins/modules/org.apache.maven.plugins$maven-resources-plugin/builds/2012-11-16_22-53-44/archive/org.apache.maven.plugins/maven-resources-plugin/2.7-SNAPSHOT/maven-resources-plugin-2.7-SNAPSHOT.jar
Waiting for Jenkins to finish collecting data
mavenExecutionResult exceptions not empty
message : Failed to execute goal on project maven-compiler-plugin: Could not resolve dependencies for project org.apache.maven.plugins:maven-compiler-plugin:maven-plugin:3.1-SNAPSHOT: Could not find artifact org.apache.maven.shared:maven-shared-incremental:jar:1.0 in central (http://repo.maven.apache.org/maven2)
cause : Could not resolve dependencies for project org.apache.maven.plugins:maven-compiler-plugin:maven-plugin:3.1-SNAPSHOT: Could not find artifact org.apache.maven.shared:maven-shared-incremental:jar:1.0 in central (http://repo.maven.apache.org/maven2)
Stack trace :
org.apache.maven.lifecycle.LifecycleExecutionException: Failed to execute goal on project maven-compiler-plugin: Could not resolve dependencies for project org.apache.maven.plugins:maven-compiler-plugin:maven-plugin:3.1-SNAPSHOT: Could not find artifact org.apache.maven.shared:maven-shared-incremental:jar:1.0 in central (http://repo.maven.apache.org/maven2)
at org.apache.maven.lifecycle.internal.LifecycleDependencyResolver.getDependencies(LifecycleDependencyResolver.java:210)
at org.apache.maven.lifecycle.internal.LifecycleDependencyResolver.resolveProjectDependencies(LifecycleDependencyResolver.java:117)
at org.apache.maven.lifecycle.internal.MojoExecutor.ensureDependenciesAreResolved(MojoExecutor.java:258)
at org.apache.maven.lifecycle.internal.MojoExecutor.execute(MojoExecutor.java:201)
at org.apache.maven.lifecycle.internal.MojoExecutor.execute(MojoExecutor.java:153)
at org.apache.maven.lifecycle.internal.MojoExecutor.execute(MojoExecutor.java:145)
at org.apache.maven.lifecycle.internal.LifecycleModuleBuilder.buildProject(LifecycleModuleBuilder.java:84)
at org.apache.maven.lifecycle.internal.LifecycleThreadedBuilder$1.call(LifecycleThreadedBuilder.java:167)
at org.apache.maven.lifecycle.internal.LifecycleThreadedBuilder$1.call(LifecycleThreadedBuilder.java:163)
at java.util.concurrent.FutureTask$Sync.innerRun(FutureTask.java:269)
at java.util.concurrent.FutureTask.run(FutureTask.java:123)
at java.util.concurrent.ThreadPoolExecutor$Worker.runTask(ThreadPoolExecutor.java:651)
at java.util.concurrent.ThreadPoolExecutor$Worker.run(ThreadPoolExecutor.java:676)
at java.lang.Thread.run(Thread.java:595)
Caused by: org.apache.maven.project.DependencyResolutionException: Could not resolve dependencies for project org.apache.maven.plugins:maven-compiler-plugin:maven-plugin:3.1-SNAPSHOT: Could not find artifact org.apache.maven.shared:maven-shared-incremental:jar:1.0 in central (http://repo.maven.apache.org/maven2)
at org.apache.maven.project.DefaultProjectDependenciesResolver.resolve(DefaultProjectDependenciesResolver.java:189)
at org.apache.maven.lifecycle.internal.LifecycleDependencyResolver.getDependencies(LifecycleDependencyResolver.java:185)
... 13 more
Caused by: org.sonatype.aether.resolution.DependencyResolutionException: Could not find artifact org.apache.maven.shared:maven-shared-incremental:jar:1.0 in central (http://repo.maven.apache.org/maven2)
at org.sonatype.aether.impl.internal.DefaultRepositorySystem.resolveDependencies(DefaultRepositorySystem.java:375)
at org.apache.maven.project.DefaultProjectDependenciesResolver.resolve(DefaultProjectDependenciesResolver.java:183)
... 14 more
Caused by: org.sonatype.aether.resolution.ArtifactResolutionException: Could not find artifact org.apache.maven.shared:maven-shared-incremental:jar:1.0 in central (http://repo.maven.apache.org/maven2)
at org.sonatype.aether.impl.internal.DefaultArtifactResolver.resolve(DefaultArtifactResolver.java:538)
at org.sonatype.aether.impl.internal.DefaultArtifactResolver.resolveArtifacts(DefaultArtifactResolver.java:216)
at org.sonatype.aether.impl.internal.DefaultRepositorySystem.resolveDependencies(DefaultRepositorySystem.java:358)
... 15 more
Caused by: org.sonatype.aether.transfer.ArtifactNotFoundException: Could not find artifact org.apache.maven.shared:maven-shared-incremental:jar:1.0 in central (http://repo.maven.apache.org/maven2)
at org.sonatype.aether.connector.wagon.WagonRepositoryConnector$4.wrap(WagonRepositoryConnector.java:947)
at org.sonatype.aether.connector.wagon.WagonRepositoryConnector$4.wrap(WagonRepositoryConnector.java:941)
at org.sonatype.aether.connector.wagon.WagonRepositoryConnector$GetTask.run(WagonRepositoryConnector.java:669)
at org.sonatype.aether.util.concurrency.RunnableErrorForwarder$1.run(RunnableErrorForwarder.java:60)
... 3 more
Sending e-mails to: notifications@maven.apache.org
channel stopped
[WARNINGS] Skipping publisher since build result is FAILURE