You are viewing a plain text version of this content. The canonical link for it is here.
Posted to builds@mesos.apache.org by Apache Jenkins Server <je...@builds.apache.org> on 2015/07/25 03:15:21 UTC
Build failed in Jenkins: Mesos » clang,docker||Hadoop,ubuntu:14.10 #573
See <https://builds.apache.org/job/Mesos/COMPILER=clang,LABEL=docker%7C%7CHadoop,OS=ubuntu%3A14.10/573/changes>
Changes:
[vinodkone] Updated slave to always set task status's uuid in status update.
[vinodkone] Added address field to MasterInfo.
------------------------------------------
[...truncated 115626 lines...]
I0725 01:15:44.184327 24815 leveldb.cpp:183] Compacted db in 1.817837ms
I0725 01:15:44.184386 24815 leveldb.cpp:198] Created db iterator in 42297ns
I0725 01:15:44.184453 24815 leveldb.cpp:204] Seeked to beginning of db in 47211ns
I0725 01:15:44.184509 24815 leveldb.cpp:273] Iterated through 1 keys in the db in 47012ns
I0725 01:15:44.184604 24815 replica.cpp:744] Replica recovered with log positions 0 -> 0 with 1 holes and 0 unlearned
I0725 01:15:44.186630 24815 leveldb.cpp:176] Opened db in 1.83977ms
I0725 01:15:44.188418 24815 leveldb.cpp:183] Compacted db in 1.77013ms
I0725 01:15:44.188483 24815 leveldb.cpp:198] Created db iterator in 31997ns
I0725 01:15:44.188608 24815 leveldb.cpp:204] Seeked to beginning of db in 80129ns
I0725 01:15:44.188685 24815 leveldb.cpp:273] Iterated through 1 keys in the db in 51061ns
I0725 01:15:44.188738 24815 replica.cpp:744] Replica recovered with log positions 0 -> 0 with 1 holes and 0 unlearned
I0725 01:15:44.189414 24847 recover.cpp:449] Starting replica recovery
I0725 01:15:44.189688 24847 recover.cpp:475] Replica is in VOTING status
I0725 01:15:44.189820 24847 recover.cpp:464] Recover process terminated
I0725 01:15:44.192489 24847 registrar.cpp:313] Recovering registrar
[ OK ] Strict/RegistrarTest.FetchTimeout/0 (45 ms)
[ RUN ] Strict/RegistrarTest.FetchTimeout/1
Using temporary directory '/tmp/Strict_RegistrarTest_FetchTimeout_1_aNte1o'
I0725 01:15:44.219058 24815 leveldb.cpp:176] Opened db in 1.937351ms
I0725 01:15:44.219801 24815 leveldb.cpp:183] Compacted db in 712801ns
I0725 01:15:44.219847 24815 leveldb.cpp:198] Created db iterator in 36904ns
I0725 01:15:44.219877 24815 leveldb.cpp:204] Seeked to beginning of db in 12375ns
I0725 01:15:44.219894 24815 leveldb.cpp:273] Iterated through 0 keys in the db in 9638ns
I0725 01:15:44.219949 24815 replica.cpp:744] Replica recovered with log positions 0 -> 0 with 1 holes and 0 unlearned
I0725 01:15:44.221112 24837 leveldb.cpp:306] Persisting metadata (8 bytes) to leveldb took 537839ns
I0725 01:15:44.221146 24837 replica.cpp:323] Persisted replica status to VOTING
I0725 01:15:44.223613 24815 leveldb.cpp:176] Opened db in 1.952677ms
I0725 01:15:44.224318 24815 leveldb.cpp:183] Compacted db in 685866ns
I0725 01:15:44.224361 24815 leveldb.cpp:198] Created db iterator in 26997ns
I0725 01:15:44.224383 24815 leveldb.cpp:204] Seeked to beginning of db in 10767ns
I0725 01:15:44.224397 24815 leveldb.cpp:273] Iterated through 0 keys in the db in 8262ns
I0725 01:15:44.224458 24815 replica.cpp:744] Replica recovered with log positions 0 -> 0 with 1 holes and 0 unlearned
I0725 01:15:44.225198 24847 leveldb.cpp:306] Persisting metadata (8 bytes) to leveldb took 380571ns
I0725 01:15:44.225221 24847 replica.cpp:323] Persisted replica status to VOTING
I0725 01:15:44.227542 24815 leveldb.cpp:176] Opened db in 1.926715ms
I0725 01:15:44.229285 24815 leveldb.cpp:183] Compacted db in 1.72614ms
I0725 01:15:44.229329 24815 leveldb.cpp:198] Created db iterator in 23582ns
I0725 01:15:44.229360 24815 leveldb.cpp:204] Seeked to beginning of db in 28339ns
I0725 01:15:44.229418 24815 leveldb.cpp:273] Iterated through 1 keys in the db in 49423ns
I0725 01:15:44.229470 24815 replica.cpp:744] Replica recovered with log positions 0 -> 0 with 1 holes and 0 unlearned
I0725 01:15:44.231752 24815 leveldb.cpp:176] Opened db in 2.103385ms
I0725 01:15:44.233585 24815 leveldb.cpp:183] Compacted db in 1.814895ms
I0725 01:15:44.233633 24815 leveldb.cpp:198] Created db iterator in 29689ns
I0725 01:15:44.233681 24815 leveldb.cpp:204] Seeked to beginning of db in 34023ns
I0725 01:15:44.233726 24815 leveldb.cpp:273] Iterated through 1 keys in the db in 36601ns
I0725 01:15:44.233772 24815 replica.cpp:744] Replica recovered with log positions 0 -> 0 with 1 holes and 0 unlearned
I0725 01:15:44.234302 24836 recover.cpp:449] Starting replica recovery
I0725 01:15:44.234751 24836 recover.cpp:475] Replica is in VOTING status
I0725 01:15:44.234941 24836 recover.cpp:464] Recover process terminated
I0725 01:15:44.236884 24836 registrar.cpp:313] Recovering registrar
[ OK ] Strict/RegistrarTest.FetchTimeout/1 (46 ms)
[ RUN ] Strict/RegistrarTest.StoreTimeout/0
Using temporary directory '/tmp/Strict_RegistrarTest_StoreTimeout_0_NWsNxt'
I0725 01:15:44.265707 24815 leveldb.cpp:176] Opened db in 2.180437ms
I0725 01:15:44.266662 24815 leveldb.cpp:183] Compacted db in 925335ns
I0725 01:15:44.266710 24815 leveldb.cpp:198] Created db iterator in 30828ns
I0725 01:15:44.266734 24815 leveldb.cpp:204] Seeked to beginning of db in 11745ns
I0725 01:15:44.266747 24815 leveldb.cpp:273] Iterated through 0 keys in the db in 6853ns
I0725 01:15:44.266800 24815 replica.cpp:744] Replica recovered with log positions 0 -> 0 with 1 holes and 0 unlearned
I0725 01:15:44.267959 24845 leveldb.cpp:306] Persisting metadata (8 bytes) to leveldb took 453152ns
I0725 01:15:44.268002 24845 replica.cpp:323] Persisted replica status to VOTING
I0725 01:15:44.272660 24815 leveldb.cpp:176] Opened db in 1.919647ms
I0725 01:15:44.273305 24815 leveldb.cpp:183] Compacted db in 618120ns
I0725 01:15:44.273362 24815 leveldb.cpp:198] Created db iterator in 45312ns
I0725 01:15:44.273388 24815 leveldb.cpp:204] Seeked to beginning of db in 47102ns
I0725 01:15:44.273586 24815 leveldb.cpp:273] Iterated through 0 keys in the db in 21191ns
I0725 01:15:44.273653 24815 replica.cpp:744] Replica recovered with log positions 0 -> 0 with 1 holes and 0 unlearned
I0725 01:15:44.274698 24843 leveldb.cpp:306] Persisting metadata (8 bytes) to leveldb took 474098ns
I0725 01:15:44.274724 24843 replica.cpp:323] Persisted replica status to VOTING
I0725 01:15:44.277128 24815 leveldb.cpp:176] Opened db in 1.867262ms
I0725 01:15:44.278736 24815 leveldb.cpp:183] Compacted db in 1.584482ms
I0725 01:15:44.278791 24815 leveldb.cpp:198] Created db iterator in 33321ns
I0725 01:15:44.278834 24815 leveldb.cpp:204] Seeked to beginning of db in 32315ns
I0725 01:15:44.278919 24815 leveldb.cpp:273] Iterated through 1 keys in the db in 77282ns
I0725 01:15:44.279000 24815 replica.cpp:744] Replica recovered with log positions 0 -> 0 with 1 holes and 0 unlearned
I0725 01:15:44.281086 24815 leveldb.cpp:176] Opened db in 1.86856ms
I0725 01:15:44.282675 24815 leveldb.cpp:183] Compacted db in 1.57014ms
I0725 01:15:44.282734 24815 leveldb.cpp:198] Created db iterator in 46264ns
I0725 01:15:44.282798 24815 leveldb.cpp:204] Seeked to beginning of db in 45560ns
I0725 01:15:44.282846 24815 leveldb.cpp:273] Iterated through 1 keys in the db in 38858ns
I0725 01:15:44.282948 24815 replica.cpp:744] Replica recovered with log positions 0 -> 0 with 1 holes and 0 unlearned
I0725 01:15:44.283512 24841 recover.cpp:449] Starting replica recovery
I0725 01:15:44.283769 24841 recover.cpp:475] Replica is in VOTING status
I0725 01:15:44.283900 24841 recover.cpp:464] Recover process terminated
I0725 01:15:44.285866 24838 registrar.cpp:313] Recovering registrar
I0725 01:15:44.288185 24838 registrar.cpp:346] Successfully fetched the registry (0B) in 0ns
I0725 01:15:44.288295 24838 registrar.cpp:445] Applied 1 operations in 40519ns; attempting to update the 'registry'
E0725 01:15:44.297751 24834 registrar.cpp:512] Registrar aborting: Failed to update 'registry': Failed to perform store within 10secs
[ OK ] Strict/RegistrarTest.StoreTimeout/0 (47 ms)
[ RUN ] Strict/RegistrarTest.StoreTimeout/1
Using temporary directory '/tmp/Strict_RegistrarTest_StoreTimeout_1_rlf2by'
I0725 01:15:44.313058 24815 leveldb.cpp:176] Opened db in 2.274055ms
I0725 01:15:44.314002 24815 leveldb.cpp:183] Compacted db in 909682ns
I0725 01:15:44.314054 24815 leveldb.cpp:198] Created db iterator in 32194ns
I0725 01:15:44.314070 24815 leveldb.cpp:204] Seeked to beginning of db in 7636ns
I0725 01:15:44.314079 24815 leveldb.cpp:273] Iterated through 0 keys in the db in 4582ns
I0725 01:15:44.314131 24815 replica.cpp:744] Replica recovered with log positions 0 -> 0 with 1 holes and 0 unlearned
I0725 01:15:44.315047 24833 leveldb.cpp:306] Persisting metadata (8 bytes) to leveldb took 485358ns
I0725 01:15:44.315109 24833 replica.cpp:323] Persisted replica status to VOTING
I0725 01:15:44.317586 24815 leveldb.cpp:176] Opened db in 1.773797ms
I0725 01:15:44.318284 24815 leveldb.cpp:183] Compacted db in 668331ns
I0725 01:15:44.318326 24815 leveldb.cpp:198] Created db iterator in 26935ns
I0725 01:15:44.318344 24815 leveldb.cpp:204] Seeked to beginning of db in 10745ns
I0725 01:15:44.318356 24815 leveldb.cpp:273] Iterated through 0 keys in the db in 5224ns
I0725 01:15:44.318399 24815 replica.cpp:744] Replica recovered with log positions 0 -> 0 with 1 holes and 0 unlearned
I0725 01:15:44.319178 24846 leveldb.cpp:306] Persisting metadata (8 bytes) to leveldb took 407520ns
I0725 01:15:44.319211 24846 replica.cpp:323] Persisted replica status to VOTING
I0725 01:15:44.321741 24815 leveldb.cpp:176] Opened db in 1.977989ms
I0725 01:15:44.323755 24815 leveldb.cpp:183] Compacted db in 1.985544ms
I0725 01:15:44.323814 24815 leveldb.cpp:198] Created db iterator in 38686ns
I0725 01:15:44.323866 24815 leveldb.cpp:204] Seeked to beginning of db in 40444ns
I0725 01:15:44.323935 24815 leveldb.cpp:273] Iterated through 1 keys in the db in 57996ns
I0725 01:15:44.323995 24815 replica.cpp:744] Replica recovered with log positions 0 -> 0 with 1 holes and 0 unlearned
I0725 01:15:44.326264 24815 leveldb.cpp:176] Opened db in 2.030044ms
I0725 01:15:44.328104 24815 leveldb.cpp:183] Compacted db in 1.818721ms
I0725 01:15:44.328161 24815 leveldb.cpp:198] Created db iterator in 32426ns
I0725 01:15:44.328193 24815 leveldb.cpp:204] Seeked to beginning of db in 29370ns
I0725 01:15:44.328258 24815 leveldb.cpp:273] Iterated through 1 keys in the db in 55015ns
I0725 01:15:44.328322 24815 replica.cpp:744] Replica recovered with log positions 0 -> 0 with 1 holes and 0 unlearned
I0725 01:15:44.328991 24835 recover.cpp:449] Starting replica recovery
I0725 01:15:44.329270 24835 recover.cpp:475] Replica is in VOTING status
I0725 01:15:44.329406 24835 recover.cpp:464] Recover process terminated
I0725 01:15:44.331977 24846 registrar.cpp:313] Recovering registrar
I0725 01:15:44.334348 24846 registrar.cpp:346] Successfully fetched the registry (0B) in 0ns
I0725 01:15:44.334589 24846 registrar.cpp:445] Applied 1 operations in 52520ns; attempting to update the 'registry'
E0725 01:15:44.343705 24848 registrar.cpp:512] Registrar aborting: Failed to update 'registry': Failed to perform store within 10secs
[ OK ] Strict/RegistrarTest.StoreTimeout/1 (46 ms)
[ RUN ] Strict/RegistrarTest.Abort/0
Using temporary directory '/tmp/Strict_RegistrarTest_Abort_0_o4zHXC'
I0725 01:15:44.358657 24815 leveldb.cpp:176] Opened db in 2.094491ms
I0725 01:15:44.359529 24815 leveldb.cpp:183] Compacted db in 850323ns
I0725 01:15:44.359596 24815 leveldb.cpp:198] Created db iterator in 29709ns
I0725 01:15:44.359608 24815 leveldb.cpp:204] Seeked to beginning of db in 6154ns
I0725 01:15:44.359616 24815 leveldb.cpp:273] Iterated through 0 keys in the db in 4737ns
I0725 01:15:44.359668 24815 replica.cpp:744] Replica recovered with log positions 0 -> 0 with 1 holes and 0 unlearned
I0725 01:15:44.360534 24839 leveldb.cpp:306] Persisting metadata (8 bytes) to leveldb took 465730ns
I0725 01:15:44.360568 24839 replica.cpp:323] Persisted replica status to VOTING
I0725 01:15:44.363234 24815 leveldb.cpp:176] Opened db in 2.122743ms
I0725 01:15:44.363970 24815 leveldb.cpp:183] Compacted db in 695562ns
I0725 01:15:44.364019 24815 leveldb.cpp:198] Created db iterator in 32953ns
I0725 01:15:44.364044 24815 leveldb.cpp:204] Seeked to beginning of db in 11363ns
I0725 01:15:44.364063 24815 leveldb.cpp:273] Iterated through 0 keys in the db in 8819ns
I0725 01:15:44.364110 24815 replica.cpp:744] Replica recovered with log positions 0 -> 0 with 1 holes and 0 unlearned
I0725 01:15:44.365056 24847 leveldb.cpp:306] Persisting metadata (8 bytes) to leveldb took 401342ns
I0725 01:15:44.365082 24847 replica.cpp:323] Persisted replica status to VOTING
I0725 01:15:44.367640 24815 leveldb.cpp:176] Opened db in 2.007813ms
I0725 01:15:44.369894 24815 leveldb.cpp:183] Compacted db in 2.220102ms
I0725 01:15:44.369958 24815 leveldb.cpp:198] Created db iterator in 42386ns
I0725 01:15:44.370053 24815 leveldb.cpp:204] Seeked to beginning of db in 38812ns
I0725 01:15:44.370116 24815 leveldb.cpp:273] Iterated through 1 keys in the db in 55105ns
I0725 01:15:44.370250 24815 replica.cpp:744] Replica recovered with log positions 0 -> 0 with 1 holes and 0 unlearned
I0725 01:15:44.372854 24815 leveldb.cpp:176] Opened db in 2.30924ms
I0725 01:15:44.374794 24815 leveldb.cpp:183] Compacted db in 1.914619ms
I0725 01:15:44.374848 24815 leveldb.cpp:198] Created db iterator in 31431ns
I0725 01:15:44.374891 24815 leveldb.cpp:204] Seeked to beginning of db in 32660ns
I0725 01:15:44.374948 24815 leveldb.cpp:273] Iterated through 1 keys in the db in 47902ns
I0725 01:15:44.375006 24815 replica.cpp:744] Replica recovered with log positions 0 -> 0 with 1 holes and 0 unlearned
I0725 01:15:44.375771 24835 recover.cpp:449] Starting replica recovery
I0725 01:15:44.376039 24835 recover.cpp:475] Replica is in VOTING status
I0725 01:15:44.376160 24835 recover.cpp:464] Recover process terminated
I0725 01:15:44.378584 24837 registrar.cpp:313] Recovering registrar
I0725 01:15:44.380849 24837 registrar.cpp:346] Successfully fetched the registry (0B) in 2.2272ms
I0725 01:15:44.380964 24837 registrar.cpp:445] Applied 1 operations in 38064ns; attempting to update the 'registry'
I0725 01:15:44.383137 24837 registrar.cpp:490] Successfully updated the 'registry' in 2.115072ms
I0725 01:15:44.383236 24837 registrar.cpp:376] Successfully recovered registrar
I0725 01:15:44.383802 24837 registrar.cpp:445] Applied 1 operations in 43798ns; attempting to update the 'registry'
E0725 01:15:44.385860 24837 registrar.cpp:512] Registrar aborting: Failed to update 'registry': failure
[ OK ] Strict/RegistrarTest.Abort/0 (33 ms)
[ RUN ] Strict/RegistrarTest.Abort/1
Using temporary directory '/tmp/Strict_RegistrarTest_Abort_1_7S8LOH'
I0725 01:15:44.392179 24815 leveldb.cpp:176] Opened db in 2.325718ms
I0725 01:15:44.393024 24815 leveldb.cpp:183] Compacted db in 834597ns
I0725 01:15:44.393097 24815 leveldb.cpp:198] Created db iterator in 32999ns
I0725 01:15:44.393112 24815 leveldb.cpp:204] Seeked to beginning of db in 6539ns
I0725 01:15:44.393121 24815 leveldb.cpp:273] Iterated through 0 keys in the db in 4512ns
I0725 01:15:44.393169 24815 replica.cpp:744] Replica recovered with log positions 0 -> 0 with 1 holes and 0 unlearned
I0725 01:15:44.394217 24841 leveldb.cpp:306] Persisting metadata (8 bytes) to leveldb took 441920ns
I0725 01:15:44.394248 24841 replica.cpp:323] Persisted replica status to VOTING
I0725 01:15:44.396698 24815 leveldb.cpp:176] Opened db in 1.935361ms
I0725 01:15:44.397604 24815 leveldb.cpp:183] Compacted db in 891024ns
I0725 01:15:44.397678 24815 leveldb.cpp:198] Created db iterator in 32953ns
I0725 01:15:44.397693 24815 leveldb.cpp:204] Seeked to beginning of db in 6222ns
I0725 01:15:44.397701 24815 leveldb.cpp:273] Iterated through 0 keys in the db in 4600ns
I0725 01:15:44.397747 24815 replica.cpp:744] Replica recovered with log positions 0 -> 0 with 1 holes and 0 unlearned
I0725 01:15:44.398591 24838 leveldb.cpp:306] Persisting metadata (8 bytes) to leveldb took 405167ns
I0725 01:15:44.398620 24838 replica.cpp:323] Persisted replica status to VOTING
I0725 01:15:44.401034 24815 leveldb.cpp:176] Opened db in 2.007379ms
I0725 01:15:44.403199 24815 leveldb.cpp:183] Compacted db in 2.153619ms
I0725 01:15:44.403286 24815 leveldb.cpp:198] Created db iterator in 36510ns
I0725 01:15:44.403316 24815 leveldb.cpp:204] Seeked to beginning of db in 21082ns
I0725 01:15:44.403365 24815 leveldb.cpp:273] Iterated through 1 keys in the db in 45671ns
I0725 01:15:44.403416 24815 replica.cpp:744] Replica recovered with log positions 0 -> 0 with 1 holes and 0 unlearned
I0725 01:15:44.405697 24815 leveldb.cpp:176] Opened db in 1.987696ms
I0725 01:15:44.407449 24815 leveldb.cpp:183] Compacted db in 1.732685ms
I0725 01:15:44.407505 24815 leveldb.cpp:198] Created db iterator in 31974ns
I0725 01:15:44.407539 24815 leveldb.cpp:204] Seeked to beginning of db in 28346ns
I0725 01:15:44.407608 24815 leveldb.cpp:273] Iterated through 1 keys in the db in 61179ns
I0725 01:15:44.407675 24815 replica.cpp:744] Replica recovered with log positions 0 -> 0 with 1 holes and 0 unlearned
I0725 01:15:44.408309 24848 recover.cpp:449] Starting replica recovery
I0725 01:15:44.408592 24848 recover.cpp:475] Replica is in VOTING status
I0725 01:15:44.408738 24848 recover.cpp:464] Recover process terminated
I0725 01:15:44.411092 24846 registrar.cpp:313] Recovering registrar
I0725 01:15:44.414173 24846 registrar.cpp:346] Successfully fetched the registry (0B) in 3.041024ms
I0725 01:15:44.414304 24846 registrar.cpp:445] Applied 1 operations in 41912ns; attempting to update the 'registry'
I0725 01:15:44.417557 24846 registrar.cpp:490] Successfully updated the 'registry' in 3.19104ms
I0725 01:15:44.417676 24846 registrar.cpp:376] Successfully recovered registrar
I0725 01:15:44.418450 24846 registrar.cpp:445] Applied 1 operations in 73979ns; attempting to update the 'registry'
E0725 01:15:44.420547 24846 registrar.cpp:512] Registrar aborting: Failed to update 'registry': failure
[ OK ] Strict/RegistrarTest.Abort/1 (36 ms)
[----------] 16 tests from Strict/RegistrarTest (987 ms total)
[----------] Global test environment tear-down
[==========] 681 tests from 97 test cases ran. (284067 ms total)
[ PASSED ] 680 tests.
[ FAILED ] 1 test, listed below:
[ FAILED ] SchedulerDriverEventTest.SubscribedSchedulerFailover
1 FAILED TEST
YOU HAVE 12 DISABLED TESTS
make[4]: *** [check-local] Error 1
Makefile:7686: recipe for target 'check-local' failed
make[4]: Leaving directory '/mesos/mesos-0.24.0/_build/src'
Makefile:7133: recipe for target 'check-am' failed
make[3]: Leaving directory '/mesos/mesos-0.24.0/_build/src'
make[3]: *** [check-am] Error 2
Makefile:7137: recipe for target 'check' failed
make[2]: Leaving directory '/mesos/mesos-0.24.0/_build/src'
make[2]: *** [check] Error 2
Makefile:667: recipe for target 'check-recursive' failed
make[1]: Leaving directory '/mesos/mesos-0.24.0/_build'
make[1]: *** [check-recursive] Error 1
make: *** [distcheck] Error 1
Makefile:873: recipe for target 'distcheck' failed
+ docker rmi mesos-1437785570-27565
Untagged: mesos-1437785570-27565:latest
Deleted: da428b19d12a54c177cc780f57a03023118860cd1f391ad5a4c36bc9ea1194a5
Deleted: f27e77cdc8d024433a64cb5b8c06b0815c59fcd0396b2e156fe8383412f9c407
Deleted: 18521a59b035abf17bd642400550e5cbca14c558478884304afb75af0911e1f8
Deleted: 2be51fb23bd7e7ecee67773659b724c5f3729cbf058c5d8df639146bc94d0f4c
Deleted: 4ffb4141a08fd9607d5dd02a6f2b213ca4048fdf39ddb4cbd6d996004745431f
Deleted: 59aa8540fb2ef7d673b0d4fc72b21600bedd54fdd48f404d84d73d3bc7611600
Deleted: 38d44e1597196beec7f5ae605cc4449b016124ef5985d50d4694b216959a75d0
Deleted: bb87f77434d803ed32d182b088f8e47d93360c09c0a8431fd97c82dac47f5645
Deleted: e80b85d8c360d5ce4bdaf0e09526810b7a83f4802f905a5663eb428b794fb70d
Deleted: dc7c468e15b8e310bc0985e34d658629ca5ad6fd9704b01eaf912f180710878b
Deleted: 6a5177c1c9a191eea6803ba2cdfde61f08649d83e55124569762fffb4818fa72
Deleted: e8373809796f6f1f82b5696e01f3374e8dd21390d7b389bdeae9df84ff713e63
Build step 'Execute shell' marked build as failure
Re: Build failed in Jenkins: Mesos » clang,docker||Hadoop,ubuntu:14.10 #573
Posted by Benjamin Mahler <be...@gmail.com>.
Thanks!
On Mon, Jul 27, 2015 at 10:33 AM, Vinod Kone <vi...@gmail.com> wrote:
> pushed the fix
>
> fe02e02cf7aa2363e808d6706874076156949c79
>
> On Fri, Jul 24, 2015 at 6:15 PM, Apache Jenkins Server <
> jenkins@builds.apache.org> wrote:
>
> > See <
> >
> https://builds.apache.org/job/Mesos/COMPILER=clang,LABEL=docker%7C%7CHadoop,OS=ubuntu%3A14.10/573/changes
> > >
> >
> > Changes:
> >
> > [vinodkone] Updated slave to always set task status's uuid in status
> > update.
> >
> > [vinodkone] Added address field to MasterInfo.
> >
> > ------------------------------------------
> > [...truncated 115626 lines...]
> > I0725 01:15:44.184327 24815 leveldb.cpp:183] Compacted db in 1.817837ms
> > I0725 01:15:44.184386 24815 leveldb.cpp:198] Created db iterator in
> 42297ns
> > I0725 01:15:44.184453 24815 leveldb.cpp:204] Seeked to beginning of db in
> > 47211ns
> > I0725 01:15:44.184509 24815 leveldb.cpp:273] Iterated through 1 keys in
> > the db in 47012ns
> > I0725 01:15:44.184604 24815 replica.cpp:744] Replica recovered with log
> > positions 0 -> 0 with 1 holes and 0 unlearned
> > I0725 01:15:44.186630 24815 leveldb.cpp:176] Opened db in 1.83977ms
> > I0725 01:15:44.188418 24815 leveldb.cpp:183] Compacted db in 1.77013ms
> > I0725 01:15:44.188483 24815 leveldb.cpp:198] Created db iterator in
> 31997ns
> > I0725 01:15:44.188608 24815 leveldb.cpp:204] Seeked to beginning of db in
> > 80129ns
> > I0725 01:15:44.188685 24815 leveldb.cpp:273] Iterated through 1 keys in
> > the db in 51061ns
> > I0725 01:15:44.188738 24815 replica.cpp:744] Replica recovered with log
> > positions 0 -> 0 with 1 holes and 0 unlearned
> > I0725 01:15:44.189414 24847 recover.cpp:449] Starting replica recovery
> > I0725 01:15:44.189688 24847 recover.cpp:475] Replica is in VOTING status
> > I0725 01:15:44.189820 24847 recover.cpp:464] Recover process terminated
> > I0725 01:15:44.192489 24847 registrar.cpp:313] Recovering registrar
> > [ OK ] Strict/RegistrarTest.FetchTimeout/0 (45 ms)
> > [ RUN ] Strict/RegistrarTest.FetchTimeout/1
> > Using temporary directory
> '/tmp/Strict_RegistrarTest_FetchTimeout_1_aNte1o'
> > I0725 01:15:44.219058 24815 leveldb.cpp:176] Opened db in 1.937351ms
> > I0725 01:15:44.219801 24815 leveldb.cpp:183] Compacted db in 712801ns
> > I0725 01:15:44.219847 24815 leveldb.cpp:198] Created db iterator in
> 36904ns
> > I0725 01:15:44.219877 24815 leveldb.cpp:204] Seeked to beginning of db in
> > 12375ns
> > I0725 01:15:44.219894 24815 leveldb.cpp:273] Iterated through 0 keys in
> > the db in 9638ns
> > I0725 01:15:44.219949 24815 replica.cpp:744] Replica recovered with log
> > positions 0 -> 0 with 1 holes and 0 unlearned
> > I0725 01:15:44.221112 24837 leveldb.cpp:306] Persisting metadata (8
> bytes)
> > to leveldb took 537839ns
> > I0725 01:15:44.221146 24837 replica.cpp:323] Persisted replica status to
> > VOTING
> > I0725 01:15:44.223613 24815 leveldb.cpp:176] Opened db in 1.952677ms
> > I0725 01:15:44.224318 24815 leveldb.cpp:183] Compacted db in 685866ns
> > I0725 01:15:44.224361 24815 leveldb.cpp:198] Created db iterator in
> 26997ns
> > I0725 01:15:44.224383 24815 leveldb.cpp:204] Seeked to beginning of db in
> > 10767ns
> > I0725 01:15:44.224397 24815 leveldb.cpp:273] Iterated through 0 keys in
> > the db in 8262ns
> > I0725 01:15:44.224458 24815 replica.cpp:744] Replica recovered with log
> > positions 0 -> 0 with 1 holes and 0 unlearned
> > I0725 01:15:44.225198 24847 leveldb.cpp:306] Persisting metadata (8
> bytes)
> > to leveldb took 380571ns
> > I0725 01:15:44.225221 24847 replica.cpp:323] Persisted replica status to
> > VOTING
> > I0725 01:15:44.227542 24815 leveldb.cpp:176] Opened db in 1.926715ms
> > I0725 01:15:44.229285 24815 leveldb.cpp:183] Compacted db in 1.72614ms
> > I0725 01:15:44.229329 24815 leveldb.cpp:198] Created db iterator in
> 23582ns
> > I0725 01:15:44.229360 24815 leveldb.cpp:204] Seeked to beginning of db in
> > 28339ns
> > I0725 01:15:44.229418 24815 leveldb.cpp:273] Iterated through 1 keys in
> > the db in 49423ns
> > I0725 01:15:44.229470 24815 replica.cpp:744] Replica recovered with log
> > positions 0 -> 0 with 1 holes and 0 unlearned
> > I0725 01:15:44.231752 24815 leveldb.cpp:176] Opened db in 2.103385ms
> > I0725 01:15:44.233585 24815 leveldb.cpp:183] Compacted db in 1.814895ms
> > I0725 01:15:44.233633 24815 leveldb.cpp:198] Created db iterator in
> 29689ns
> > I0725 01:15:44.233681 24815 leveldb.cpp:204] Seeked to beginning of db in
> > 34023ns
> > I0725 01:15:44.233726 24815 leveldb.cpp:273] Iterated through 1 keys in
> > the db in 36601ns
> > I0725 01:15:44.233772 24815 replica.cpp:744] Replica recovered with log
> > positions 0 -> 0 with 1 holes and 0 unlearned
> > I0725 01:15:44.234302 24836 recover.cpp:449] Starting replica recovery
> > I0725 01:15:44.234751 24836 recover.cpp:475] Replica is in VOTING status
> > I0725 01:15:44.234941 24836 recover.cpp:464] Recover process terminated
> > I0725 01:15:44.236884 24836 registrar.cpp:313] Recovering registrar
> > [ OK ] Strict/RegistrarTest.FetchTimeout/1 (46 ms)
> > [ RUN ] Strict/RegistrarTest.StoreTimeout/0
> > Using temporary directory
> '/tmp/Strict_RegistrarTest_StoreTimeout_0_NWsNxt'
> > I0725 01:15:44.265707 24815 leveldb.cpp:176] Opened db in 2.180437ms
> > I0725 01:15:44.266662 24815 leveldb.cpp:183] Compacted db in 925335ns
> > I0725 01:15:44.266710 24815 leveldb.cpp:198] Created db iterator in
> 30828ns
> > I0725 01:15:44.266734 24815 leveldb.cpp:204] Seeked to beginning of db in
> > 11745ns
> > I0725 01:15:44.266747 24815 leveldb.cpp:273] Iterated through 0 keys in
> > the db in 6853ns
> > I0725 01:15:44.266800 24815 replica.cpp:744] Replica recovered with log
> > positions 0 -> 0 with 1 holes and 0 unlearned
> > I0725 01:15:44.267959 24845 leveldb.cpp:306] Persisting metadata (8
> bytes)
> > to leveldb took 453152ns
> > I0725 01:15:44.268002 24845 replica.cpp:323] Persisted replica status to
> > VOTING
> > I0725 01:15:44.272660 24815 leveldb.cpp:176] Opened db in 1.919647ms
> > I0725 01:15:44.273305 24815 leveldb.cpp:183] Compacted db in 618120ns
> > I0725 01:15:44.273362 24815 leveldb.cpp:198] Created db iterator in
> 45312ns
> > I0725 01:15:44.273388 24815 leveldb.cpp:204] Seeked to beginning of db in
> > 47102ns
> > I0725 01:15:44.273586 24815 leveldb.cpp:273] Iterated through 0 keys in
> > the db in 21191ns
> > I0725 01:15:44.273653 24815 replica.cpp:744] Replica recovered with log
> > positions 0 -> 0 with 1 holes and 0 unlearned
> > I0725 01:15:44.274698 24843 leveldb.cpp:306] Persisting metadata (8
> bytes)
> > to leveldb took 474098ns
> > I0725 01:15:44.274724 24843 replica.cpp:323] Persisted replica status to
> > VOTING
> > I0725 01:15:44.277128 24815 leveldb.cpp:176] Opened db in 1.867262ms
> > I0725 01:15:44.278736 24815 leveldb.cpp:183] Compacted db in 1.584482ms
> > I0725 01:15:44.278791 24815 leveldb.cpp:198] Created db iterator in
> 33321ns
> > I0725 01:15:44.278834 24815 leveldb.cpp:204] Seeked to beginning of db in
> > 32315ns
> > I0725 01:15:44.278919 24815 leveldb.cpp:273] Iterated through 1 keys in
> > the db in 77282ns
> > I0725 01:15:44.279000 24815 replica.cpp:744] Replica recovered with log
> > positions 0 -> 0 with 1 holes and 0 unlearned
> > I0725 01:15:44.281086 24815 leveldb.cpp:176] Opened db in 1.86856ms
> > I0725 01:15:44.282675 24815 leveldb.cpp:183] Compacted db in 1.57014ms
> > I0725 01:15:44.282734 24815 leveldb.cpp:198] Created db iterator in
> 46264ns
> > I0725 01:15:44.282798 24815 leveldb.cpp:204] Seeked to beginning of db in
> > 45560ns
> > I0725 01:15:44.282846 24815 leveldb.cpp:273] Iterated through 1 keys in
> > the db in 38858ns
> > I0725 01:15:44.282948 24815 replica.cpp:744] Replica recovered with log
> > positions 0 -> 0 with 1 holes and 0 unlearned
> > I0725 01:15:44.283512 24841 recover.cpp:449] Starting replica recovery
> > I0725 01:15:44.283769 24841 recover.cpp:475] Replica is in VOTING status
> > I0725 01:15:44.283900 24841 recover.cpp:464] Recover process terminated
> > I0725 01:15:44.285866 24838 registrar.cpp:313] Recovering registrar
> > I0725 01:15:44.288185 24838 registrar.cpp:346] Successfully fetched the
> > registry (0B) in 0ns
> > I0725 01:15:44.288295 24838 registrar.cpp:445] Applied 1 operations in
> > 40519ns; attempting to update the 'registry'
> > E0725 01:15:44.297751 24834 registrar.cpp:512] Registrar aborting: Failed
> > to update 'registry': Failed to perform store within 10secs
> > [ OK ] Strict/RegistrarTest.StoreTimeout/0 (47 ms)
> > [ RUN ] Strict/RegistrarTest.StoreTimeout/1
> > Using temporary directory
> '/tmp/Strict_RegistrarTest_StoreTimeout_1_rlf2by'
> > I0725 01:15:44.313058 24815 leveldb.cpp:176] Opened db in 2.274055ms
> > I0725 01:15:44.314002 24815 leveldb.cpp:183] Compacted db in 909682ns
> > I0725 01:15:44.314054 24815 leveldb.cpp:198] Created db iterator in
> 32194ns
> > I0725 01:15:44.314070 24815 leveldb.cpp:204] Seeked to beginning of db in
> > 7636ns
> > I0725 01:15:44.314079 24815 leveldb.cpp:273] Iterated through 0 keys in
> > the db in 4582ns
> > I0725 01:15:44.314131 24815 replica.cpp:744] Replica recovered with log
> > positions 0 -> 0 with 1 holes and 0 unlearned
> > I0725 01:15:44.315047 24833 leveldb.cpp:306] Persisting metadata (8
> bytes)
> > to leveldb took 485358ns
> > I0725 01:15:44.315109 24833 replica.cpp:323] Persisted replica status to
> > VOTING
> > I0725 01:15:44.317586 24815 leveldb.cpp:176] Opened db in 1.773797ms
> > I0725 01:15:44.318284 24815 leveldb.cpp:183] Compacted db in 668331ns
> > I0725 01:15:44.318326 24815 leveldb.cpp:198] Created db iterator in
> 26935ns
> > I0725 01:15:44.318344 24815 leveldb.cpp:204] Seeked to beginning of db in
> > 10745ns
> > I0725 01:15:44.318356 24815 leveldb.cpp:273] Iterated through 0 keys in
> > the db in 5224ns
> > I0725 01:15:44.318399 24815 replica.cpp:744] Replica recovered with log
> > positions 0 -> 0 with 1 holes and 0 unlearned
> > I0725 01:15:44.319178 24846 leveldb.cpp:306] Persisting metadata (8
> bytes)
> > to leveldb took 407520ns
> > I0725 01:15:44.319211 24846 replica.cpp:323] Persisted replica status to
> > VOTING
> > I0725 01:15:44.321741 24815 leveldb.cpp:176] Opened db in 1.977989ms
> > I0725 01:15:44.323755 24815 leveldb.cpp:183] Compacted db in 1.985544ms
> > I0725 01:15:44.323814 24815 leveldb.cpp:198] Created db iterator in
> 38686ns
> > I0725 01:15:44.323866 24815 leveldb.cpp:204] Seeked to beginning of db in
> > 40444ns
> > I0725 01:15:44.323935 24815 leveldb.cpp:273] Iterated through 1 keys in
> > the db in 57996ns
> > I0725 01:15:44.323995 24815 replica.cpp:744] Replica recovered with log
> > positions 0 -> 0 with 1 holes and 0 unlearned
> > I0725 01:15:44.326264 24815 leveldb.cpp:176] Opened db in 2.030044ms
> > I0725 01:15:44.328104 24815 leveldb.cpp:183] Compacted db in 1.818721ms
> > I0725 01:15:44.328161 24815 leveldb.cpp:198] Created db iterator in
> 32426ns
> > I0725 01:15:44.328193 24815 leveldb.cpp:204] Seeked to beginning of db in
> > 29370ns
> > I0725 01:15:44.328258 24815 leveldb.cpp:273] Iterated through 1 keys in
> > the db in 55015ns
> > I0725 01:15:44.328322 24815 replica.cpp:744] Replica recovered with log
> > positions 0 -> 0 with 1 holes and 0 unlearned
> > I0725 01:15:44.328991 24835 recover.cpp:449] Starting replica recovery
> > I0725 01:15:44.329270 24835 recover.cpp:475] Replica is in VOTING status
> > I0725 01:15:44.329406 24835 recover.cpp:464] Recover process terminated
> > I0725 01:15:44.331977 24846 registrar.cpp:313] Recovering registrar
> > I0725 01:15:44.334348 24846 registrar.cpp:346] Successfully fetched the
> > registry (0B) in 0ns
> > I0725 01:15:44.334589 24846 registrar.cpp:445] Applied 1 operations in
> > 52520ns; attempting to update the 'registry'
> > E0725 01:15:44.343705 24848 registrar.cpp:512] Registrar aborting: Failed
> > to update 'registry': Failed to perform store within 10secs
> > [ OK ] Strict/RegistrarTest.StoreTimeout/1 (46 ms)
> > [ RUN ] Strict/RegistrarTest.Abort/0
> > Using temporary directory '/tmp/Strict_RegistrarTest_Abort_0_o4zHXC'
> > I0725 01:15:44.358657 24815 leveldb.cpp:176] Opened db in 2.094491ms
> > I0725 01:15:44.359529 24815 leveldb.cpp:183] Compacted db in 850323ns
> > I0725 01:15:44.359596 24815 leveldb.cpp:198] Created db iterator in
> 29709ns
> > I0725 01:15:44.359608 24815 leveldb.cpp:204] Seeked to beginning of db in
> > 6154ns
> > I0725 01:15:44.359616 24815 leveldb.cpp:273] Iterated through 0 keys in
> > the db in 4737ns
> > I0725 01:15:44.359668 24815 replica.cpp:744] Replica recovered with log
> > positions 0 -> 0 with 1 holes and 0 unlearned
> > I0725 01:15:44.360534 24839 leveldb.cpp:306] Persisting metadata (8
> bytes)
> > to leveldb took 465730ns
> > I0725 01:15:44.360568 24839 replica.cpp:323] Persisted replica status to
> > VOTING
> > I0725 01:15:44.363234 24815 leveldb.cpp:176] Opened db in 2.122743ms
> > I0725 01:15:44.363970 24815 leveldb.cpp:183] Compacted db in 695562ns
> > I0725 01:15:44.364019 24815 leveldb.cpp:198] Created db iterator in
> 32953ns
> > I0725 01:15:44.364044 24815 leveldb.cpp:204] Seeked to beginning of db in
> > 11363ns
> > I0725 01:15:44.364063 24815 leveldb.cpp:273] Iterated through 0 keys in
> > the db in 8819ns
> > I0725 01:15:44.364110 24815 replica.cpp:744] Replica recovered with log
> > positions 0 -> 0 with 1 holes and 0 unlearned
> > I0725 01:15:44.365056 24847 leveldb.cpp:306] Persisting metadata (8
> bytes)
> > to leveldb took 401342ns
> > I0725 01:15:44.365082 24847 replica.cpp:323] Persisted replica status to
> > VOTING
> > I0725 01:15:44.367640 24815 leveldb.cpp:176] Opened db in 2.007813ms
> > I0725 01:15:44.369894 24815 leveldb.cpp:183] Compacted db in 2.220102ms
> > I0725 01:15:44.369958 24815 leveldb.cpp:198] Created db iterator in
> 42386ns
> > I0725 01:15:44.370053 24815 leveldb.cpp:204] Seeked to beginning of db in
> > 38812ns
> > I0725 01:15:44.370116 24815 leveldb.cpp:273] Iterated through 1 keys in
> > the db in 55105ns
> > I0725 01:15:44.370250 24815 replica.cpp:744] Replica recovered with log
> > positions 0 -> 0 with 1 holes and 0 unlearned
> > I0725 01:15:44.372854 24815 leveldb.cpp:176] Opened db in 2.30924ms
> > I0725 01:15:44.374794 24815 leveldb.cpp:183] Compacted db in 1.914619ms
> > I0725 01:15:44.374848 24815 leveldb.cpp:198] Created db iterator in
> 31431ns
> > I0725 01:15:44.374891 24815 leveldb.cpp:204] Seeked to beginning of db in
> > 32660ns
> > I0725 01:15:44.374948 24815 leveldb.cpp:273] Iterated through 1 keys in
> > the db in 47902ns
> > I0725 01:15:44.375006 24815 replica.cpp:744] Replica recovered with log
> > positions 0 -> 0 with 1 holes and 0 unlearned
> > I0725 01:15:44.375771 24835 recover.cpp:449] Starting replica recovery
> > I0725 01:15:44.376039 24835 recover.cpp:475] Replica is in VOTING status
> > I0725 01:15:44.376160 24835 recover.cpp:464] Recover process terminated
> > I0725 01:15:44.378584 24837 registrar.cpp:313] Recovering registrar
> > I0725 01:15:44.380849 24837 registrar.cpp:346] Successfully fetched the
> > registry (0B) in 2.2272ms
> > I0725 01:15:44.380964 24837 registrar.cpp:445] Applied 1 operations in
> > 38064ns; attempting to update the 'registry'
> > I0725 01:15:44.383137 24837 registrar.cpp:490] Successfully updated the
> > 'registry' in 2.115072ms
> > I0725 01:15:44.383236 24837 registrar.cpp:376] Successfully recovered
> > registrar
> > I0725 01:15:44.383802 24837 registrar.cpp:445] Applied 1 operations in
> > 43798ns; attempting to update the 'registry'
> > E0725 01:15:44.385860 24837 registrar.cpp:512] Registrar aborting: Failed
> > to update 'registry': failure
> > [ OK ] Strict/RegistrarTest.Abort/0 (33 ms)
> > [ RUN ] Strict/RegistrarTest.Abort/1
> > Using temporary directory '/tmp/Strict_RegistrarTest_Abort_1_7S8LOH'
> > I0725 01:15:44.392179 24815 leveldb.cpp:176] Opened db in 2.325718ms
> > I0725 01:15:44.393024 24815 leveldb.cpp:183] Compacted db in 834597ns
> > I0725 01:15:44.393097 24815 leveldb.cpp:198] Created db iterator in
> 32999ns
> > I0725 01:15:44.393112 24815 leveldb.cpp:204] Seeked to beginning of db in
> > 6539ns
> > I0725 01:15:44.393121 24815 leveldb.cpp:273] Iterated through 0 keys in
> > the db in 4512ns
> > I0725 01:15:44.393169 24815 replica.cpp:744] Replica recovered with log
> > positions 0 -> 0 with 1 holes and 0 unlearned
> > I0725 01:15:44.394217 24841 leveldb.cpp:306] Persisting metadata (8
> bytes)
> > to leveldb took 441920ns
> > I0725 01:15:44.394248 24841 replica.cpp:323] Persisted replica status to
> > VOTING
> > I0725 01:15:44.396698 24815 leveldb.cpp:176] Opened db in 1.935361ms
> > I0725 01:15:44.397604 24815 leveldb.cpp:183] Compacted db in 891024ns
> > I0725 01:15:44.397678 24815 leveldb.cpp:198] Created db iterator in
> 32953ns
> > I0725 01:15:44.397693 24815 leveldb.cpp:204] Seeked to beginning of db in
> > 6222ns
> > I0725 01:15:44.397701 24815 leveldb.cpp:273] Iterated through 0 keys in
> > the db in 4600ns
> > I0725 01:15:44.397747 24815 replica.cpp:744] Replica recovered with log
> > positions 0 -> 0 with 1 holes and 0 unlearned
> > I0725 01:15:44.398591 24838 leveldb.cpp:306] Persisting metadata (8
> bytes)
> > to leveldb took 405167ns
> > I0725 01:15:44.398620 24838 replica.cpp:323] Persisted replica status to
> > VOTING
> > I0725 01:15:44.401034 24815 leveldb.cpp:176] Opened db in 2.007379ms
> > I0725 01:15:44.403199 24815 leveldb.cpp:183] Compacted db in 2.153619ms
> > I0725 01:15:44.403286 24815 leveldb.cpp:198] Created db iterator in
> 36510ns
> > I0725 01:15:44.403316 24815 leveldb.cpp:204] Seeked to beginning of db in
> > 21082ns
> > I0725 01:15:44.403365 24815 leveldb.cpp:273] Iterated through 1 keys in
> > the db in 45671ns
> > I0725 01:15:44.403416 24815 replica.cpp:744] Replica recovered with log
> > positions 0 -> 0 with 1 holes and 0 unlearned
> > I0725 01:15:44.405697 24815 leveldb.cpp:176] Opened db in 1.987696ms
> > I0725 01:15:44.407449 24815 leveldb.cpp:183] Compacted db in 1.732685ms
> > I0725 01:15:44.407505 24815 leveldb.cpp:198] Created db iterator in
> 31974ns
> > I0725 01:15:44.407539 24815 leveldb.cpp:204] Seeked to beginning of db in
> > 28346ns
> > I0725 01:15:44.407608 24815 leveldb.cpp:273] Iterated through 1 keys in
> > the db in 61179ns
> > I0725 01:15:44.407675 24815 replica.cpp:744] Replica recovered with log
> > positions 0 -> 0 with 1 holes and 0 unlearned
> > I0725 01:15:44.408309 24848 recover.cpp:449] Starting replica recovery
> > I0725 01:15:44.408592 24848 recover.cpp:475] Replica is in VOTING status
> > I0725 01:15:44.408738 24848 recover.cpp:464] Recover process terminated
> > I0725 01:15:44.411092 24846 registrar.cpp:313] Recovering registrar
> > I0725 01:15:44.414173 24846 registrar.cpp:346] Successfully fetched the
> > registry (0B) in 3.041024ms
> > I0725 01:15:44.414304 24846 registrar.cpp:445] Applied 1 operations in
> > 41912ns; attempting to update the 'registry'
> > I0725 01:15:44.417557 24846 registrar.cpp:490] Successfully updated the
> > 'registry' in 3.19104ms
> > I0725 01:15:44.417676 24846 registrar.cpp:376] Successfully recovered
> > registrar
> > I0725 01:15:44.418450 24846 registrar.cpp:445] Applied 1 operations in
> > 73979ns; attempting to update the 'registry'
> > E0725 01:15:44.420547 24846 registrar.cpp:512] Registrar aborting: Failed
> > to update 'registry': failure
> > [ OK ] Strict/RegistrarTest.Abort/1 (36 ms)
> > [----------] 16 tests from Strict/RegistrarTest (987 ms total)
> >
> > [----------] Global test environment tear-down
> > [==========] 681 tests from 97 test cases ran. (284067 ms total)
> > [ PASSED ] 680 tests.
> > [ FAILED ] 1 test, listed below:
> > [ FAILED ] SchedulerDriverEventTest.SubscribedSchedulerFailover
> >
> > 1 FAILED TEST
> > YOU HAVE 12 DISABLED TESTS
> >
> > make[4]: *** [check-local] Error 1
> > Makefile:7686: recipe for target 'check-local' failed
> > make[4]: Leaving directory '/mesos/mesos-0.24.0/_build/src'
> > Makefile:7133: recipe for target 'check-am' failed
> > make[3]: Leaving directory '/mesos/mesos-0.24.0/_build/src'
> > make[3]: *** [check-am] Error 2
> > Makefile:7137: recipe for target 'check' failed
> > make[2]: Leaving directory '/mesos/mesos-0.24.0/_build/src'
> > make[2]: *** [check] Error 2
> > Makefile:667: recipe for target 'check-recursive' failed
> > make[1]: Leaving directory '/mesos/mesos-0.24.0/_build'
> > make[1]: *** [check-recursive] Error 1
> > make: *** [distcheck] Error 1
> > Makefile:873: recipe for target 'distcheck' failed
> > + docker rmi mesos-1437785570-27565
> > Untagged: mesos-1437785570-27565:latest
> > Deleted: da428b19d12a54c177cc780f57a03023118860cd1f391ad5a4c36bc9ea1194a5
> > Deleted: f27e77cdc8d024433a64cb5b8c06b0815c59fcd0396b2e156fe8383412f9c407
> > Deleted: 18521a59b035abf17bd642400550e5cbca14c558478884304afb75af0911e1f8
> > Deleted: 2be51fb23bd7e7ecee67773659b724c5f3729cbf058c5d8df639146bc94d0f4c
> > Deleted: 4ffb4141a08fd9607d5dd02a6f2b213ca4048fdf39ddb4cbd6d996004745431f
> > Deleted: 59aa8540fb2ef7d673b0d4fc72b21600bedd54fdd48f404d84d73d3bc7611600
> > Deleted: 38d44e1597196beec7f5ae605cc4449b016124ef5985d50d4694b216959a75d0
> > Deleted: bb87f77434d803ed32d182b088f8e47d93360c09c0a8431fd97c82dac47f5645
> > Deleted: e80b85d8c360d5ce4bdaf0e09526810b7a83f4802f905a5663eb428b794fb70d
> > Deleted: dc7c468e15b8e310bc0985e34d658629ca5ad6fd9704b01eaf912f180710878b
> > Deleted: 6a5177c1c9a191eea6803ba2cdfde61f08649d83e55124569762fffb4818fa72
> > Deleted: e8373809796f6f1f82b5696e01f3374e8dd21390d7b389bdeae9df84ff713e63
> > Build step 'Execute shell' marked build as failure
> >
>
Re: Build failed in Jenkins: Mesos » clang,docker||Hadoop,ubuntu:14.10 #573
Posted by Vinod Kone <vi...@gmail.com>.
pushed the fix
fe02e02cf7aa2363e808d6706874076156949c79
On Fri, Jul 24, 2015 at 6:15 PM, Apache Jenkins Server <
jenkins@builds.apache.org> wrote:
> See <
> https://builds.apache.org/job/Mesos/COMPILER=clang,LABEL=docker%7C%7CHadoop,OS=ubuntu%3A14.10/573/changes
> >
>
> Changes:
>
> [vinodkone] Updated slave to always set task status's uuid in status
> update.
>
> [vinodkone] Added address field to MasterInfo.
>
> ------------------------------------------
> [...truncated 115626 lines...]
> I0725 01:15:44.184327 24815 leveldb.cpp:183] Compacted db in 1.817837ms
> I0725 01:15:44.184386 24815 leveldb.cpp:198] Created db iterator in 42297ns
> I0725 01:15:44.184453 24815 leveldb.cpp:204] Seeked to beginning of db in
> 47211ns
> I0725 01:15:44.184509 24815 leveldb.cpp:273] Iterated through 1 keys in
> the db in 47012ns
> I0725 01:15:44.184604 24815 replica.cpp:744] Replica recovered with log
> positions 0 -> 0 with 1 holes and 0 unlearned
> I0725 01:15:44.186630 24815 leveldb.cpp:176] Opened db in 1.83977ms
> I0725 01:15:44.188418 24815 leveldb.cpp:183] Compacted db in 1.77013ms
> I0725 01:15:44.188483 24815 leveldb.cpp:198] Created db iterator in 31997ns
> I0725 01:15:44.188608 24815 leveldb.cpp:204] Seeked to beginning of db in
> 80129ns
> I0725 01:15:44.188685 24815 leveldb.cpp:273] Iterated through 1 keys in
> the db in 51061ns
> I0725 01:15:44.188738 24815 replica.cpp:744] Replica recovered with log
> positions 0 -> 0 with 1 holes and 0 unlearned
> I0725 01:15:44.189414 24847 recover.cpp:449] Starting replica recovery
> I0725 01:15:44.189688 24847 recover.cpp:475] Replica is in VOTING status
> I0725 01:15:44.189820 24847 recover.cpp:464] Recover process terminated
> I0725 01:15:44.192489 24847 registrar.cpp:313] Recovering registrar
> [ OK ] Strict/RegistrarTest.FetchTimeout/0 (45 ms)
> [ RUN ] Strict/RegistrarTest.FetchTimeout/1
> Using temporary directory '/tmp/Strict_RegistrarTest_FetchTimeout_1_aNte1o'
> I0725 01:15:44.219058 24815 leveldb.cpp:176] Opened db in 1.937351ms
> I0725 01:15:44.219801 24815 leveldb.cpp:183] Compacted db in 712801ns
> I0725 01:15:44.219847 24815 leveldb.cpp:198] Created db iterator in 36904ns
> I0725 01:15:44.219877 24815 leveldb.cpp:204] Seeked to beginning of db in
> 12375ns
> I0725 01:15:44.219894 24815 leveldb.cpp:273] Iterated through 0 keys in
> the db in 9638ns
> I0725 01:15:44.219949 24815 replica.cpp:744] Replica recovered with log
> positions 0 -> 0 with 1 holes and 0 unlearned
> I0725 01:15:44.221112 24837 leveldb.cpp:306] Persisting metadata (8 bytes)
> to leveldb took 537839ns
> I0725 01:15:44.221146 24837 replica.cpp:323] Persisted replica status to
> VOTING
> I0725 01:15:44.223613 24815 leveldb.cpp:176] Opened db in 1.952677ms
> I0725 01:15:44.224318 24815 leveldb.cpp:183] Compacted db in 685866ns
> I0725 01:15:44.224361 24815 leveldb.cpp:198] Created db iterator in 26997ns
> I0725 01:15:44.224383 24815 leveldb.cpp:204] Seeked to beginning of db in
> 10767ns
> I0725 01:15:44.224397 24815 leveldb.cpp:273] Iterated through 0 keys in
> the db in 8262ns
> I0725 01:15:44.224458 24815 replica.cpp:744] Replica recovered with log
> positions 0 -> 0 with 1 holes and 0 unlearned
> I0725 01:15:44.225198 24847 leveldb.cpp:306] Persisting metadata (8 bytes)
> to leveldb took 380571ns
> I0725 01:15:44.225221 24847 replica.cpp:323] Persisted replica status to
> VOTING
> I0725 01:15:44.227542 24815 leveldb.cpp:176] Opened db in 1.926715ms
> I0725 01:15:44.229285 24815 leveldb.cpp:183] Compacted db in 1.72614ms
> I0725 01:15:44.229329 24815 leveldb.cpp:198] Created db iterator in 23582ns
> I0725 01:15:44.229360 24815 leveldb.cpp:204] Seeked to beginning of db in
> 28339ns
> I0725 01:15:44.229418 24815 leveldb.cpp:273] Iterated through 1 keys in
> the db in 49423ns
> I0725 01:15:44.229470 24815 replica.cpp:744] Replica recovered with log
> positions 0 -> 0 with 1 holes and 0 unlearned
> I0725 01:15:44.231752 24815 leveldb.cpp:176] Opened db in 2.103385ms
> I0725 01:15:44.233585 24815 leveldb.cpp:183] Compacted db in 1.814895ms
> I0725 01:15:44.233633 24815 leveldb.cpp:198] Created db iterator in 29689ns
> I0725 01:15:44.233681 24815 leveldb.cpp:204] Seeked to beginning of db in
> 34023ns
> I0725 01:15:44.233726 24815 leveldb.cpp:273] Iterated through 1 keys in
> the db in 36601ns
> I0725 01:15:44.233772 24815 replica.cpp:744] Replica recovered with log
> positions 0 -> 0 with 1 holes and 0 unlearned
> I0725 01:15:44.234302 24836 recover.cpp:449] Starting replica recovery
> I0725 01:15:44.234751 24836 recover.cpp:475] Replica is in VOTING status
> I0725 01:15:44.234941 24836 recover.cpp:464] Recover process terminated
> I0725 01:15:44.236884 24836 registrar.cpp:313] Recovering registrar
> [ OK ] Strict/RegistrarTest.FetchTimeout/1 (46 ms)
> [ RUN ] Strict/RegistrarTest.StoreTimeout/0
> Using temporary directory '/tmp/Strict_RegistrarTest_StoreTimeout_0_NWsNxt'
> I0725 01:15:44.265707 24815 leveldb.cpp:176] Opened db in 2.180437ms
> I0725 01:15:44.266662 24815 leveldb.cpp:183] Compacted db in 925335ns
> I0725 01:15:44.266710 24815 leveldb.cpp:198] Created db iterator in 30828ns
> I0725 01:15:44.266734 24815 leveldb.cpp:204] Seeked to beginning of db in
> 11745ns
> I0725 01:15:44.266747 24815 leveldb.cpp:273] Iterated through 0 keys in
> the db in 6853ns
> I0725 01:15:44.266800 24815 replica.cpp:744] Replica recovered with log
> positions 0 -> 0 with 1 holes and 0 unlearned
> I0725 01:15:44.267959 24845 leveldb.cpp:306] Persisting metadata (8 bytes)
> to leveldb took 453152ns
> I0725 01:15:44.268002 24845 replica.cpp:323] Persisted replica status to
> VOTING
> I0725 01:15:44.272660 24815 leveldb.cpp:176] Opened db in 1.919647ms
> I0725 01:15:44.273305 24815 leveldb.cpp:183] Compacted db in 618120ns
> I0725 01:15:44.273362 24815 leveldb.cpp:198] Created db iterator in 45312ns
> I0725 01:15:44.273388 24815 leveldb.cpp:204] Seeked to beginning of db in
> 47102ns
> I0725 01:15:44.273586 24815 leveldb.cpp:273] Iterated through 0 keys in
> the db in 21191ns
> I0725 01:15:44.273653 24815 replica.cpp:744] Replica recovered with log
> positions 0 -> 0 with 1 holes and 0 unlearned
> I0725 01:15:44.274698 24843 leveldb.cpp:306] Persisting metadata (8 bytes)
> to leveldb took 474098ns
> I0725 01:15:44.274724 24843 replica.cpp:323] Persisted replica status to
> VOTING
> I0725 01:15:44.277128 24815 leveldb.cpp:176] Opened db in 1.867262ms
> I0725 01:15:44.278736 24815 leveldb.cpp:183] Compacted db in 1.584482ms
> I0725 01:15:44.278791 24815 leveldb.cpp:198] Created db iterator in 33321ns
> I0725 01:15:44.278834 24815 leveldb.cpp:204] Seeked to beginning of db in
> 32315ns
> I0725 01:15:44.278919 24815 leveldb.cpp:273] Iterated through 1 keys in
> the db in 77282ns
> I0725 01:15:44.279000 24815 replica.cpp:744] Replica recovered with log
> positions 0 -> 0 with 1 holes and 0 unlearned
> I0725 01:15:44.281086 24815 leveldb.cpp:176] Opened db in 1.86856ms
> I0725 01:15:44.282675 24815 leveldb.cpp:183] Compacted db in 1.57014ms
> I0725 01:15:44.282734 24815 leveldb.cpp:198] Created db iterator in 46264ns
> I0725 01:15:44.282798 24815 leveldb.cpp:204] Seeked to beginning of db in
> 45560ns
> I0725 01:15:44.282846 24815 leveldb.cpp:273] Iterated through 1 keys in
> the db in 38858ns
> I0725 01:15:44.282948 24815 replica.cpp:744] Replica recovered with log
> positions 0 -> 0 with 1 holes and 0 unlearned
> I0725 01:15:44.283512 24841 recover.cpp:449] Starting replica recovery
> I0725 01:15:44.283769 24841 recover.cpp:475] Replica is in VOTING status
> I0725 01:15:44.283900 24841 recover.cpp:464] Recover process terminated
> I0725 01:15:44.285866 24838 registrar.cpp:313] Recovering registrar
> I0725 01:15:44.288185 24838 registrar.cpp:346] Successfully fetched the
> registry (0B) in 0ns
> I0725 01:15:44.288295 24838 registrar.cpp:445] Applied 1 operations in
> 40519ns; attempting to update the 'registry'
> E0725 01:15:44.297751 24834 registrar.cpp:512] Registrar aborting: Failed
> to update 'registry': Failed to perform store within 10secs
> [ OK ] Strict/RegistrarTest.StoreTimeout/0 (47 ms)
> [ RUN ] Strict/RegistrarTest.StoreTimeout/1
> Using temporary directory '/tmp/Strict_RegistrarTest_StoreTimeout_1_rlf2by'
> I0725 01:15:44.313058 24815 leveldb.cpp:176] Opened db in 2.274055ms
> I0725 01:15:44.314002 24815 leveldb.cpp:183] Compacted db in 909682ns
> I0725 01:15:44.314054 24815 leveldb.cpp:198] Created db iterator in 32194ns
> I0725 01:15:44.314070 24815 leveldb.cpp:204] Seeked to beginning of db in
> 7636ns
> I0725 01:15:44.314079 24815 leveldb.cpp:273] Iterated through 0 keys in
> the db in 4582ns
> I0725 01:15:44.314131 24815 replica.cpp:744] Replica recovered with log
> positions 0 -> 0 with 1 holes and 0 unlearned
> I0725 01:15:44.315047 24833 leveldb.cpp:306] Persisting metadata (8 bytes)
> to leveldb took 485358ns
> I0725 01:15:44.315109 24833 replica.cpp:323] Persisted replica status to
> VOTING
> I0725 01:15:44.317586 24815 leveldb.cpp:176] Opened db in 1.773797ms
> I0725 01:15:44.318284 24815 leveldb.cpp:183] Compacted db in 668331ns
> I0725 01:15:44.318326 24815 leveldb.cpp:198] Created db iterator in 26935ns
> I0725 01:15:44.318344 24815 leveldb.cpp:204] Seeked to beginning of db in
> 10745ns
> I0725 01:15:44.318356 24815 leveldb.cpp:273] Iterated through 0 keys in
> the db in 5224ns
> I0725 01:15:44.318399 24815 replica.cpp:744] Replica recovered with log
> positions 0 -> 0 with 1 holes and 0 unlearned
> I0725 01:15:44.319178 24846 leveldb.cpp:306] Persisting metadata (8 bytes)
> to leveldb took 407520ns
> I0725 01:15:44.319211 24846 replica.cpp:323] Persisted replica status to
> VOTING
> I0725 01:15:44.321741 24815 leveldb.cpp:176] Opened db in 1.977989ms
> I0725 01:15:44.323755 24815 leveldb.cpp:183] Compacted db in 1.985544ms
> I0725 01:15:44.323814 24815 leveldb.cpp:198] Created db iterator in 38686ns
> I0725 01:15:44.323866 24815 leveldb.cpp:204] Seeked to beginning of db in
> 40444ns
> I0725 01:15:44.323935 24815 leveldb.cpp:273] Iterated through 1 keys in
> the db in 57996ns
> I0725 01:15:44.323995 24815 replica.cpp:744] Replica recovered with log
> positions 0 -> 0 with 1 holes and 0 unlearned
> I0725 01:15:44.326264 24815 leveldb.cpp:176] Opened db in 2.030044ms
> I0725 01:15:44.328104 24815 leveldb.cpp:183] Compacted db in 1.818721ms
> I0725 01:15:44.328161 24815 leveldb.cpp:198] Created db iterator in 32426ns
> I0725 01:15:44.328193 24815 leveldb.cpp:204] Seeked to beginning of db in
> 29370ns
> I0725 01:15:44.328258 24815 leveldb.cpp:273] Iterated through 1 keys in
> the db in 55015ns
> I0725 01:15:44.328322 24815 replica.cpp:744] Replica recovered with log
> positions 0 -> 0 with 1 holes and 0 unlearned
> I0725 01:15:44.328991 24835 recover.cpp:449] Starting replica recovery
> I0725 01:15:44.329270 24835 recover.cpp:475] Replica is in VOTING status
> I0725 01:15:44.329406 24835 recover.cpp:464] Recover process terminated
> I0725 01:15:44.331977 24846 registrar.cpp:313] Recovering registrar
> I0725 01:15:44.334348 24846 registrar.cpp:346] Successfully fetched the
> registry (0B) in 0ns
> I0725 01:15:44.334589 24846 registrar.cpp:445] Applied 1 operations in
> 52520ns; attempting to update the 'registry'
> E0725 01:15:44.343705 24848 registrar.cpp:512] Registrar aborting: Failed
> to update 'registry': Failed to perform store within 10secs
> [ OK ] Strict/RegistrarTest.StoreTimeout/1 (46 ms)
> [ RUN ] Strict/RegistrarTest.Abort/0
> Using temporary directory '/tmp/Strict_RegistrarTest_Abort_0_o4zHXC'
> I0725 01:15:44.358657 24815 leveldb.cpp:176] Opened db in 2.094491ms
> I0725 01:15:44.359529 24815 leveldb.cpp:183] Compacted db in 850323ns
> I0725 01:15:44.359596 24815 leveldb.cpp:198] Created db iterator in 29709ns
> I0725 01:15:44.359608 24815 leveldb.cpp:204] Seeked to beginning of db in
> 6154ns
> I0725 01:15:44.359616 24815 leveldb.cpp:273] Iterated through 0 keys in
> the db in 4737ns
> I0725 01:15:44.359668 24815 replica.cpp:744] Replica recovered with log
> positions 0 -> 0 with 1 holes and 0 unlearned
> I0725 01:15:44.360534 24839 leveldb.cpp:306] Persisting metadata (8 bytes)
> to leveldb took 465730ns
> I0725 01:15:44.360568 24839 replica.cpp:323] Persisted replica status to
> VOTING
> I0725 01:15:44.363234 24815 leveldb.cpp:176] Opened db in 2.122743ms
> I0725 01:15:44.363970 24815 leveldb.cpp:183] Compacted db in 695562ns
> I0725 01:15:44.364019 24815 leveldb.cpp:198] Created db iterator in 32953ns
> I0725 01:15:44.364044 24815 leveldb.cpp:204] Seeked to beginning of db in
> 11363ns
> I0725 01:15:44.364063 24815 leveldb.cpp:273] Iterated through 0 keys in
> the db in 8819ns
> I0725 01:15:44.364110 24815 replica.cpp:744] Replica recovered with log
> positions 0 -> 0 with 1 holes and 0 unlearned
> I0725 01:15:44.365056 24847 leveldb.cpp:306] Persisting metadata (8 bytes)
> to leveldb took 401342ns
> I0725 01:15:44.365082 24847 replica.cpp:323] Persisted replica status to
> VOTING
> I0725 01:15:44.367640 24815 leveldb.cpp:176] Opened db in 2.007813ms
> I0725 01:15:44.369894 24815 leveldb.cpp:183] Compacted db in 2.220102ms
> I0725 01:15:44.369958 24815 leveldb.cpp:198] Created db iterator in 42386ns
> I0725 01:15:44.370053 24815 leveldb.cpp:204] Seeked to beginning of db in
> 38812ns
> I0725 01:15:44.370116 24815 leveldb.cpp:273] Iterated through 1 keys in
> the db in 55105ns
> I0725 01:15:44.370250 24815 replica.cpp:744] Replica recovered with log
> positions 0 -> 0 with 1 holes and 0 unlearned
> I0725 01:15:44.372854 24815 leveldb.cpp:176] Opened db in 2.30924ms
> I0725 01:15:44.374794 24815 leveldb.cpp:183] Compacted db in 1.914619ms
> I0725 01:15:44.374848 24815 leveldb.cpp:198] Created db iterator in 31431ns
> I0725 01:15:44.374891 24815 leveldb.cpp:204] Seeked to beginning of db in
> 32660ns
> I0725 01:15:44.374948 24815 leveldb.cpp:273] Iterated through 1 keys in
> the db in 47902ns
> I0725 01:15:44.375006 24815 replica.cpp:744] Replica recovered with log
> positions 0 -> 0 with 1 holes and 0 unlearned
> I0725 01:15:44.375771 24835 recover.cpp:449] Starting replica recovery
> I0725 01:15:44.376039 24835 recover.cpp:475] Replica is in VOTING status
> I0725 01:15:44.376160 24835 recover.cpp:464] Recover process terminated
> I0725 01:15:44.378584 24837 registrar.cpp:313] Recovering registrar
> I0725 01:15:44.380849 24837 registrar.cpp:346] Successfully fetched the
> registry (0B) in 2.2272ms
> I0725 01:15:44.380964 24837 registrar.cpp:445] Applied 1 operations in
> 38064ns; attempting to update the 'registry'
> I0725 01:15:44.383137 24837 registrar.cpp:490] Successfully updated the
> 'registry' in 2.115072ms
> I0725 01:15:44.383236 24837 registrar.cpp:376] Successfully recovered
> registrar
> I0725 01:15:44.383802 24837 registrar.cpp:445] Applied 1 operations in
> 43798ns; attempting to update the 'registry'
> E0725 01:15:44.385860 24837 registrar.cpp:512] Registrar aborting: Failed
> to update 'registry': failure
> [ OK ] Strict/RegistrarTest.Abort/0 (33 ms)
> [ RUN ] Strict/RegistrarTest.Abort/1
> Using temporary directory '/tmp/Strict_RegistrarTest_Abort_1_7S8LOH'
> I0725 01:15:44.392179 24815 leveldb.cpp:176] Opened db in 2.325718ms
> I0725 01:15:44.393024 24815 leveldb.cpp:183] Compacted db in 834597ns
> I0725 01:15:44.393097 24815 leveldb.cpp:198] Created db iterator in 32999ns
> I0725 01:15:44.393112 24815 leveldb.cpp:204] Seeked to beginning of db in
> 6539ns
> I0725 01:15:44.393121 24815 leveldb.cpp:273] Iterated through 0 keys in
> the db in 4512ns
> I0725 01:15:44.393169 24815 replica.cpp:744] Replica recovered with log
> positions 0 -> 0 with 1 holes and 0 unlearned
> I0725 01:15:44.394217 24841 leveldb.cpp:306] Persisting metadata (8 bytes)
> to leveldb took 441920ns
> I0725 01:15:44.394248 24841 replica.cpp:323] Persisted replica status to
> VOTING
> I0725 01:15:44.396698 24815 leveldb.cpp:176] Opened db in 1.935361ms
> I0725 01:15:44.397604 24815 leveldb.cpp:183] Compacted db in 891024ns
> I0725 01:15:44.397678 24815 leveldb.cpp:198] Created db iterator in 32953ns
> I0725 01:15:44.397693 24815 leveldb.cpp:204] Seeked to beginning of db in
> 6222ns
> I0725 01:15:44.397701 24815 leveldb.cpp:273] Iterated through 0 keys in
> the db in 4600ns
> I0725 01:15:44.397747 24815 replica.cpp:744] Replica recovered with log
> positions 0 -> 0 with 1 holes and 0 unlearned
> I0725 01:15:44.398591 24838 leveldb.cpp:306] Persisting metadata (8 bytes)
> to leveldb took 405167ns
> I0725 01:15:44.398620 24838 replica.cpp:323] Persisted replica status to
> VOTING
> I0725 01:15:44.401034 24815 leveldb.cpp:176] Opened db in 2.007379ms
> I0725 01:15:44.403199 24815 leveldb.cpp:183] Compacted db in 2.153619ms
> I0725 01:15:44.403286 24815 leveldb.cpp:198] Created db iterator in 36510ns
> I0725 01:15:44.403316 24815 leveldb.cpp:204] Seeked to beginning of db in
> 21082ns
> I0725 01:15:44.403365 24815 leveldb.cpp:273] Iterated through 1 keys in
> the db in 45671ns
> I0725 01:15:44.403416 24815 replica.cpp:744] Replica recovered with log
> positions 0 -> 0 with 1 holes and 0 unlearned
> I0725 01:15:44.405697 24815 leveldb.cpp:176] Opened db in 1.987696ms
> I0725 01:15:44.407449 24815 leveldb.cpp:183] Compacted db in 1.732685ms
> I0725 01:15:44.407505 24815 leveldb.cpp:198] Created db iterator in 31974ns
> I0725 01:15:44.407539 24815 leveldb.cpp:204] Seeked to beginning of db in
> 28346ns
> I0725 01:15:44.407608 24815 leveldb.cpp:273] Iterated through 1 keys in
> the db in 61179ns
> I0725 01:15:44.407675 24815 replica.cpp:744] Replica recovered with log
> positions 0 -> 0 with 1 holes and 0 unlearned
> I0725 01:15:44.408309 24848 recover.cpp:449] Starting replica recovery
> I0725 01:15:44.408592 24848 recover.cpp:475] Replica is in VOTING status
> I0725 01:15:44.408738 24848 recover.cpp:464] Recover process terminated
> I0725 01:15:44.411092 24846 registrar.cpp:313] Recovering registrar
> I0725 01:15:44.414173 24846 registrar.cpp:346] Successfully fetched the
> registry (0B) in 3.041024ms
> I0725 01:15:44.414304 24846 registrar.cpp:445] Applied 1 operations in
> 41912ns; attempting to update the 'registry'
> I0725 01:15:44.417557 24846 registrar.cpp:490] Successfully updated the
> 'registry' in 3.19104ms
> I0725 01:15:44.417676 24846 registrar.cpp:376] Successfully recovered
> registrar
> I0725 01:15:44.418450 24846 registrar.cpp:445] Applied 1 operations in
> 73979ns; attempting to update the 'registry'
> E0725 01:15:44.420547 24846 registrar.cpp:512] Registrar aborting: Failed
> to update 'registry': failure
> [ OK ] Strict/RegistrarTest.Abort/1 (36 ms)
> [----------] 16 tests from Strict/RegistrarTest (987 ms total)
>
> [----------] Global test environment tear-down
> [==========] 681 tests from 97 test cases ran. (284067 ms total)
> [ PASSED ] 680 tests.
> [ FAILED ] 1 test, listed below:
> [ FAILED ] SchedulerDriverEventTest.SubscribedSchedulerFailover
>
> 1 FAILED TEST
> YOU HAVE 12 DISABLED TESTS
>
> make[4]: *** [check-local] Error 1
> Makefile:7686: recipe for target 'check-local' failed
> make[4]: Leaving directory '/mesos/mesos-0.24.0/_build/src'
> Makefile:7133: recipe for target 'check-am' failed
> make[3]: Leaving directory '/mesos/mesos-0.24.0/_build/src'
> make[3]: *** [check-am] Error 2
> Makefile:7137: recipe for target 'check' failed
> make[2]: Leaving directory '/mesos/mesos-0.24.0/_build/src'
> make[2]: *** [check] Error 2
> Makefile:667: recipe for target 'check-recursive' failed
> make[1]: Leaving directory '/mesos/mesos-0.24.0/_build'
> make[1]: *** [check-recursive] Error 1
> make: *** [distcheck] Error 1
> Makefile:873: recipe for target 'distcheck' failed
> + docker rmi mesos-1437785570-27565
> Untagged: mesos-1437785570-27565:latest
> Deleted: da428b19d12a54c177cc780f57a03023118860cd1f391ad5a4c36bc9ea1194a5
> Deleted: f27e77cdc8d024433a64cb5b8c06b0815c59fcd0396b2e156fe8383412f9c407
> Deleted: 18521a59b035abf17bd642400550e5cbca14c558478884304afb75af0911e1f8
> Deleted: 2be51fb23bd7e7ecee67773659b724c5f3729cbf058c5d8df639146bc94d0f4c
> Deleted: 4ffb4141a08fd9607d5dd02a6f2b213ca4048fdf39ddb4cbd6d996004745431f
> Deleted: 59aa8540fb2ef7d673b0d4fc72b21600bedd54fdd48f404d84d73d3bc7611600
> Deleted: 38d44e1597196beec7f5ae605cc4449b016124ef5985d50d4694b216959a75d0
> Deleted: bb87f77434d803ed32d182b088f8e47d93360c09c0a8431fd97c82dac47f5645
> Deleted: e80b85d8c360d5ce4bdaf0e09526810b7a83f4802f905a5663eb428b794fb70d
> Deleted: dc7c468e15b8e310bc0985e34d658629ca5ad6fd9704b01eaf912f180710878b
> Deleted: 6a5177c1c9a191eea6803ba2cdfde61f08649d83e55124569762fffb4818fa72
> Deleted: e8373809796f6f1f82b5696e01f3374e8dd21390d7b389bdeae9df84ff713e63
> Build step 'Execute shell' marked build as failure
>
Jenkins build is back to normal : Mesos » clang,docker||Hadoop,ubuntu:14.10 #574
Posted by Apache Jenkins Server <je...@builds.apache.org>.
See <https://builds.apache.org/job/Mesos/COMPILER=clang,LABEL=docker%7C%7CHadoop,OS=ubuntu%3A14.10/574/changes>