You are viewing a plain text version of this content. The canonical link for it is here.
Posted to dev@bookkeeper.apache.org by Apache Jenkins Server <je...@builds.apache.org> on 2016/09/21 13:09:09 UTC
Build failed in Jenkins: bookkeeper-master #1511
See <https://builds.apache.org/job/bookkeeper-master/1511/>
------------------------------------------
[...truncated 353 lines...]
[INFO]
[INFO] --- apache-rat-plugin:0.7:check (default-cli) @ bookkeeper-server ---
[INFO] Exclude: **/DataFormats.java
[INFO] Exclude: **/BookkeeperProtocol.java
[INFO] Exclude: **/TestDataFormats.java
[INFO]
[INFO] --- maven-remote-resources-plugin:1.1:process (default) @ bookkeeper-server ---
[INFO]
[INFO] --- maven-resources-plugin:2.4.3:resources (default-resources) @ bookkeeper-server ---
[INFO] Using 'UTF-8' encoding to copy filtered resources.
[INFO] Copying 3 resources
[INFO] Copying 3 resources
[INFO]
[INFO] --- maven-compiler-plugin:3.5.1:compile (default-compile) @ bookkeeper-server ---
[INFO] Changes detected - recompiling the module!
[INFO] Compiling 217 source files to <https://builds.apache.org/job/bookkeeper-master/ws/bookkeeper-server/target/classes>
[INFO]
[INFO] --- maven-resources-plugin:2.4.3:testResources (default-testResources) @ bookkeeper-server ---
[INFO] Using 'UTF-8' encoding to copy filtered resources.
[INFO] Copying 1 resource
[INFO] Copying 3 resources
[INFO]
[INFO] --- maven-compiler-plugin:3.5.1:testCompile (default-testCompile) @ bookkeeper-server ---
[INFO] Changes detected - recompiling the module!
[INFO] Compiling 105 source files to <https://builds.apache.org/job/bookkeeper-master/ws/bookkeeper-server/target/test-classes>
[INFO]
[INFO] --- maven-surefire-plugin:2.19.1:test (default-test) @ bookkeeper-server ---
[WARNING] The parameter forkMode is deprecated since version 2.14. Use forkCount and reuseForks instead.
-------------------------------------------------------
T E S T S
-------------------------------------------------------
Running org.apache.bookkeeper.conf.NoSystemPropertiesConfigurationTest
Tests run: 1, Failures: 0, Errors: 0, Skipped: 0, Time elapsed: 0.191 sec - in org.apache.bookkeeper.conf.NoSystemPropertiesConfigurationTest
Running org.apache.bookkeeper.conf.SystemPropertiesConfigurationTest
Tests run: 1, Failures: 0, Errors: 0, Skipped: 0, Time elapsed: 0.209 sec - in org.apache.bookkeeper.conf.SystemPropertiesConfigurationTest
Running org.apache.bookkeeper.bookie.TestSyncThread
Tests run: 4, Failures: 0, Errors: 0, Skipped: 0, Time elapsed: 0.981 sec - in org.apache.bookkeeper.bookie.TestSyncThread
Running org.apache.bookkeeper.bookie.IndexPersistenceMgrTest
Tests run: 2, Failures: 0, Errors: 0, Skipped: 0, Time elapsed: 0.342 sec - in org.apache.bookkeeper.bookie.IndexPersistenceMgrTest
Running org.apache.bookkeeper.bookie.EntryLogTest
Tests run: 6, Failures: 0, Errors: 0, Skipped: 0, Time elapsed: 0.441 sec - in org.apache.bookkeeper.bookie.EntryLogTest
Running org.apache.bookkeeper.bookie.TestGcOverreplicatedLedger
Tests run: 3, Failures: 0, Errors: 0, Skipped: 0, Time elapsed: 2.003 sec - in org.apache.bookkeeper.bookie.TestGcOverreplicatedLedger
Running org.apache.bookkeeper.bookie.BookieThreadTest
Tests run: 1, Failures: 0, Errors: 0, Skipped: 0, Time elapsed: 0.184 sec - in org.apache.bookkeeper.bookie.BookieThreadTest
Running org.apache.bookkeeper.bookie.BookieShutdownTest
Tests run: 2, Failures: 0, Errors: 0, Skipped: 0, Time elapsed: 14.204 sec - in org.apache.bookkeeper.bookie.BookieShutdownTest
Running org.apache.bookkeeper.bookie.LedgerCacheTest
Tests run: 8, Failures: 0, Errors: 0, Skipped: 0, Time elapsed: 1.117 sec - in org.apache.bookkeeper.bookie.LedgerCacheTest
Running org.apache.bookkeeper.bookie.IndexCorruptionTest
Tests run: 2, Failures: 0, Errors: 0, Skipped: 0, Time elapsed: 64.161 sec - in org.apache.bookkeeper.bookie.IndexCorruptionTest
Running org.apache.bookkeeper.bookie.BookieJournalTest
Tests run: 13, Failures: 0, Errors: 0, Skipped: 0, Time elapsed: 0.734 sec - in org.apache.bookkeeper.bookie.BookieJournalTest
Running org.apache.bookkeeper.bookie.UpdateCookieCmdTest
Tests run: 6, Failures: 0, Errors: 0, Skipped: 0, Time elapsed: 2.048 sec - in org.apache.bookkeeper.bookie.UpdateCookieCmdTest
Running org.apache.bookkeeper.bookie.TestLedgerDirsManager
Tests run: 3, Failures: 0, Errors: 0, Skipped: 0, Time elapsed: 3.511 sec - in org.apache.bookkeeper.bookie.TestLedgerDirsManager
Running org.apache.bookkeeper.bookie.CookieTest
Tests run: 15, Failures: 0, Errors: 0, Skipped: 0, Time elapsed: 2.089 sec - in org.apache.bookkeeper.bookie.CookieTest
Running org.apache.bookkeeper.bookie.CreateNewLogTest
Tests run: 1, Failures: 0, Errors: 0, Skipped: 0, Time elapsed: 0.362 sec - in org.apache.bookkeeper.bookie.CreateNewLogTest
Running org.apache.bookkeeper.bookie.UpgradeTest
Tests run: 4, Failures: 0, Errors: 0, Skipped: 0, Time elapsed: 1.492 sec - in org.apache.bookkeeper.bookie.UpgradeTest
Running org.apache.bookkeeper.bookie.CompactionTest
Tests run: 20, Failures: 0, Errors: 0, Skipped: 0, Time elapsed: 94.919 sec - in org.apache.bookkeeper.bookie.CompactionTest
Running org.apache.bookkeeper.bookie.BookieInitializationTest
Tests run: 9, Failures: 0, Errors: 0, Skipped: 0, Time elapsed: 20.566 sec - in org.apache.bookkeeper.bookie.BookieInitializationTest
Running org.apache.bookkeeper.auth.TestAuth
Tests run: 9, Failures: 0, Errors: 0, Skipped: 0, Time elapsed: 20.947 sec - in org.apache.bookkeeper.auth.TestAuth
Running org.apache.bookkeeper.proto.TestPerChannelBookieClient
Tests run: 4, Failures: 0, Errors: 0, Skipped: 0, Time elapsed: 3.881 sec - in org.apache.bookkeeper.proto.TestPerChannelBookieClient
Running org.apache.bookkeeper.proto.TestBKStats
Tests run: 1, Failures: 0, Errors: 0, Skipped: 0, Time elapsed: 0.156 sec - in org.apache.bookkeeper.proto.TestBKStats
Running org.apache.bookkeeper.proto.NetworkLessBookieTest
Tests run: 2, Failures: 0, Errors: 0, Skipped: 0, Time elapsed: 11.711 sec - in org.apache.bookkeeper.proto.NetworkLessBookieTest
Running org.apache.bookkeeper.proto.TestDeathwatcher
Tests run: 1, Failures: 0, Errors: 0, Skipped: 0, Time elapsed: 3.106 sec - in org.apache.bookkeeper.proto.TestDeathwatcher
Running org.apache.bookkeeper.proto.TestBackwardCompatCMS42
Tests run: 3, Failures: 0, Errors: 0, Skipped: 0, Time elapsed: 1.299 sec - in org.apache.bookkeeper.proto.TestBackwardCompatCMS42
Running org.apache.bookkeeper.metastore.TestMetaStore
Tests run: 5, Failures: 0, Errors: 0, Skipped: 0, Time elapsed: 0.292 sec - in org.apache.bookkeeper.metastore.TestMetaStore
Running org.apache.bookkeeper.test.AsyncLedgerOpsTest
Tests run: 6, Failures: 0, Errors: 0, Skipped: 0, Time elapsed: 2.473 sec - in org.apache.bookkeeper.test.AsyncLedgerOpsTest
Running org.apache.bookkeeper.test.ReadOnlyBookieTest
Tests run: 5, Failures: 0, Errors: 0, Skipped: 0, Time elapsed: 3.328 sec - in org.apache.bookkeeper.test.ReadOnlyBookieTest
Running org.apache.bookkeeper.test.BookieReadWriteTest
Tests run: 78, Failures: 0, Errors: 0, Skipped: 0, Time elapsed: 17.686 sec - in org.apache.bookkeeper.test.BookieReadWriteTest
Running org.apache.bookkeeper.test.BookieFailureTest
Tests run: 48, Failures: 0, Errors: 0, Skipped: 0, Time elapsed: 15.673 sec - in org.apache.bookkeeper.test.BookieFailureTest
Running org.apache.bookkeeper.test.BookieJournalRollingTest
Tests run: 3, Failures: 0, Errors: 0, Skipped: 0, Time elapsed: 42.405 sec - in org.apache.bookkeeper.test.BookieJournalRollingTest
Running org.apache.bookkeeper.test.BookieClientTest
Tests run: 2, Failures: 0, Errors: 0, Skipped: 0, Time elapsed: 6.82 sec - in org.apache.bookkeeper.test.BookieClientTest
Running org.apache.bookkeeper.test.ConfigurationTest
Tests run: 2, Failures: 0, Errors: 0, Skipped: 0, Time elapsed: 0.195 sec - in org.apache.bookkeeper.test.ConfigurationTest
Running org.apache.bookkeeper.test.ConcurrentLedgerTest
Tests run: 1, Failures: 0, Errors: 0, Skipped: 0, Time elapsed: 0.389 sec - in org.apache.bookkeeper.test.ConcurrentLedgerTest
Running org.apache.bookkeeper.test.ConditionalSetTest
Tests run: 2, Failures: 0, Errors: 0, Skipped: 0, Time elapsed: 1.787 sec - in org.apache.bookkeeper.test.ConditionalSetTest
Running org.apache.bookkeeper.test.MultipleThreadReadTest
Tests run: 3, Failures: 0, Errors: 0, Skipped: 0, Time elapsed: 3.719 sec - in org.apache.bookkeeper.test.MultipleThreadReadTest
Running org.apache.bookkeeper.test.CloseTest
Tests run: 4, Failures: 0, Errors: 0, Skipped: 0, Time elapsed: 3.095 sec - in org.apache.bookkeeper.test.CloseTest
Running org.apache.bookkeeper.test.ForceReadOnlyBookieTest
Tests run: 1, Failures: 0, Errors: 0, Skipped: 0, Time elapsed: 2.495 sec - in org.apache.bookkeeper.test.ForceReadOnlyBookieTest
Running org.apache.bookkeeper.test.LedgerDeleteTest
Tests run: 6, Failures: 0, Errors: 0, Skipped: 0, Time elapsed: 21.567 sec - in org.apache.bookkeeper.test.LedgerDeleteTest
Running org.apache.bookkeeper.test.LedgerCreateDeleteTest
Tests run: 3, Failures: 0, Errors: 0, Skipped: 0, Time elapsed: 4.987 sec - in org.apache.bookkeeper.test.LedgerCreateDeleteTest
Running org.apache.bookkeeper.test.TestBackwardCompat
Tests run: 5, Failures: 0, Errors: 0, Skipped: 0, Time elapsed: 15.943 sec - in org.apache.bookkeeper.test.TestBackwardCompat
Running org.apache.bookkeeper.test.BookieZKExpireTest
Tests run: 1, Failures: 0, Errors: 0, Skipped: 0, Time elapsed: 15.881 sec - in org.apache.bookkeeper.test.BookieZKExpireTest
Running org.apache.bookkeeper.zookeeper.TestZooKeeperClient
Tests run: 4, Failures: 0, Errors: 0, Skipped: 0, Time elapsed: 35.779 sec - in org.apache.bookkeeper.zookeeper.TestZooKeeperClient
Running org.apache.bookkeeper.replication.TestReplicationWorker
Tests run: 27, Failures: 0, Errors: 0, Skipped: 0, Time elapsed: 49.135 sec - in org.apache.bookkeeper.replication.TestReplicationWorker
Running org.apache.bookkeeper.replication.BookieAutoRecoveryTest
Tests run: 7, Failures: 0, Errors: 0, Skipped: 0, Time elapsed: 24.213 sec - in org.apache.bookkeeper.replication.BookieAutoRecoveryTest
Running org.apache.bookkeeper.replication.AutoRecoveryMainTest
Tests run: 3, Failures: 0, Errors: 0, Skipped: 0, Time elapsed: 5.387 sec - in org.apache.bookkeeper.replication.AutoRecoveryMainTest
Running org.apache.bookkeeper.replication.BookieLedgerIndexTest
Tests run: 9, Failures: 0, Errors: 0, Skipped: 0, Time elapsed: 6.874 sec - in org.apache.bookkeeper.replication.BookieLedgerIndexTest
Running org.apache.bookkeeper.replication.TestLedgerUnderreplicationManager
Tests run: 13, Failures: 0, Errors: 0, Skipped: 0, Time elapsed: 16.373 sec - in org.apache.bookkeeper.replication.TestLedgerUnderreplicationManager
Running org.apache.bookkeeper.replication.TestAutoRecoveryAlongWithBookieServers
Tests run: 1, Failures: 0, Errors: 0, Skipped: 0, Time elapsed: 1.711 sec - in org.apache.bookkeeper.replication.TestAutoRecoveryAlongWithBookieServers
Running org.apache.bookkeeper.replication.AuditorBookieTest
Tests run: 5, Failures: 0, Errors: 0, Skipped: 0, Time elapsed: 9.054 sec - in org.apache.bookkeeper.replication.AuditorBookieTest
Running org.apache.bookkeeper.replication.AuditorRollingRestartTest
Tests run: 1, Failures: 0, Errors: 0, Skipped: 0, Time elapsed: 65.68 sec - in org.apache.bookkeeper.replication.AuditorRollingRestartTest
Running org.apache.bookkeeper.replication.AuditorPeriodicBookieCheckTest
Tests run: 1, Failures: 0, Errors: 0, Skipped: 0, Time elapsed: 2.222 sec - in org.apache.bookkeeper.replication.AuditorPeriodicBookieCheckTest
Running org.apache.bookkeeper.replication.AuditorPeriodicCheckTest
Tests run: 4, Failures: 0, Errors: 0, Skipped: 0, Time elapsed: 15.181 sec - in org.apache.bookkeeper.replication.AuditorPeriodicCheckTest
Running org.apache.bookkeeper.replication.AuditorLedgerCheckerTest
Tests run: 21, Failures: 1, Errors: 0, Skipped: 0, Time elapsed: 40.029 sec <<< FAILURE! - in org.apache.bookkeeper.replication.AuditorLedgerCheckerTest
testReadOnlyBookieExclusionFromURLedgersCheck[0](org.apache.bookkeeper.replication.AuditorLedgerCheckerTest) Time elapsed: 0.325 sec <<< FAILURE!
java.lang.AssertionError: latch should not have completed
at org.apache.bookkeeper.replication.AuditorLedgerCheckerTest.testReadOnlyBookieExclusionFromURLedgersCheck(AuditorLedgerCheckerTest.java:279)
Running org.apache.bookkeeper.client.TestSpeculativeRead
Tests run: 8, Failures: 0, Errors: 0, Skipped: 0, Time elapsed: 62.922 sec - in org.apache.bookkeeper.client.TestSpeculativeRead
Running org.apache.bookkeeper.client.TestWatchEnsembleChange
Tests run: 6, Failures: 0, Errors: 0, Skipped: 0, Time elapsed: 18.841 sec - in org.apache.bookkeeper.client.TestWatchEnsembleChange
Running org.apache.bookkeeper.client.BookKeeperTest
Tests run: 16, Failures: 0, Errors: 0, Skipped: 0, Time elapsed: 37.449 sec - in org.apache.bookkeeper.client.BookKeeperTest
Running org.apache.bookkeeper.client.BookieWriteLedgersWithDifferentDigestsTest
Tests run: 12, Failures: 0, Errors: 0, Skipped: 0, Time elapsed: 3.776 sec - in org.apache.bookkeeper.client.BookieWriteLedgersWithDifferentDigestsTest
Running org.apache.bookkeeper.client.SlowBookieTest
Tests run: 3, Failures: 0, Errors: 0, Skipped: 0, Time elapsed: 25.854 sec - in org.apache.bookkeeper.client.SlowBookieTest
Running org.apache.bookkeeper.client.TestReadTimeout
Tests run: 1, Failures: 0, Errors: 0, Skipped: 0, Time elapsed: 16.714 sec - in org.apache.bookkeeper.client.TestReadTimeout
Running org.apache.bookkeeper.client.TestLedgerChecker
Tests run: 11, Failures: 0, Errors: 0, Skipped: 0, Time elapsed: 5.205 sec - in org.apache.bookkeeper.client.TestLedgerChecker
Running org.apache.bookkeeper.client.TestLedgerFragmentReplication
Tests run: 4, Failures: 0, Errors: 0, Skipped: 0, Time elapsed: 2.356 sec - in org.apache.bookkeeper.client.TestLedgerFragmentReplication
Running org.apache.bookkeeper.client.TestTryReadLastConfirmed
Tests run: 3, Failures: 0, Errors: 0, Skipped: 0, Time elapsed: 8.806 sec - in org.apache.bookkeeper.client.TestTryReadLastConfirmed
Running org.apache.bookkeeper.client.LedgerCloseTest
Tests run: 4, Failures: 0, Errors: 0, Skipped: 0, Time elapsed: 20.557 sec - in org.apache.bookkeeper.client.LedgerCloseTest
Running org.apache.bookkeeper.client.TestFencing
Tests run: 14, Failures: 0, Errors: 0, Skipped: 0, Time elapsed: 14.29 sec - in org.apache.bookkeeper.client.TestFencing
Running org.apache.bookkeeper.client.LedgerRecoveryTest
Tests run: 18, Failures: 0, Errors: 0, Skipped: 0, Time elapsed: 6.983 sec - in org.apache.bookkeeper.client.LedgerRecoveryTest
Running org.apache.bookkeeper.client.TestRackawareEnsemblePlacementPolicy
Tests run: 7, Failures: 0, Errors: 0, Skipped: 0, Time elapsed: 0.538 sec - in org.apache.bookkeeper.client.TestRackawareEnsemblePlacementPolicy
Running org.apache.bookkeeper.client.UpdateLedgerOpTest
Tests run: 4, Failures: 0, Errors: 0, Skipped: 0, Time elapsed: 34.626 sec - in org.apache.bookkeeper.client.UpdateLedgerOpTest
Running org.apache.bookkeeper.client.BookieWriteLedgerTest
Tests run: 60, Failures: 0, Errors: 0, Skipped: 0, Time elapsed: 22.297 sec - in org.apache.bookkeeper.client.BookieWriteLedgerTest
Running org.apache.bookkeeper.client.TestBookieHealthCheck
Tests run: 3, Failures: 0, Errors: 0, Skipped: 0, Time elapsed: 16.07 sec - in org.apache.bookkeeper.client.TestBookieHealthCheck
Running org.apache.bookkeeper.client.BookKeeperCloseTest
Tests run: 10, Failures: 0, Errors: 0, Skipped: 0, Time elapsed: 5.71 sec - in org.apache.bookkeeper.client.BookKeeperCloseTest
Running org.apache.bookkeeper.client.TestBookieWatcher
Tests run: 2, Failures: 0, Errors: 0, Skipped: 0, Time elapsed: 15.739 sec - in org.apache.bookkeeper.client.TestBookieWatcher
Running org.apache.bookkeeper.client.ListLedgersTest
Tests run: 8, Failures: 0, Errors: 0, Skipped: 0, Time elapsed: 3.306 sec - in org.apache.bookkeeper.client.ListLedgersTest
Running org.apache.bookkeeper.client.TestAddEntryQuorumTimeout
Tests run: 3, Failures: 0, Errors: 0, Skipped: 0, Time elapsed: 9.029 sec - in org.apache.bookkeeper.client.TestAddEntryQuorumTimeout
Running org.apache.bookkeeper.client.RoundRobinDistributionScheduleTest
Tests run: 2, Failures: 0, Errors: 0, Skipped: 0, Time elapsed: 0.181 sec - in org.apache.bookkeeper.client.RoundRobinDistributionScheduleTest
Running org.apache.bookkeeper.client.UpdateLedgerCmdTest
Tests run: 1, Failures: 0, Errors: 0, Skipped: 0, Time elapsed: 9.449 sec - in org.apache.bookkeeper.client.UpdateLedgerCmdTest
Running org.apache.bookkeeper.client.LocalBookKeeperTest
Tests run: 2, Failures: 0, Errors: 0, Skipped: 0, Time elapsed: 12.023 sec - in org.apache.bookkeeper.client.LocalBookKeeperTest
Running org.apache.bookkeeper.client.BookieRecoveryTest
Tests run: 72, Failures: 0, Errors: 0, Skipped: 0, Time elapsed: 35.976 sec - in org.apache.bookkeeper.client.BookieRecoveryTest
Running org.apache.bookkeeper.util.TestDiskChecker
Tests run: 5, Failures: 0, Errors: 0, Skipped: 0, Time elapsed: 0.176 sec - in org.apache.bookkeeper.util.TestDiskChecker
Running org.apache.bookkeeper.meta.TestLedgerManager
Tests run: 5, Failures: 0, Errors: 0, Skipped: 0, Time elapsed: 1.204 sec - in org.apache.bookkeeper.meta.TestLedgerManager
Running org.apache.bookkeeper.meta.LedgerManagerIteratorTest
Tests run: 3, Failures: 0, Errors: 0, Skipped: 0, Time elapsed: 0.65 sec - in org.apache.bookkeeper.meta.LedgerManagerIteratorTest
Running org.apache.bookkeeper.meta.TestZkVersion
Tests run: 3, Failures: 0, Errors: 0, Skipped: 0, Time elapsed: 0.064 sec - in org.apache.bookkeeper.meta.TestZkVersion
Running org.apache.bookkeeper.meta.GcLedgersTest
Tests run: 9, Failures: 0, Errors: 0, Skipped: 0, Time elapsed: 14.313 sec - in org.apache.bookkeeper.meta.GcLedgersTest
Running org.apache.bookkeeper.meta.TestZkLedgerIdGenerator
Tests run: 1, Failures: 0, Errors: 0, Skipped: 0, Time elapsed: 2.088 sec - in org.apache.bookkeeper.meta.TestZkLedgerIdGenerator
Running org.apache.bookkeeper.meta.LedgerLayoutTest
Tests run: 5, Failures: 0, Errors: 0, Skipped: 0, Time elapsed: 0.636 sec - in org.apache.bookkeeper.meta.LedgerLayoutTest
Results :
Failed tests:
AuditorLedgerCheckerTest.testReadOnlyBookieExclusionFromURLedgersCheck:279 latch should not have completed
Tests run: 697, Failures: 1, Errors: 0, Skipped: 0
[INFO] ------------------------------------------------------------------------
[INFO] Reactor Summary:
[INFO]
[INFO] bookkeeper ......................................... SUCCESS [ 5.118 s]
[INFO] compability dependencies ........................... SUCCESS [ 0.105 s]
[INFO] bookkeeper-server-compat400 ........................ SUCCESS [ 6.569 s]
[INFO] bookkeeper-server-compat410 ........................ SUCCESS [ 2.773 s]
[INFO] bookkeeper-server-compat420 ........................ SUCCESS [ 2.841 s]
[INFO] Stats API for bookkeeper ........................... SUCCESS [ 8.732 s]
[INFO] bookkeeper-server .................................. FAILURE [19:09 min]
[INFO] bookkeeper-benchmark ............................... SKIPPED
[INFO] Stats provider for twitter-stats package ........... SKIPPED
[INFO] Stats provider for twitter-ostrich package ......... SKIPPED
[INFO] Stats provider for codahale metrics ................ SKIPPED
[INFO] bookkeeper-stats-providers ......................... SKIPPED
[INFO] ------------------------------------------------------------------------
[INFO] BUILD FAILURE
[INFO] ------------------------------------------------------------------------
[INFO] Total time: 19:36 min
[INFO] Finished at: 2016-09-21T13:09:04+00:00
[INFO] Final Memory: 51M/1095M
[INFO] ------------------------------------------------------------------------
[ERROR] Failed to execute goal org.apache.maven.plugins:maven-surefire-plugin:2.19.1:test (default-test) on project bookkeeper-server: There are test failures.
[ERROR]
[ERROR] Please refer to <https://builds.apache.org/job/bookkeeper-master/ws/bookkeeper-server/target/surefire-reports> for the individual test results.
[ERROR] -> [Help 1]
[ERROR]
[ERROR] To see the full stack trace of the errors, re-run Maven with the -e switch.
[ERROR] Re-run Maven using the -X switch to enable full debug logging.
[ERROR]
[ERROR] For more information about the errors and possible solutions, please read the following articles:
[ERROR] [Help 1] http://cwiki.apache.org/confluence/display/MAVEN/MojoFailureException
[ERROR]
[ERROR] After correcting the problems, you can resume the build with the command
[ERROR] mvn <goals> -rf :bookkeeper-server
Build step 'Execute shell' marked build as failure
Recording test results
Jenkins build is back to normal : bookkeeper-master #1512
Posted by Apache Jenkins Server <je...@builds.apache.org>.
See <https://builds.apache.org/job/bookkeeper-master/1512/>