You are viewing a plain text version of this content. The canonical link for it is here.
Posted to builds@beam.apache.org by Apache Jenkins Server <je...@builds.apache.org> on 2023/07/05 17:53:17 UTC
Build failed in Jenkins: beam_PostCommit_Java_SingleStoreIO_IT #789
See <https://ci-beam.apache.org/job/beam_PostCommit_Java_SingleStoreIO_IT/789/display/redirect>
Changes:
------------------------------------------
[...truncated 355.04 KB...]
> Task :sdks:java:extensions:python:compileTestJava FROM-CACHE
Custom actions are attached to task ':sdks:java:extensions:python:compileTestJava'.
Build cache key for task ':sdks:java:extensions:python:compileTestJava' is b2fcb48e034c7338a8c274e8554da1e0
Task ':sdks:java:extensions:python:compileTestJava' is not up-to-date because:
No history is available.
Loaded cache entry for task ':sdks:java:extensions:python:compileTestJava' with cache key b2fcb48e034c7338a8c274e8554da1e0
Resolve mutations for :sdks:java:extensions:python:testClasses (Thread[Execution worker,5,main]) started.
Resolve mutations for :sdks:java:extensions:python:testClasses (Thread[Execution worker,5,main]) completed. Took 0.0 secs.
:sdks:java:extensions:python:testClasses (Thread[Execution worker Thread 5,5,main]) started.
:sdks:java:extensions:python:compileTestJava (Thread[Execution worker Thread 3,5,main]) completed. Took 0.134 secs.
> Task :sdks:java:extensions:python:testClasses UP-TO-DATE
Skipping task ':sdks:java:extensions:python:testClasses' as it has no actions.
:sdks:java:extensions:python:testClasses (Thread[Execution worker Thread 5,5,main]) completed. Took 0.0 secs.
Resolve mutations for :sdks:java:extensions:python:testJar (Thread[Execution worker,5,main]) started.
Resolve mutations for :sdks:java:extensions:python:testJar (Thread[Execution worker,5,main]) completed. Took 0.0 secs.
:sdks:java:extensions:python:testJar (Thread[Execution worker,5,main]) started.
> Task :sdks:java:extensions:python:testJar
Caching disabled for task ':sdks:java:extensions:python:testJar' because:
Not worth caching
Task ':sdks:java:extensions:python:testJar' is not up-to-date because:
No history is available.
file or directory '<https://ci-beam.apache.org/job/beam_PostCommit_Java_SingleStoreIO_IT/ws/src/sdks/java/extensions/python/build/resources/test',> not found
:sdks:java:extensions:python:testJar (Thread[Execution worker,5,main]) completed. Took 0.013 secs.
work action resolve beam-sdks-java-extensions-python-tests.jar (project :sdks:java:extensions:python) (Thread[Execution worker Thread 5,5,main]) started.
work action null (Thread[Execution worker Thread 5,5,main]) completed. Took 0.0 secs.
> Task :runners:direct-java:compileTestJava FROM-CACHE
Custom actions are attached to task ':runners:direct-java:compileTestJava'.
Build cache key for task ':runners:direct-java:compileTestJava' is 5ff58106d8698311d7284af2ec1a8bf8
Task ':runners:direct-java:compileTestJava' is not up-to-date because:
No history is available.
Loaded cache entry for task ':runners:direct-java:compileTestJava' with cache key 5ff58106d8698311d7284af2ec1a8bf8
:runners:direct-java:compileTestJava (Thread[Execution worker Thread 7,5,main]) completed. Took 0.234 secs.
Resolve mutations for :runners:direct-java:testClasses (Thread[Execution worker,5,main]) started.
Resolve mutations for :runners:direct-java:testClasses (Thread[Execution worker,5,main]) completed. Took 0.0 secs.
:runners:direct-java:testClasses (Thread[Execution worker,5,main]) started.
> Task :runners:direct-java:testClasses UP-TO-DATE
Skipping task ':runners:direct-java:testClasses' as it has no actions.
:runners:direct-java:testClasses (Thread[Execution worker,5,main]) completed. Took 0.0 secs.
Resolve mutations for :runners:direct-java:shadowTestJar (Thread[Execution worker,5,main]) started.
Resolve mutations for :runners:direct-java:shadowTestJar (Thread[Execution worker,5,main]) completed. Took 0.0 secs.
:runners:direct-java:shadowTestJar (Thread[Execution worker,5,main]) started.
> Task :sdks:java:io:google-cloud-platform:jar
Caching disabled for task ':sdks:java:io:google-cloud-platform:jar' because:
Not worth caching
Task ':sdks:java:io:google-cloud-platform:jar' is not up-to-date because:
No history is available.
file or directory '<https://ci-beam.apache.org/job/beam_PostCommit_Java_SingleStoreIO_IT/ws/src/sdks/java/io/google-cloud-platform/build/resources/main',> not found
:sdks:java:io:google-cloud-platform:jar (Thread[Execution worker Thread 2,5,main]) completed. Took 0.513 secs.
work action resolve beam-sdks-java-io-google-cloud-platform.jar (project :sdks:java:io:google-cloud-platform) (Thread[Execution worker Thread 7,5,main]) started.
work action null (Thread[Execution worker Thread 7,5,main]) completed. Took 0.0 secs.
Resolve mutations for :runners:google-cloud-dataflow-java:compileJava (Thread[Execution worker Thread 7,5,main]) started.
Resolve mutations for :runners:google-cloud-dataflow-java:compileJava (Thread[Execution worker Thread 7,5,main]) completed. Took 0.0 secs.
:runners:google-cloud-dataflow-java:compileJava (Thread[Execution worker Thread 7,5,main]) started.
> Task :runners:direct-java:shadowTestJar FROM-CACHE
Build cache key for task ':runners:direct-java:shadowTestJar' is 2712b387897d06c5464589f84083d484
Task ':runners:direct-java:shadowTestJar' is not up-to-date because:
No history is available.
Loaded cache entry for task ':runners:direct-java:shadowTestJar' with cache key 2712b387897d06c5464589f84083d484
:runners:direct-java:shadowTestJar (Thread[Execution worker,5,main]) completed. Took 0.288 secs.
work action resolve beam-runners-direct-java-tests.jar (project :runners:direct-java) (Thread[Execution worker Thread 5,5,main]) started.
work action null (Thread[Execution worker Thread 5,5,main]) completed. Took 0.0 secs.
Resolve mutations for :sdks:java:io:singlestore:compileTestJava (Thread[Execution worker Thread 5,5,main]) started.
Resolve mutations for :sdks:java:io:singlestore:compileTestJava (Thread[Execution worker Thread 5,5,main]) completed. Took 0.0 secs.
:sdks:java:io:singlestore:compileTestJava (Thread[Execution worker Thread 6,5,main]) started.
> Task :sdks:java:io:singlestore:compileTestJava FROM-CACHE
Custom actions are attached to task ':sdks:java:io:singlestore:compileTestJava'.
Build cache key for task ':sdks:java:io:singlestore:compileTestJava' is 665f0cde7fca4281dba040ba3b33eccc
Task ':sdks:java:io:singlestore:compileTestJava' is not up-to-date because:
No history is available.
Loaded cache entry for task ':sdks:java:io:singlestore:compileTestJava' with cache key 665f0cde7fca4281dba040ba3b33eccc
:sdks:java:io:singlestore:compileTestJava (Thread[Execution worker Thread 6,5,main]) completed. Took 0.312 secs.
Resolve mutations for :sdks:java:io:singlestore:testClasses (Thread[Execution worker Thread 5,5,main]) started.
Resolve mutations for :sdks:java:io:singlestore:testClasses (Thread[Execution worker Thread 5,5,main]) completed. Took 0.0 secs.
:sdks:java:io:singlestore:testClasses (Thread[Execution worker Thread 2,5,main]) started.
> Task :sdks:java:io:singlestore:testClasses UP-TO-DATE
Skipping task ':sdks:java:io:singlestore:testClasses' as it has no actions.
:sdks:java:io:singlestore:testClasses (Thread[Execution worker Thread 2,5,main]) completed. Took 0.0 secs.
> Task :runners:google-cloud-dataflow-java:compileJava FROM-CACHE
Custom actions are attached to task ':runners:google-cloud-dataflow-java:compileJava'.
Build cache key for task ':runners:google-cloud-dataflow-java:compileJava' is 711cc180bda5cf55b060a81395e34dba
Task ':runners:google-cloud-dataflow-java:compileJava' is not up-to-date because:
No history is available.
Loaded cache entry for task ':runners:google-cloud-dataflow-java:compileJava' with cache key 711cc180bda5cf55b060a81395e34dba
:runners:google-cloud-dataflow-java:compileJava (Thread[Execution worker Thread 7,5,main]) completed. Took 0.495 secs.
Resolve mutations for :runners:google-cloud-dataflow-java:classes (Thread[Execution worker Thread 7,5,main]) started.
Resolve mutations for :runners:google-cloud-dataflow-java:classes (Thread[Execution worker Thread 7,5,main]) completed. Took 0.0 secs.
:runners:google-cloud-dataflow-java:classes (Thread[Execution worker Thread 3,5,main]) started.
> Task :runners:google-cloud-dataflow-java:classes
Skipping task ':runners:google-cloud-dataflow-java:classes' as it has no actions.
:runners:google-cloud-dataflow-java:classes (Thread[Execution worker Thread 3,5,main]) completed. Took 0.0 secs.
Resolve mutations for :runners:google-cloud-dataflow-java:jar (Thread[Execution worker Thread 5,5,main]) started.
Resolve mutations for :runners:google-cloud-dataflow-java:jar (Thread[Execution worker Thread 5,5,main]) completed. Took 0.0 secs.
:runners:google-cloud-dataflow-java:jar (Thread[Execution worker Thread 2,5,main]) started.
> Task :sdks:java:extensions:protobuf:extractIncludeTestProto
Caching disabled for task ':sdks:java:extensions:protobuf:extractIncludeTestProto' because:
Caching has not been enabled for the task
Task ':sdks:java:extensions:protobuf:extractIncludeTestProto' is not up-to-date because:
No history is available.
:sdks:java:extensions:protobuf:extractIncludeTestProto (Thread[included builds,5,main]) completed. Took 1.79 secs.
Resolve mutations for :sdks:java:extensions:protobuf:generateTestProto (Thread[Execution worker Thread 7,5,main]) started.
Resolve mutations for :sdks:java:extensions:protobuf:generateTestProto (Thread[Execution worker Thread 7,5,main]) completed. Took 0.0 secs.
:sdks:java:extensions:protobuf:generateTestProto (Thread[Execution worker Thread 5,5,main]) started.
> Task :sdks:java:extensions:protobuf:generateTestProto FROM-CACHE
Build cache key for task ':sdks:java:extensions:protobuf:generateTestProto' is 36f42d7e1d6ad10115110f7f69ab71c2
Task ':sdks:java:extensions:protobuf:generateTestProto' is not up-to-date because:
No history is available.
Loaded cache entry for task ':sdks:java:extensions:protobuf:generateTestProto' with cache key 36f42d7e1d6ad10115110f7f69ab71c2
:sdks:java:extensions:protobuf:generateTestProto (Thread[Execution worker Thread 5,5,main]) completed. Took 0.039 secs.
Resolve mutations for :sdks:java:extensions:protobuf:compileTestJava (Thread[Execution worker Thread 3,5,main]) started.
Resolve mutations for :sdks:java:extensions:protobuf:compileTestJava (Thread[Execution worker Thread 3,5,main]) completed. Took 0.0 secs.
:sdks:java:extensions:protobuf:compileTestJava (Thread[Execution worker Thread 3,5,main]) started.
> Task :runners:google-cloud-dataflow-java:jar
Caching disabled for task ':runners:google-cloud-dataflow-java:jar' because:
Not worth caching
Task ':runners:google-cloud-dataflow-java:jar' is not up-to-date because:
No history is available.
:runners:google-cloud-dataflow-java:jar (Thread[Execution worker Thread 2,5,main]) completed. Took 0.084 secs.
work action resolve beam-runners-google-cloud-dataflow-java.jar (project :runners:google-cloud-dataflow-java) (Thread[Execution worker Thread 7,5,main]) started.
work action null (Thread[Execution worker Thread 7,5,main]) completed. Took 0.0 secs.
> Task :sdks:java:extensions:protobuf:compileTestJava FROM-CACHE
Custom actions are attached to task ':sdks:java:extensions:protobuf:compileTestJava'.
Build cache key for task ':sdks:java:extensions:protobuf:compileTestJava' is 4fc6ea862eb98dbe0d8f52e631f06d8c
Task ':sdks:java:extensions:protobuf:compileTestJava' is not up-to-date because:
No history is available.
Loaded cache entry for task ':sdks:java:extensions:protobuf:compileTestJava' with cache key 4fc6ea862eb98dbe0d8f52e631f06d8c
:sdks:java:extensions:protobuf:compileTestJava (Thread[Execution worker Thread 3,5,main]) completed. Took 0.107 secs.
Resolve mutations for :sdks:java:extensions:protobuf:testClasses (Thread[Execution worker Thread 2,5,main]) started.
Resolve mutations for :sdks:java:extensions:protobuf:testClasses (Thread[Execution worker Thread 2,5,main]) completed. Took 0.0 secs.
:sdks:java:extensions:protobuf:testClasses (Thread[Execution worker Thread 7,5,main]) started.
> Task :sdks:java:extensions:protobuf:testClasses
Skipping task ':sdks:java:extensions:protobuf:testClasses' as it has no actions.
:sdks:java:extensions:protobuf:testClasses (Thread[Execution worker Thread 7,5,main]) completed. Took 0.0 secs.
Resolve mutations for :sdks:java:extensions:protobuf:testJar (Thread[Execution worker Thread 4,5,main]) started.
Resolve mutations for :sdks:java:extensions:protobuf:testJar (Thread[Execution worker Thread 4,5,main]) completed. Took 0.0 secs.
:sdks:java:extensions:protobuf:testJar (Thread[Execution worker Thread 2,5,main]) started.
> Task :sdks:java:extensions:protobuf:testJar
Caching disabled for task ':sdks:java:extensions:protobuf:testJar' because:
Not worth caching
Task ':sdks:java:extensions:protobuf:testJar' is not up-to-date because:
No history is available.
:sdks:java:extensions:protobuf:testJar (Thread[Execution worker Thread 2,5,main]) completed. Took 0.075 secs.
work action resolve beam-sdks-java-extensions-protobuf-tests.jar (project :sdks:java:extensions:protobuf) (Thread[Execution worker Thread 7,5,main]) started.
work action null (Thread[Execution worker Thread 7,5,main]) completed. Took 0.0 secs.
Resolve mutations for :sdks:java:io:google-cloud-platform:compileTestJava (Thread[Execution worker Thread 4,5,main]) started.
Resolve mutations for :sdks:java:io:google-cloud-platform:compileTestJava (Thread[Execution worker Thread 4,5,main]) completed. Took 0.0 secs.
:sdks:java:io:google-cloud-platform:compileTestJava (Thread[Execution worker Thread 2,5,main]) started.
> Task :sdks:java:io:google-cloud-platform:compileTestJava FROM-CACHE
Custom actions are attached to task ':sdks:java:io:google-cloud-platform:compileTestJava'.
Build cache key for task ':sdks:java:io:google-cloud-platform:compileTestJava' is 714ff67077e5e73703ca5572524598dc
Task ':sdks:java:io:google-cloud-platform:compileTestJava' is not up-to-date because:
No history is available.
Loaded cache entry for task ':sdks:java:io:google-cloud-platform:compileTestJava' with cache key 714ff67077e5e73703ca5572524598dc
:sdks:java:io:google-cloud-platform:compileTestJava (Thread[Execution worker Thread 2,5,main]) completed. Took 1.081 secs.
Resolve mutations for :sdks:java:io:google-cloud-platform:testClasses (Thread[Execution worker,5,main]) started.
Resolve mutations for :sdks:java:io:google-cloud-platform:testClasses (Thread[Execution worker,5,main]) completed. Took 0.0 secs.
:sdks:java:io:google-cloud-platform:testClasses (Thread[Execution worker,5,main]) started.
> Task :sdks:java:io:google-cloud-platform:testClasses
Skipping task ':sdks:java:io:google-cloud-platform:testClasses' as it has no actions.
:sdks:java:io:google-cloud-platform:testClasses (Thread[Execution worker,5,main]) completed. Took 0.0 secs.
Resolve mutations for :sdks:java:io:google-cloud-platform:testJar (Thread[Execution worker Thread 6,5,main]) started.
Resolve mutations for :sdks:java:io:google-cloud-platform:testJar (Thread[Execution worker Thread 6,5,main]) completed. Took 0.0 secs.
:sdks:java:io:google-cloud-platform:testJar (Thread[Execution worker Thread 2,5,main]) started.
> Task :sdks:java:io:google-cloud-platform:testJar
Caching disabled for task ':sdks:java:io:google-cloud-platform:testJar' because:
Not worth caching
Task ':sdks:java:io:google-cloud-platform:testJar' is not up-to-date because:
No history is available.
:sdks:java:io:google-cloud-platform:testJar (Thread[Execution worker Thread 2,5,main]) completed. Took 0.39 secs.
work action resolve beam-sdks-java-io-google-cloud-platform-tests.jar (project :sdks:java:io:google-cloud-platform) (Thread[Execution worker Thread 4,5,main]) started.
work action null (Thread[Execution worker Thread 4,5,main]) completed. Took 0.0 secs.
Resolve mutations for :runners:google-cloud-dataflow-java:compileTestJava (Thread[Execution worker Thread 4,5,main]) started.
Resolve mutations for :runners:google-cloud-dataflow-java:compileTestJava (Thread[Execution worker Thread 4,5,main]) completed. Took 0.0 secs.
:runners:google-cloud-dataflow-java:compileTestJava (Thread[Execution worker Thread 2,5,main]) started.
> Task :runners:google-cloud-dataflow-java:compileTestJava FROM-CACHE
Custom actions are attached to task ':runners:google-cloud-dataflow-java:compileTestJava'.
Build cache key for task ':runners:google-cloud-dataflow-java:compileTestJava' is 8be8560e1f0a3f8d8a901d694332db55
Task ':runners:google-cloud-dataflow-java:compileTestJava' is not up-to-date because:
No history is available.
Loaded cache entry for task ':runners:google-cloud-dataflow-java:compileTestJava' with cache key 8be8560e1f0a3f8d8a901d694332db55
:runners:google-cloud-dataflow-java:compileTestJava (Thread[Execution worker Thread 2,5,main]) completed. Took 0.401 secs.
Resolve mutations for :runners:google-cloud-dataflow-java:testClasses (Thread[Execution worker Thread 4,5,main]) started.
Resolve mutations for :runners:google-cloud-dataflow-java:testClasses (Thread[Execution worker Thread 4,5,main]) completed. Took 0.0 secs.
:runners:google-cloud-dataflow-java:testClasses (Thread[Execution worker Thread 7,5,main]) started.
> Task :runners:google-cloud-dataflow-java:testClasses UP-TO-DATE
Skipping task ':runners:google-cloud-dataflow-java:testClasses' as it has no actions.
:runners:google-cloud-dataflow-java:testClasses (Thread[Execution worker Thread 7,5,main]) completed. Took 0.0 secs.
Resolve mutations for :runners:google-cloud-dataflow-java:testJar (Thread[Execution worker Thread 2,5,main]) started.
Resolve mutations for :runners:google-cloud-dataflow-java:testJar (Thread[Execution worker Thread 2,5,main]) completed. Took 0.0 secs.
:runners:google-cloud-dataflow-java:testJar (Thread[Execution worker Thread 6,5,main]) started.
> Task :runners:google-cloud-dataflow-java:testJar
Caching disabled for task ':runners:google-cloud-dataflow-java:testJar' because:
Not worth caching
Task ':runners:google-cloud-dataflow-java:testJar' is not up-to-date because:
No history is available.
file or directory '<https://ci-beam.apache.org/job/beam_PostCommit_Java_SingleStoreIO_IT/ws/src/runners/google-cloud-dataflow-java/build/resources/test',> not found
:runners:google-cloud-dataflow-java:testJar (Thread[Execution worker Thread 6,5,main]) completed. Took 0.047 secs.
work action resolve beam-runners-google-cloud-dataflow-java-tests.jar (project :runners:google-cloud-dataflow-java) (Thread[Execution worker Thread 7,5,main]) started.
work action null (Thread[Execution worker Thread 7,5,main]) completed. Took 0.0 secs.
FAILURE: Build failed with an exception.
* What went wrong:
Execution failed for task ':runners:google-cloud-dataflow-java:worker:windmill:generateProto'.
> protoc: stdout: . stderr: windmill.proto:519:68: Field number 26 has already been used in "windmill.WorkItemCommitRequest" by field "multimap_updates".
* Try:
> Run with --stacktrace option to get the stack trace.
> Run with --debug option to get more log output.
* Get more help at https://help.gradle.org
Deprecated Gradle features were used in this build, making it incompatible with Gradle 8.0.
You can use '--warning-mode all' to show the individual deprecation warnings and determine if they come from your own scripts or plugins.
See https://docs.gradle.org/7.5.1/userguide/command_line_interface.html#sec:command_line_warnings
BUILD FAILED in 49s
142 actionable tasks: 84 executed, 56 from cache, 2 up-to-date
Publishing build scan...
https://ge.apache.org/s/l2ys6vl7qxemw
Build step 'Invoke Gradle script' changed build result to FAILURE
Build step 'Invoke Gradle script' marked build as failure
---------------------------------------------------------------------
To unsubscribe, e-mail: builds-unsubscribe@beam.apache.org
For additional commands, e-mail: builds-help@beam.apache.org
Jenkins build is back to normal : beam_PostCommit_Java_SingleStoreIO_IT #790
Posted by Apache Jenkins Server <je...@builds.apache.org>.
See <https://ci-beam.apache.org/job/beam_PostCommit_Java_SingleStoreIO_IT/790/display/redirect>
---------------------------------------------------------------------
To unsubscribe, e-mail: builds-unsubscribe@beam.apache.org
For additional commands, e-mail: builds-help@beam.apache.org