You are viewing a plain text version of this content. The canonical link for it is here.
Posted to dev@royale.apache.org by ap...@gmail.com on 2018/10/01 07:12:25 UTC
Build failed in Jenkins: royale-compiler #473
See <http://apacheroyaleci.westus2.cloudapp.azure.com:8080/job/royale-compiler/473/display/redirect?page=changes>
Changes:
[om] Revert everything to 0.9.4
[om] [maven-release-plugin] prepare branch release/0.9.4
[om] [maven-release-plugin] prepare for next development iteration
------------------------------------------
[...truncated 269.25 KB...]
[javac] symbol: class ABCConstants
[javac] location: package org.apache.royale.abc
[javac] <http://apacheroyaleci.westus2.cloudapp.azure.com:8080/job/royale-compiler/ws/compiler/src/main/java/org/apache/royale/abc/ABCEmitter.java>:42: error: static import only from classes and interfaces
[javac] import static org.apache.royale.abc.ABCConstants.OP_callsupervoid;
[javac] ^
[javac] <http://apacheroyaleci.westus2.cloudapp.azure.com:8080/job/royale-compiler/ws/compiler/src/main/java/org/apache/royale/abc/ABCEmitter.java>:43: error: cannot find symbol
[javac] import static org.apache.royale.abc.ABCConstants.OP_coerce;
[javac] ^
[javac] symbol: class ABCConstants
[javac] location: package org.apache.royale.abc
[javac] <http://apacheroyaleci.westus2.cloudapp.azure.com:8080/job/royale-compiler/ws/compiler/src/main/java/org/apache/royale/abc/ABCEmitter.java>:43: error: static import only from classes and interfaces
[javac] import static org.apache.royale.abc.ABCConstants.OP_coerce;
[javac] ^
[javac] <http://apacheroyaleci.westus2.cloudapp.azure.com:8080/job/royale-compiler/ws/compiler/src/main/java/org/apache/royale/abc/ABCEmitter.java>:44: error: cannot find symbol
[javac] import static org.apache.royale.abc.ABCConstants.OP_construct;
[javac] ^
[javac] symbol: class ABCConstants
[javac] location: package org.apache.royale.abc
[javac] <http://apacheroyaleci.westus2.cloudapp.azure.com:8080/job/royale-compiler/ws/compiler/src/main/java/org/apache/royale/abc/ABCEmitter.java>:44: error: static import only from classes and interfaces
[javac] import static org.apache.royale.abc.ABCConstants.OP_construct;
[javac] ^
[javac] <http://apacheroyaleci.westus2.cloudapp.azure.com:8080/job/royale-compiler/ws/compiler/src/main/java/org/apache/royale/abc/ABCEmitter.java>:45: error: cannot find symbol
[javac] import static org.apache.royale.abc.ABCConstants.OP_constructprop;
[javac] ^
[javac] symbol: class ABCConstants
[javac] location: package org.apache.royale.abc
[javac] <http://apacheroyaleci.westus2.cloudapp.azure.com:8080/job/royale-compiler/ws/compiler/src/main/java/org/apache/royale/abc/ABCEmitter.java>:45: error: static import only from classes and interfaces
[javac] import static org.apache.royale.abc.ABCConstants.OP_constructprop;
[javac] ^
[javac] <http://apacheroyaleci.westus2.cloudapp.azure.com:8080/job/royale-compiler/ws/compiler/src/main/java/org/apache/royale/abc/ABCEmitter.java>:46: error: cannot find symbol
[javac] import static org.apache.royale.abc.ABCConstants.OP_constructsuper;
[javac] ^
[javac] symbol: class ABCConstants
[javac] location: package org.apache.royale.abc
[javac] <http://apacheroyaleci.westus2.cloudapp.azure.com:8080/job/royale-compiler/ws/compiler/src/main/java/org/apache/royale/abc/ABCEmitter.java>:46: error: static import only from classes and interfaces
[javac] import static org.apache.royale.abc.ABCConstants.OP_constructsuper;
[javac] ^
[javac] <http://apacheroyaleci.westus2.cloudapp.azure.com:8080/job/royale-compiler/ws/compiler/src/main/java/org/apache/royale/abc/ABCEmitter.java>:47: error: cannot find symbol
[javac] import static org.apache.royale.abc.ABCConstants.OP_debug;
[javac] ^
[javac] symbol: class ABCConstants
[javac] location: package org.apache.royale.abc
[javac] <http://apacheroyaleci.westus2.cloudapp.azure.com:8080/job/royale-compiler/ws/compiler/src/main/java/org/apache/royale/abc/ABCEmitter.java>:47: error: static import only from classes and interfaces
[javac] import static org.apache.royale.abc.ABCConstants.OP_debug;
[javac] ^
[javac] <http://apacheroyaleci.westus2.cloudapp.azure.com:8080/job/royale-compiler/ws/compiler/src/main/java/org/apache/royale/abc/ABCEmitter.java>:48: error: cannot find symbol
[javac] import static org.apache.royale.abc.ABCConstants.OP_debugfile;
[javac] ^
[javac] symbol: class ABCConstants
[javac] location: package org.apache.royale.abc
[javac] <http://apacheroyaleci.westus2.cloudapp.azure.com:8080/job/royale-compiler/ws/compiler/src/main/java/org/apache/royale/abc/ABCEmitter.java>:48: error: static import only from classes and interfaces
[javac] import static org.apache.royale.abc.ABCConstants.OP_debugfile;
[javac] ^
[javac] <http://apacheroyaleci.westus2.cloudapp.azure.com:8080/job/royale-compiler/ws/compiler/src/main/java/org/apache/royale/abc/ABCEmitter.java>:49: error: cannot find symbol
[javac] import static org.apache.royale.abc.ABCConstants.OP_debugline;
[javac] ^
[javac] symbol: class ABCConstants
[javac] location: package org.apache.royale.abc
[javac] <http://apacheroyaleci.westus2.cloudapp.azure.com:8080/job/royale-compiler/ws/compiler/src/main/java/org/apache/royale/abc/ABCEmitter.java>:49: error: static import only from classes and interfaces
[javac] import static org.apache.royale.abc.ABCConstants.OP_debugline;
[javac] ^
[javac] <http://apacheroyaleci.westus2.cloudapp.azure.com:8080/job/royale-compiler/ws/compiler/src/main/java/org/apache/royale/abc/ABCEmitter.java>:50: error: cannot find symbol
[javac] import static org.apache.royale.abc.ABCConstants.OP_declocal;
[javac] ^
[javac] symbol: class ABCConstants
[javac] location: package org.apache.royale.abc
[javac] <http://apacheroyaleci.westus2.cloudapp.azure.com:8080/job/royale-compiler/ws/compiler/src/main/java/org/apache/royale/abc/ABCEmitter.java>:50: error: static import only from classes and interfaces
[javac] import static org.apache.royale.abc.ABCConstants.OP_declocal;
[javac] ^
[javac] <http://apacheroyaleci.westus2.cloudapp.azure.com:8080/job/royale-compiler/ws/compiler/src/main/java/org/apache/royale/abc/ABCEmitter.java>:51: error: cannot find symbol
[javac] import static org.apache.royale.abc.ABCConstants.OP_declocal_i;
[javac] ^
[javac] symbol: class ABCConstants
[javac] location: package org.apache.royale.abc
[javac] <http://apacheroyaleci.westus2.cloudapp.azure.com:8080/job/royale-compiler/ws/compiler/src/main/java/org/apache/royale/abc/ABCEmitter.java>:51: error: static import only from classes and interfaces
[javac] import static org.apache.royale.abc.ABCConstants.OP_declocal_i;
[javac] ^
[javac] <http://apacheroyaleci.westus2.cloudapp.azure.com:8080/job/royale-compiler/ws/compiler/src/main/java/org/apache/royale/abc/ABCEmitter.java>:52: error: cannot find symbol
[javac] import static org.apache.royale.abc.ABCConstants.OP_deleteproperty;
[javac] ^
[javac] symbol: class ABCConstants
[javac] location: package org.apache.royale.abc
[javac] <http://apacheroyaleci.westus2.cloudapp.azure.com:8080/job/royale-compiler/ws/compiler/src/main/java/org/apache/royale/abc/ABCEmitter.java>:52: error: static import only from classes and interfaces
[javac] import static org.apache.royale.abc.ABCConstants.OP_deleteproperty;
[javac] ^
[javac] <http://apacheroyaleci.westus2.cloudapp.azure.com:8080/job/royale-compiler/ws/compiler/src/main/java/org/apache/royale/abc/ABCEmitter.java>:53: error: cannot find symbol
[javac] import static org.apache.royale.abc.ABCConstants.OP_dxns;
[javac] ^
[javac] symbol: class ABCConstants
[javac] location: package org.apache.royale.abc
[javac] <http://apacheroyaleci.westus2.cloudapp.azure.com:8080/job/royale-compiler/ws/compiler/src/main/java/org/apache/royale/abc/ABCEmitter.java>:53: error: static import only from classes and interfaces
[javac] import static org.apache.royale.abc.ABCConstants.OP_dxns;
[javac] ^
[javac] <http://apacheroyaleci.westus2.cloudapp.azure.com:8080/job/royale-compiler/ws/compiler/src/main/java/org/apache/royale/abc/ABCEmitter.java>:54: error: cannot find symbol
[javac] import static org.apache.royale.abc.ABCConstants.OP_finddef;
[javac] ^
[javac] symbol: class ABCConstants
[javac] location: package org.apache.royale.abc
[javac] <http://apacheroyaleci.westus2.cloudapp.azure.com:8080/job/royale-compiler/ws/compiler/src/main/java/org/apache/royale/abc/ABCEmitter.java>:54: error: static import only from classes and interfaces
[javac] import static org.apache.royale.abc.ABCConstants.OP_finddef;
[javac] ^
[javac] <http://apacheroyaleci.westus2.cloudapp.azure.com:8080/job/royale-compiler/ws/compiler/src/main/java/org/apache/royale/abc/ABCEmitter.java>:55: error: cannot find symbol
[javac] import static org.apache.royale.abc.ABCConstants.OP_findproperty;
[javac] ^
[javac] symbol: class ABCConstants
[javac] location: package org.apache.royale.abc
[javac] <http://apacheroyaleci.westus2.cloudapp.azure.com:8080/job/royale-compiler/ws/compiler/src/main/java/org/apache/royale/abc/ABCEmitter.java>:55: error: static import only from classes and interfaces
[javac] import static org.apache.royale.abc.ABCConstants.OP_findproperty;
[javac] ^
[javac] <http://apacheroyaleci.westus2.cloudapp.azure.com:8080/job/royale-compiler/ws/compiler/src/main/java/org/apache/royale/abc/ABCEmitter.java>:56: error: cannot find symbol
[javac] import static org.apache.royale.abc.ABCConstants.OP_findpropstrict;
[javac] ^
[javac] symbol: class ABCConstants
[javac] location: package org.apache.royale.abc
[javac] <http://apacheroyaleci.westus2.cloudapp.azure.com:8080/job/royale-compiler/ws/compiler/src/main/java/org/apache/royale/abc/ABCEmitter.java>:56: error: static import only from classes and interfaces
[javac] import static org.apache.royale.abc.ABCConstants.OP_findpropstrict;
[javac] ^
[javac] <http://apacheroyaleci.westus2.cloudapp.azure.com:8080/job/royale-compiler/ws/compiler/src/main/java/org/apache/royale/abc/ABCEmitter.java>:57: error: cannot find symbol
[javac] import static org.apache.royale.abc.ABCConstants.OP_getdescendants;
[javac] ^
[javac] symbol: class ABCConstants
[javac] location: package org.apache.royale.abc
[javac] <http://apacheroyaleci.westus2.cloudapp.azure.com:8080/job/royale-compiler/ws/compiler/src/main/java/org/apache/royale/abc/ABCEmitter.java>:57: error: static import only from classes and interfaces
[javac] import static org.apache.royale.abc.ABCConstants.OP_getdescendants;
[javac] ^
[javac] <http://apacheroyaleci.westus2.cloudapp.azure.com:8080/job/royale-compiler/ws/compiler/src/main/java/org/apache/royale/abc/ABCEmitter.java>:58: error: cannot find symbol
[javac] import static org.apache.royale.abc.ABCConstants.OP_getglobalslot;
[javac] ^
[javac] symbol: class ABCConstants
[javac] location: package org.apache.royale.abc
[javac] <http://apacheroyaleci.westus2.cloudapp.azure.com:8080/job/royale-compiler/ws/compiler/src/main/java/org/apache/royale/abc/ABCEmitter.java>:58: error: static import only from classes and interfaces
[javac] import static org.apache.royale.abc.ABCConstants.OP_getglobalslot;
[javac] ^
[javac] <http://apacheroyaleci.westus2.cloudapp.azure.com:8080/job/royale-compiler/ws/compiler/src/main/java/org/apache/royale/abc/ABCEmitter.java>:59: error: cannot find symbol
[javac] import static org.apache.royale.abc.ABCConstants.OP_getlex;
[javac] ^
[javac] symbol: class ABCConstants
[javac] location: package org.apache.royale.abc
[javac] <http://apacheroyaleci.westus2.cloudapp.azure.com:8080/job/royale-compiler/ws/compiler/src/main/java/org/apache/royale/abc/ABCEmitter.java>:59: error: static import only from classes and interfaces
[javac] import static org.apache.royale.abc.ABCConstants.OP_getlex;
[javac] ^
[javac] <http://apacheroyaleci.westus2.cloudapp.azure.com:8080/job/royale-compiler/ws/compiler/src/main/java/org/apache/royale/abc/ABCEmitter.java>:60: error: cannot find symbol
[javac] import static org.apache.royale.abc.ABCConstants.OP_getlocal;
[javac] ^
[javac] symbol: class ABCConstants
[javac] location: package org.apache.royale.abc
[javac] <http://apacheroyaleci.westus2.cloudapp.azure.com:8080/job/royale-compiler/ws/compiler/src/main/java/org/apache/royale/abc/ABCEmitter.java>:60: error: static import only from classes and interfaces
[javac] import static org.apache.royale.abc.ABCConstants.OP_getlocal;
[javac] ^
[javac] <http://apacheroyaleci.westus2.cloudapp.azure.com:8080/job/royale-compiler/ws/compiler/src/main/java/org/apache/royale/abc/ABCEmitter.java>:61: error: cannot find symbol
[javac] import static org.apache.royale.abc.ABCConstants.OP_getlocal0;
[javac] ^
[javac] symbol: class ABCConstants
[javac] location: package org.apache.royale.abc
[javac] <http://apacheroyaleci.westus2.cloudapp.azure.com:8080/job/royale-compiler/ws/compiler/src/main/java/org/apache/royale/abc/ABCEmitter.java>:61: error: static import only from classes and interfaces
[javac] import static org.apache.royale.abc.ABCConstants.OP_getlocal0;
[javac] ^
[javac] <http://apacheroyaleci.westus2.cloudapp.azure.com:8080/job/royale-compiler/ws/compiler/src/main/java/org/apache/royale/abc/ABCEmitter.java>:62: error: cannot find symbol
[javac] import static org.apache.royale.abc.ABCConstants.OP_getproperty;
[javac] ^
[javac] symbol: class ABCConstants
[javac] location: package org.apache.royale.abc
[javac] <http://apacheroyaleci.westus2.cloudapp.azure.com:8080/job/royale-compiler/ws/compiler/src/main/java/org/apache/royale/abc/ABCEmitter.java>:62: error: static import only from classes and interfaces
[javac] import static org.apache.royale.abc.ABCConstants.OP_getproperty;
[javac] ^
[javac] <http://apacheroyaleci.westus2.cloudapp.azure.com:8080/job/royale-compiler/ws/compiler/src/main/java/org/apache/royale/abc/ABCEmitter.java>:63: error: cannot find symbol
[javac] import static org.apache.royale.abc.ABCConstants.OP_getscopeobject;
[javac] ^
[javac] symbol: class ABCConstants
[javac] location: package org.apache.royale.abc
[javac] <http://apacheroyaleci.westus2.cloudapp.azure.com:8080/job/royale-compiler/ws/compiler/src/main/java/org/apache/royale/abc/ABCEmitter.java>:63: error: static import only from classes and interfaces
[javac] import static org.apache.royale.abc.ABCConstants.OP_getscopeobject;
[javac] ^
[javac] <http://apacheroyaleci.westus2.cloudapp.azure.com:8080/job/royale-compiler/ws/compiler/src/main/java/org/apache/royale/abc/ABCEmitter.java>:64: error: cannot find symbol
[javac] import static org.apache.royale.abc.ABCConstants.OP_getslot;
[javac] ^
[javac] symbol: class ABCConstants
[javac] location: package org.apache.royale.abc
[javac] <http://apacheroyaleci.westus2.cloudapp.azure.com:8080/job/royale-compiler/ws/compiler/src/main/java/org/apache/royale/abc/ABCEmitter.java>:64: error: static import only from classes and interfaces
[javac] import static org.apache.royale.abc.ABCConstants.OP_getslot;
[javac] ^
[javac] <http://apacheroyaleci.westus2.cloudapp.azure.com:8080/job/royale-compiler/ws/compiler/src/main/java/org/apache/royale/abc/ABCEmitter.java>:65: error: cannot find symbol
[javac] import static org.apache.royale.abc.ABCConstants.OP_getsuper;
[javac] ^
[javac] symbol: class ABCConstants
[javac] location: package org.apache.royale.abc
[javac] <http://apacheroyaleci.westus2.cloudapp.azure.com:8080/job/royale-compiler/ws/compiler/src/main/java/org/apache/royale/abc/ABCEmitter.java>:65: error: static import only from classes and interfaces
[javac] import static org.apache.royale.abc.ABCConstants.OP_getsuper;
[javac] ^
[javac] <http://apacheroyaleci.westus2.cloudapp.azure.com:8080/job/royale-compiler/ws/compiler/src/main/java/org/apache/royale/abc/ABCEmitter.java>:66: error: cannot find symbol
[javac] import static org.apache.royale.abc.ABCConstants.OP_hasnext2;
[javac] ^
[javac] symbol: class ABCConstants
[javac] location: package org.apache.royale.abc
[javac] <http://apacheroyaleci.westus2.cloudapp.azure.com:8080/job/royale-compiler/ws/compiler/src/main/java/org/apache/royale/abc/ABCEmitter.java>:66: error: static import only from classes and interfaces
[javac] import static org.apache.royale.abc.ABCConstants.OP_hasnext2;
[javac] ^
[javac] <http://apacheroyaleci.westus2.cloudapp.azure.com:8080/job/royale-compiler/ws/compiler/src/main/java/org/apache/royale/abc/ABCEmitter.java>:67: error: cannot find symbol
[javac] import static org.apache.royale.abc.ABCConstants.OP_inclocal;
[javac] ^
[javac] symbol: class ABCConstants
[javac] location: package org.apache.royale.abc
[javac] <http://apacheroyaleci.westus2.cloudapp.azure.com:8080/job/royale-compiler/ws/compiler/src/main/java/org/apache/royale/abc/ABCEmitter.java>:67: error: static import only from classes and interfaces
[javac] import static org.apache.royale.abc.ABCConstants.OP_inclocal;
[javac] ^
[javac] <http://apacheroyaleci.westus2.cloudapp.azure.com:8080/job/royale-compiler/ws/compiler/src/main/java/org/apache/royale/abc/ABCEmitter.java>:68: error: cannot find symbol
[javac] import static org.apache.royale.abc.ABCConstants.OP_inclocal_i;
[javac] ^
[javac] symbol: class ABCConstants
[javac] location: package org.apache.royale.abc
[javac] <http://apacheroyaleci.westus2.cloudapp.azure.com:8080/job/royale-compiler/ws/compiler/src/main/java/org/apache/royale/abc/ABCEmitter.java>:68: error: static import only from classes and interfaces
[javac] import static org.apache.royale.abc.ABCConstants.OP_inclocal_i;
[javac] ^
[javac] <http://apacheroyaleci.westus2.cloudapp.azure.com:8080/job/royale-compiler/ws/compiler/src/main/java/org/apache/royale/abc/ABCEmitter.java>:69: error: cannot find symbol
[javac] import static org.apache.royale.abc.ABCConstants.OP_initproperty;
[javac] ^
[javac] symbol: class ABCConstants
[javac] location: package org.apache.royale.abc
[javac] <http://apacheroyaleci.westus2.cloudapp.azure.com:8080/job/royale-compiler/ws/compiler/src/main/java/org/apache/royale/abc/ABCEmitter.java>:69: error: static import only from classes and interfaces
[javac] import static org.apache.royale.abc.ABCConstants.OP_initproperty;
[javac] ^
[javac] <http://apacheroyaleci.westus2.cloudapp.azure.com:8080/job/royale-compiler/ws/compiler/src/main/java/org/apache/royale/abc/ABCEmitter.java>:70: error: cannot find symbol
[javac] import static org.apache.royale.abc.ABCConstants.OP_istype;
[javac] ^
[javac] symbol: class ABCConstants
[javac] location: package org.apache.royale.abc
[javac] <http://apacheroyaleci.westus2.cloudapp.azure.com:8080/job/royale-compiler/ws/compiler/src/main/java/org/apache/royale/abc/ABCEmitter.java>:70: error: static import only from classes and interfaces
[javac] import static org.apache.royale.abc.ABCConstants.OP_istype;
[javac] ^
[javac] <http://apacheroyaleci.westus2.cloudapp.azure.com:8080/job/royale-compiler/ws/compiler/src/main/java/org/apache/royale/abc/ABCEmitter.java>:71: error: cannot find symbol
[javac] import static org.apache.royale.abc.ABCConstants.OP_kill;
[javac] ^
[javac] symbol: class ABCConstants
[javac] location: package org.apache.royale.abc
[javac] <http://apacheroyaleci.westus2.cloudapp.azure.com:8080/job/royale-compiler/ws/compiler/src/main/java/org/apache/royale/compiler/internal/projects/DefinitionPriority.java>:29: warning: [overrides] Class DefinitionPriority overrides equals, but neither it nor any superclass overrides hashCode method
[javac] public final class DefinitionPriority implements IDefinitionPriority
[javac] ^
[javac] <http://apacheroyaleci.westus2.cloudapp.azure.com:8080/job/royale-compiler/ws/compiler/src/main/java/org/apache/royale/compiler/internal/definitions/NamespaceDefinition.java>:1486: warning: [overrides] Class UserDefinedNamespaceReference overrides equals, but neither it nor any superclass overrides hashCode method
[javac] private static class UserDefinedNamespaceReference implements INamespaceResolvedReference
[javac] ^
BUILD FAILED
<http://apacheroyaleci.westus2.cloudapp.azure.com:8080/job/royale-compiler/ws/build.xml>:68: The following error occurred while executing this line:
<http://apacheroyaleci.westus2.cloudapp.azure.com:8080/job/royale-compiler/ws/compiler/build.xml>:486: Compile failed; see the compiler error output for details.
Total time: 1 minute 41 seconds
Picked up JAVA_TOOL_OPTIONS: -Dfile.encoding=UTF-8 -Xmx512m
Build step 'Invoke Ant' marked build as failure
Recording test results
Jenkins build is back to normal : royale-compiler #474
Posted by ap...@gmail.com.
See <http://apacheroyaleci.westus2.cloudapp.azure.com:8080/job/royale-compiler/474/display/redirect>