You are viewing a plain text version of this content. The canonical link for it is here.
Posted to commits@phoenix.apache.org by Apache Jenkins Server <je...@builds.apache.org> on 2020/06/04 23:36:43 UTC
Build failed in Jenkins: Phoenix | Master | HBase Profile » 2.0 #87
See <https://builds.apache.org/job/Phoenix-master-matrix/HBASE_PROFILE=2.0/87/display/redirect?page=changes>
Changes:
[achouhan] PHOENIX-5931 PhoenixIndexFailurePolicy throws NPE if cause of IOE is
------------------------------------------
[...truncated 25.74 KB...]
[INFO] --- maven-compiler-plugin:3.7.0:compile (default-compile) @ phoenix-hbase-compat-2.0.1 ---
[INFO] Changes detected - recompiling the module!
[INFO] Compiling 5 source files to <https://builds.apache.org/job/Phoenix-master-matrix/HBASE_PROFILE=2.0/ws/phoenix-hbase-compat-2.0.1/target/classes>
[INFO] <https://builds.apache.org/job/Phoenix-master-matrix/HBASE_PROFILE=2.0/ws/phoenix-hbase-compat-2.0.1/src/main/java/org/apache/phoenix/compat/hbase/OffsetCell.java>: Some input files use or override a deprecated API.
[INFO] <https://builds.apache.org/job/Phoenix-master-matrix/HBASE_PROFILE=2.0/ws/phoenix-hbase-compat-2.0.1/src/main/java/org/apache/phoenix/compat/hbase/OffsetCell.java>: Recompile with -Xlint:deprecation for details.
[INFO]
[INFO] --- maven-resources-plugin:3.1.0:testResources (default-testResources) @ phoenix-hbase-compat-2.0.1 ---
[INFO] Using 'UTF-8' encoding to copy filtered resources.
[INFO] skip non existing resourceDirectory <https://builds.apache.org/job/Phoenix-master-matrix/HBASE_PROFILE=2.0/ws/phoenix-hbase-compat-2.0.1/src/test/resources>
[INFO] Copying 3 resources
[INFO]
[INFO] --- maven-compiler-plugin:3.7.0:testCompile (default-testCompile) @ phoenix-hbase-compat-2.0.1 ---
[INFO] No sources to compile
[INFO]
[INFO] --- maven-surefire-plugin:2.22.0:test (default-test) @ phoenix-hbase-compat-2.0.1 ---
[INFO]
[INFO] --- maven-jar-plugin:3.1.0:jar (default-jar) @ phoenix-hbase-compat-2.0.1 ---
[INFO] Building jar: <https://builds.apache.org/job/Phoenix-master-matrix/HBASE_PROFILE=2.0/ws/phoenix-hbase-compat-2.0.1/target/phoenix-hbase-compat-2.0.1-5.1.0-SNAPSHOT.jar>
[INFO]
[INFO] --- maven-site-plugin:3.7.1:attach-descriptor (attach-descriptor) @ phoenix-hbase-compat-2.0.1 ---
[INFO] Skipping because packaging 'jar' is not pom.
[INFO]
[INFO] --- maven-install-plugin:2.5.2:install (default-install) @ phoenix-hbase-compat-2.0.1 ---
[INFO] Installing <https://builds.apache.org/job/Phoenix-master-matrix/HBASE_PROFILE=2.0/ws/phoenix-hbase-compat-2.0.1/target/phoenix-hbase-compat-2.0.1-5.1.0-SNAPSHOT.jar> to /home/jenkins/.m2/repository/org/apache/phoenix/phoenix-hbase-compat-2.0.1/5.1.0-SNAPSHOT/phoenix-hbase-compat-2.0.1-5.1.0-SNAPSHOT.jar
[INFO] Installing <https://builds.apache.org/job/Phoenix-master-matrix/HBASE_PROFILE=2.0/ws/phoenix-hbase-compat-2.0.1/pom.xml> to /home/jenkins/.m2/repository/org/apache/phoenix/phoenix-hbase-compat-2.0.1/5.1.0-SNAPSHOT/phoenix-hbase-compat-2.0.1-5.1.0-SNAPSHOT.pom
[INFO]
[INFO] ---------------------< org.apache.phoenix:phoenix >---------------------
[INFO] Building Apache Phoenix 5.1.0-SNAPSHOT [4/10]
[INFO] --------------------------------[ pom ]---------------------------------
[INFO]
[INFO] --- maven-clean-plugin:3.1.0:clean (default-clean) @ phoenix ---
[INFO] Deleting <https://builds.apache.org/job/Phoenix-master-matrix/HBASE_PROFILE=2.0/ws/target>
[INFO]
[INFO] --- maven-enforcer-plugin:3.0.0-M3:enforce (enforce-maven-version) @ phoenix ---
[INFO]
[INFO] --- maven-enforcer-plugin:3.0.0-M3:enforce (check-hbase-compatibility) @ phoenix ---
[INFO]
[INFO] --- maven-checkstyle-plugin:3.1.0:check (validate) @ phoenix ---
[INFO]
[INFO] --- jacoco-maven-plugin:0.7.9:prepare-agent (prepare-agent) @ phoenix ---
[INFO] jacocoArgLine set to -javaagent:/home/jenkins/.m2/repository/org/jacoco/org.jacoco.agent/0.7.9/org.jacoco.agent-0.7.9-runtime.jar=destfile=<https://builds.apache.org/job/Phoenix-master-matrix/HBASE_PROFILE=2.0/ws/target/jacoco.exec>
[INFO]
[INFO] --- maven-remote-resources-plugin:1.5:process (process-resource-bundles) @ phoenix ---
[INFO]
[INFO] --- maven-source-plugin:3.0.1:jar-no-fork (attach-sources) @ phoenix ---
[INFO]
[INFO] --- maven-jar-plugin:3.1.0:test-jar (default) @ phoenix ---
[WARNING] JAR will be empty - no content was marked for inclusion!
[INFO] Building jar: <https://builds.apache.org/job/Phoenix-master-matrix/HBASE_PROFILE=2.0/ws/target/phoenix-5.1.0-SNAPSHOT-tests.jar>
[INFO]
[INFO] --- maven-site-plugin:3.7.1:attach-descriptor (attach-descriptor) @ phoenix ---
[INFO] No site descriptor found: nothing to attach.
[INFO]
[INFO] --- jacoco-maven-plugin:0.7.9:report (report) @ phoenix ---
[INFO] Skipping JaCoCo execution due to missing execution data file.
[INFO]
[INFO] --- jacoco-maven-plugin:0.7.9:check (check) @ phoenix ---
[INFO] Skipping JaCoCo execution due to missing execution data <https://builds.apache.org/job/Phoenix-master-matrix/HBASE_PROFILE=2.0/ws/target/jacoco.exec>
[INFO]
[INFO] --- maven-install-plugin:2.5.2:install (default-install) @ phoenix ---
[INFO] Installing <https://builds.apache.org/job/Phoenix-master-matrix/HBASE_PROFILE=2.0/ws/pom.xml> to /home/jenkins/.m2/repository/org/apache/phoenix/phoenix/5.1.0-SNAPSHOT/phoenix-5.1.0-SNAPSHOT.pom
[INFO] Installing <https://builds.apache.org/job/Phoenix-master-matrix/HBASE_PROFILE=2.0/ws/target/phoenix-5.1.0-SNAPSHOT-tests.jar> to /home/jenkins/.m2/repository/org/apache/phoenix/phoenix/5.1.0-SNAPSHOT/phoenix-5.1.0-SNAPSHOT-tests.jar
[INFO]
[INFO] ------------------< org.apache.phoenix:phoenix-core >-------------------
[INFO] Building Phoenix Core 5.1.0-SNAPSHOT [5/10]
[INFO] --------------------------------[ jar ]---------------------------------
Downloading from apache release: https://repository.apache.org/content/repositories/releases/org/glassfish/javax.el/maven-metadata.xml
[INFO]
[INFO] --- maven-clean-plugin:3.1.0:clean (default-clean) @ phoenix-core ---
[INFO] Deleting <https://builds.apache.org/job/Phoenix-master-matrix/HBASE_PROFILE=2.0/ws/phoenix-core/target>
[INFO]
[INFO] --- maven-enforcer-plugin:3.0.0-M3:enforce (enforce-maven-version) @ phoenix-core ---
[INFO]
[INFO] --- maven-enforcer-plugin:3.0.0-M3:enforce (check-hbase-compatibility) @ phoenix-core ---
[INFO]
[INFO] --- maven-checkstyle-plugin:3.1.0:check (validate) @ phoenix-core ---
[INFO]
[INFO] --- build-helper-maven-plugin:1.9.1:add-test-source (add-test-source) @ phoenix-core ---
[INFO] Test Source directory: <https://builds.apache.org/job/Phoenix-master-matrix/HBASE_PROFILE=2.0/ws/phoenix-core/src/it/java> added.
[INFO]
[INFO] --- build-helper-maven-plugin:1.9.1:add-test-resource (add-test-resource) @ phoenix-core ---
[INFO]
[INFO] --- jacoco-maven-plugin:0.7.9:prepare-agent (prepare-agent) @ phoenix-core ---
[INFO] jacocoArgLine set to -javaagent:/home/jenkins/.m2/repository/org/jacoco/org.jacoco.agent/0.7.9/org.jacoco.agent-0.7.9-runtime.jar=destfile=<https://builds.apache.org/job/Phoenix-master-matrix/HBASE_PROFILE=2.0/ws/phoenix-core/target/jacoco.exec>
[INFO]
[INFO] --- build-helper-maven-plugin:1.9.1:add-source (add-source) @ phoenix-core ---
[INFO] Source directory: <https://builds.apache.org/job/Phoenix-master-matrix/HBASE_PROFILE=2.0/ws/phoenix-core/target/generated-sources/antlr3> added.
[INFO] Source directory: <https://builds.apache.org/job/Phoenix-master-matrix/HBASE_PROFILE=2.0/ws/phoenix-core/src/main/antlr3> added.
[INFO]
[INFO] --- antlr3-maven-plugin:3.5.2:antlr (default) @ phoenix-core ---
[INFO] ANTLR: Processing source directory <https://builds.apache.org/job/Phoenix-master-matrix/HBASE_PROFILE=2.0/ws/phoenix-core/src/main/antlr3>
ANTLR Parser Generator Version 3.5.2
Output file <https://builds.apache.org/job/Phoenix-master-matrix/HBASE_PROFILE=2.0/ws/phoenix-core/target/generated-sources/antlr3/org/apache/phoenix/parse/PhoenixSQLParser.java> does not exist: must build <https://builds.apache.org/job/Phoenix-master-matrix/HBASE_PROFILE=2.0/ws/phoenix-core/src/main/antlr3/PhoenixSQL.g>
PhoenixSQL.g
[INFO]
[INFO] --- maven-dependency-plugin:3.1.1:build-classpath (create-phoenix-generated-classpath) @ phoenix-core ---
[INFO] Wrote classpath file '<https://builds.apache.org/job/Phoenix-master-matrix/HBASE_PROFILE=2.0/ws/phoenix-core/target/cached_classpath.txt'.>
[INFO]
[INFO] --- maven-remote-resources-plugin:1.5:process (process-resource-bundles) @ phoenix-core ---
[INFO] artifact org.glassfish:javax.el: checking for updates from apache release
[INFO] artifact org.glassfish:javax.el: checking for updates from central
[INFO] artifact org.glassfish:javax.el: checking for updates from java.net.Releases
[INFO] artifact org.glassfish:javax.el: checking for updates from apache release
[INFO] artifact org.glassfish:javax.el: checking for updates from central
[INFO] artifact org.glassfish:javax.el: checking for updates from java.net.Releases
[INFO]
[INFO] --- maven-resources-plugin:3.1.0:resources (default-resources) @ phoenix-core ---
[INFO] Using 'UTF-8' encoding to copy filtered resources.
[INFO] Copying 3 resources
[INFO] Copying 3 resources
[INFO]
[INFO] --- maven-compiler-plugin:3.7.0:compile (default-compile) @ phoenix-core ---
[INFO] Changes detected - recompiling the module!
[INFO] Compiling 1167 source files to <https://builds.apache.org/job/Phoenix-master-matrix/HBASE_PROFILE=2.0/ws/phoenix-core/target/classes>
[WARNING] <https://builds.apache.org/job/Phoenix-master-matrix/HBASE_PROFILE=2.0/ws/phoenix-core/src/main/java/org/apache/phoenix/execute/DescVarLengthFastByteComparisons.java>:[25,16] sun.misc.Unsafe is internal proprietary API and may be removed in a future release
[WARNING] <https://builds.apache.org/job/Phoenix-master-matrix/HBASE_PROFILE=2.0/ws/phoenix-core/src/main/java/org/apache/phoenix/execute/DescVarLengthFastByteComparisons.java>:[116,26] sun.misc.Unsafe is internal proprietary API and may be removed in a future release
[WARNING] <https://builds.apache.org/job/Phoenix-master-matrix/HBASE_PROFILE=2.0/ws/phoenix-core/src/main/java/org/apache/phoenix/execute/DescVarLengthFastByteComparisons.java>:[122,30] sun.misc.Unsafe is internal proprietary API and may be removed in a future release
[WARNING] <https://builds.apache.org/job/Phoenix-master-matrix/HBASE_PROFILE=2.0/ws/phoenix-core/src/main/java/org/apache/phoenix/execute/DescVarLengthFastByteComparisons.java>:[126,39] sun.misc.Unsafe is internal proprietary API and may be removed in a future release
[INFO] <https://builds.apache.org/job/Phoenix-master-matrix/HBASE_PROFILE=2.0/ws/phoenix-core/src/main/java/org/apache/phoenix/expression/BaseExpression.java>: Some input files use or override a deprecated API.
[INFO] <https://builds.apache.org/job/Phoenix-master-matrix/HBASE_PROFILE=2.0/ws/phoenix-core/src/main/java/org/apache/phoenix/expression/BaseExpression.java>: Recompile with -Xlint:deprecation for details.
[INFO] <https://builds.apache.org/job/Phoenix-master-matrix/HBASE_PROFILE=2.0/ws/phoenix-core/src/main/java/org/apache/phoenix/jdbc/PhoenixStatement.java>: Some input files use unchecked or unsafe operations.
[INFO] <https://builds.apache.org/job/Phoenix-master-matrix/HBASE_PROFILE=2.0/ws/phoenix-core/src/main/java/org/apache/phoenix/jdbc/PhoenixStatement.java>: Recompile with -Xlint:unchecked for details.
[INFO]
[INFO] --- maven-dependency-plugin:3.1.1:build-classpath (create-mrapp-generated-classpath) @ phoenix-core ---
[INFO] Wrote classpath file '<https://builds.apache.org/job/Phoenix-master-matrix/HBASE_PROFILE=2.0/ws/phoenix-core/target/classes/mrapp-generated-classpath'.>
[INFO]
[INFO] --- maven-resources-plugin:3.1.0:testResources (default-testResources) @ phoenix-core ---
[INFO] Using 'UTF-8' encoding to copy filtered resources.
[INFO] Copying 5 resources
[INFO] Copying 12 resources
[INFO] Copying 3 resources
[INFO]
[INFO] --- maven-compiler-plugin:3.7.0:testCompile (default-testCompile) @ phoenix-core ---
[INFO] Changes detected - recompiling the module!
[INFO] Compiling 612 source files to <https://builds.apache.org/job/Phoenix-master-matrix/HBASE_PROFILE=2.0/ws/phoenix-core/target/test-classes>
[INFO] <https://builds.apache.org/job/Phoenix-master-matrix/HBASE_PROFILE=2.0/ws/phoenix-core/src/test/java/org/apache/phoenix/query/BaseTest.java>: Some input files use or override a deprecated API.
[INFO] <https://builds.apache.org/job/Phoenix-master-matrix/HBASE_PROFILE=2.0/ws/phoenix-core/src/test/java/org/apache/phoenix/query/BaseTest.java>: Recompile with -Xlint:deprecation for details.
[INFO] <https://builds.apache.org/job/Phoenix-master-matrix/HBASE_PROFILE=2.0/ws/phoenix-core/src/test/java/org/apache/phoenix/query/BaseTest.java>: Some input files use unchecked or unsafe operations.
[INFO] <https://builds.apache.org/job/Phoenix-master-matrix/HBASE_PROFILE=2.0/ws/phoenix-core/src/test/java/org/apache/phoenix/query/BaseTest.java>: Recompile with -Xlint:unchecked for details.
[INFO] -------------------------------------------------------------
[ERROR] COMPILATION ERROR :
[INFO] -------------------------------------------------------------
[ERROR] <https://builds.apache.org/job/Phoenix-master-matrix/HBASE_PROFILE=2.0/ws/phoenix-core/src/it/java/org/apache/phoenix/end2end/BasePermissionsIT.java>:[39,47] cannot find symbol
symbol: class GetUserPermissionsRequest
location: package org.apache.hadoop.hbase.security.access
[ERROR] <https://builds.apache.org/job/Phoenix-master-matrix/HBASE_PROFILE=2.0/ws/phoenix-core/src/it/java/org/apache/phoenix/end2end/BasePermissionsIT.java>:[1452,48] cannot find symbol
symbol: method hasUserName()
location: variable request of type org.apache.hadoop.hbase.protobuf.generated.AccessControlProtos.GetUserPermissionsRequest
[ERROR] <https://builds.apache.org/job/Phoenix-master-matrix/HBASE_PROFILE=2.0/ws/phoenix-core/src/it/java/org/apache/phoenix/end2end/BasePermissionsIT.java>:[1452,72] cannot find symbol
symbol: method getUserName()
location: variable request of type org.apache.hadoop.hbase.protobuf.generated.AccessControlProtos.GetUserPermissionsRequest
[ERROR] <https://builds.apache.org/job/Phoenix-master-matrix/HBASE_PROFILE=2.0/ws/phoenix-core/src/it/java/org/apache/phoenix/end2end/BasePermissionsIT.java>:[1458,32] cannot find symbol
symbol: method hasColumnFamily()
location: variable request of type org.apache.hadoop.hbase.protobuf.generated.AccessControlProtos.GetUserPermissionsRequest
[ERROR] <https://builds.apache.org/job/Phoenix-master-matrix/HBASE_PROFILE=2.0/ws/phoenix-core/src/it/java/org/apache/phoenix/end2end/BasePermissionsIT.java>:[1458,60] cannot find symbol
symbol: method getColumnFamily()
location: variable request of type org.apache.hadoop.hbase.protobuf.generated.AccessControlProtos.GetUserPermissionsRequest
[ERROR] <https://builds.apache.org/job/Phoenix-master-matrix/HBASE_PROFILE=2.0/ws/phoenix-core/src/it/java/org/apache/phoenix/end2end/BasePermissionsIT.java>:[1460,32] cannot find symbol
symbol: method hasColumnQualifier()
location: variable request of type org.apache.hadoop.hbase.protobuf.generated.AccessControlProtos.GetUserPermissionsRequest
[ERROR] <https://builds.apache.org/job/Phoenix-master-matrix/HBASE_PROFILE=2.0/ws/phoenix-core/src/it/java/org/apache/phoenix/end2end/BasePermissionsIT.java>:[1460,63] cannot find symbol
symbol: method getColumnQualifier()
location: variable request of type org.apache.hadoop.hbase.protobuf.generated.AccessControlProtos.GetUserPermissionsRequest
[ERROR] <https://builds.apache.org/job/Phoenix-master-matrix/HBASE_PROFILE=2.0/ws/phoenix-core/src/it/java/org/apache/phoenix/end2end/BasePermissionsIT.java>:[1461,17] cannot find symbol
symbol: class GetUserPermissionsRequest
location: class org.apache.phoenix.end2end.BasePermissionsIT.CustomAccessController
[ERROR] <https://builds.apache.org/job/Phoenix-master-matrix/HBASE_PROFILE=2.0/ws/phoenix-core/src/it/java/org/apache/phoenix/end2end/BasePermissionsIT.java>:[1463,49] cannot find symbol
symbol: variable GetUserPermissionsRequest
location: class org.apache.phoenix.end2end.BasePermissionsIT.CustomAccessController
[ERROR] <https://builds.apache.org/job/Phoenix-master-matrix/HBASE_PROFILE=2.0/ws/phoenix-core/src/it/java/org/apache/phoenix/end2end/BasePermissionsIT.java>:[1467,29] cannot find symbol
symbol: variable GetUserPermissionsRequest
location: class org.apache.phoenix.end2end.BasePermissionsIT.CustomAccessController
[ERROR] <https://builds.apache.org/job/Phoenix-master-matrix/HBASE_PROFILE=2.0/ws/phoenix-core/src/it/java/org/apache/phoenix/end2end/BasePermissionsIT.java>:[1470,29] cannot find symbol
symbol: variable GetUserPermissionsRequest
location: class org.apache.phoenix.end2end.BasePermissionsIT.CustomAccessController
[INFO] 11 errors
[INFO] -------------------------------------------------------------
[INFO] ------------------------------------------------------------------------
[INFO] Reactor Summary for Apache Phoenix 5.1.0-SNAPSHOT:
[INFO]
[INFO] Phoenix Hbase 2.2.1 compatibility .................. SUCCESS [ 14.751 s]
[INFO] Phoenix Hbase 2.1.6 compatibility .................. SUCCESS [ 3.075 s]
[INFO] Phoenix Hbase 2.0.1 compatibility .................. SUCCESS [ 3.148 s]
[INFO] Apache Phoenix ..................................... SUCCESS [ 1.996 s]
[INFO] Phoenix Core ....................................... FAILURE [ 50.635 s]
[INFO] Phoenix - Pherf .................................... SKIPPED
[INFO] Phoenix Client ..................................... SKIPPED
[INFO] Phoenix Server ..................................... SKIPPED
[INFO] Phoenix - Tracing Web Application .................. SKIPPED
[INFO] Phoenix Assembly ................................... SKIPPED
[INFO] ------------------------------------------------------------------------
[INFO] BUILD FAILURE
[INFO] ------------------------------------------------------------------------
[INFO] Total time: 01:15 min
[INFO] Finished at: 2020-06-04T23:36:37Z
[INFO] ------------------------------------------------------------------------
[ERROR] Failed to execute goal org.apache.maven.plugins:maven-compiler-plugin:3.7.0:testCompile (default-testCompile) on project phoenix-core: Compilation failure: Compilation failure:
[ERROR] <https://builds.apache.org/job/Phoenix-master-matrix/HBASE_PROFILE=2.0/ws/phoenix-core/src/it/java/org/apache/phoenix/end2end/BasePermissionsIT.java>:[39,47] cannot find symbol
[ERROR] symbol: class GetUserPermissionsRequest
[ERROR] location: package org.apache.hadoop.hbase.security.access
[ERROR] <https://builds.apache.org/job/Phoenix-master-matrix/HBASE_PROFILE=2.0/ws/phoenix-core/src/it/java/org/apache/phoenix/end2end/BasePermissionsIT.java>:[1452,48] cannot find symbol
[ERROR] symbol: method hasUserName()
[ERROR] location: variable request of type org.apache.hadoop.hbase.protobuf.generated.AccessControlProtos.GetUserPermissionsRequest
[ERROR] <https://builds.apache.org/job/Phoenix-master-matrix/HBASE_PROFILE=2.0/ws/phoenix-core/src/it/java/org/apache/phoenix/end2end/BasePermissionsIT.java>:[1452,72] cannot find symbol
[ERROR] symbol: method getUserName()
[ERROR] location: variable request of type org.apache.hadoop.hbase.protobuf.generated.AccessControlProtos.GetUserPermissionsRequest
[ERROR] <https://builds.apache.org/job/Phoenix-master-matrix/HBASE_PROFILE=2.0/ws/phoenix-core/src/it/java/org/apache/phoenix/end2end/BasePermissionsIT.java>:[1458,32] cannot find symbol
[ERROR] symbol: method hasColumnFamily()
[ERROR] location: variable request of type org.apache.hadoop.hbase.protobuf.generated.AccessControlProtos.GetUserPermissionsRequest
[ERROR] <https://builds.apache.org/job/Phoenix-master-matrix/HBASE_PROFILE=2.0/ws/phoenix-core/src/it/java/org/apache/phoenix/end2end/BasePermissionsIT.java>:[1458,60] cannot find symbol
[ERROR] symbol: method getColumnFamily()
[ERROR] location: variable request of type org.apache.hadoop.hbase.protobuf.generated.AccessControlProtos.GetUserPermissionsRequest
[ERROR] <https://builds.apache.org/job/Phoenix-master-matrix/HBASE_PROFILE=2.0/ws/phoenix-core/src/it/java/org/apache/phoenix/end2end/BasePermissionsIT.java>:[1460,32] cannot find symbol
[ERROR] symbol: method hasColumnQualifier()
[ERROR] location: variable request of type org.apache.hadoop.hbase.protobuf.generated.AccessControlProtos.GetUserPermissionsRequest
[ERROR] <https://builds.apache.org/job/Phoenix-master-matrix/HBASE_PROFILE=2.0/ws/phoenix-core/src/it/java/org/apache/phoenix/end2end/BasePermissionsIT.java>:[1460,63] cannot find symbol
[ERROR] symbol: method getColumnQualifier()
[ERROR] location: variable request of type org.apache.hadoop.hbase.protobuf.generated.AccessControlProtos.GetUserPermissionsRequest
[ERROR] <https://builds.apache.org/job/Phoenix-master-matrix/HBASE_PROFILE=2.0/ws/phoenix-core/src/it/java/org/apache/phoenix/end2end/BasePermissionsIT.java>:[1461,17] cannot find symbol
[ERROR] symbol: class GetUserPermissionsRequest
[ERROR] location: class org.apache.phoenix.end2end.BasePermissionsIT.CustomAccessController
[ERROR] <https://builds.apache.org/job/Phoenix-master-matrix/HBASE_PROFILE=2.0/ws/phoenix-core/src/it/java/org/apache/phoenix/end2end/BasePermissionsIT.java>:[1463,49] cannot find symbol
[ERROR] symbol: variable GetUserPermissionsRequest
[ERROR] location: class org.apache.phoenix.end2end.BasePermissionsIT.CustomAccessController
[ERROR] <https://builds.apache.org/job/Phoenix-master-matrix/HBASE_PROFILE=2.0/ws/phoenix-core/src/it/java/org/apache/phoenix/end2end/BasePermissionsIT.java>:[1467,29] cannot find symbol
[ERROR] symbol: variable GetUserPermissionsRequest
[ERROR] location: class org.apache.phoenix.end2end.BasePermissionsIT.CustomAccessController
[ERROR] <https://builds.apache.org/job/Phoenix-master-matrix/HBASE_PROFILE=2.0/ws/phoenix-core/src/it/java/org/apache/phoenix/end2end/BasePermissionsIT.java>:[1470,29] cannot find symbol
[ERROR] symbol: variable GetUserPermissionsRequest
[ERROR] location: class org.apache.phoenix.end2end.BasePermissionsIT.CustomAccessController
[ERROR] -> [Help 1]
[ERROR]
[ERROR] To see the full stack trace of the errors, re-run Maven with the -e switch.
[ERROR] Re-run Maven using the -X switch to enable full debug logging.
[ERROR]
[ERROR] For more information about the errors and possible solutions, please read the following articles:
[ERROR] [Help 1] http://cwiki.apache.org/confluence/display/MAVEN/MojoFailureException
[ERROR]
[ERROR] After correcting the problems, you can resume the build with the command
[ERROR] mvn <args> -rf :phoenix-core
Build step 'Invoke top-level Maven targets' marked build as failure
Archiving artifacts
Recording test results
ERROR: Step ?Publish JUnit test result report? failed: No test report files were found. Configuration error?
Not sending mail to unregistered user giskender@salesforce.com
Not sending mail to unregistered user Rajeshbabu Chintaguntla
Not sending mail to unregistered user noreply@github.com
Not sending mail to unregistered user abhishek.chouhan@salesforce.com
Not sending mail to unregistered user s.kadam@salesforce.com
Build failed in Jenkins: Phoenix | Master | HBase Profile » 2.0 #95
Posted by Apache Jenkins Server <je...@builds.apache.org>.
See <https://builds.apache.org/job/Phoenix-master-matrix/HBASE_PROFILE=2.0/95/display/redirect?page=changes>
Changes:
[github] PHOENIX-5783: Implement starttime in IndexTool for rebuild and
------------------------------------------
[...truncated 25.79 KB...]
[INFO] --- maven-compiler-plugin:3.7.0:compile (default-compile) @ phoenix-hbase-compat-2.0.1 ---
[INFO] Changes detected - recompiling the module!
[INFO] Compiling 5 source files to <https://builds.apache.org/job/Phoenix-master-matrix/HBASE_PROFILE=2.0/ws/phoenix-hbase-compat-2.0.1/target/classes>
[INFO] <https://builds.apache.org/job/Phoenix-master-matrix/HBASE_PROFILE=2.0/ws/phoenix-hbase-compat-2.0.1/src/main/java/org/apache/phoenix/compat/hbase/OffsetCell.java>: Some input files use or override a deprecated API.
[INFO] <https://builds.apache.org/job/Phoenix-master-matrix/HBASE_PROFILE=2.0/ws/phoenix-hbase-compat-2.0.1/src/main/java/org/apache/phoenix/compat/hbase/OffsetCell.java>: Recompile with -Xlint:deprecation for details.
[INFO]
[INFO] --- maven-resources-plugin:3.1.0:testResources (default-testResources) @ phoenix-hbase-compat-2.0.1 ---
[INFO] Using 'UTF-8' encoding to copy filtered resources.
[INFO] skip non existing resourceDirectory <https://builds.apache.org/job/Phoenix-master-matrix/HBASE_PROFILE=2.0/ws/phoenix-hbase-compat-2.0.1/src/test/resources>
[INFO] Copying 3 resources
[INFO]
[INFO] --- maven-compiler-plugin:3.7.0:testCompile (default-testCompile) @ phoenix-hbase-compat-2.0.1 ---
[INFO] No sources to compile
[INFO]
[INFO] --- maven-surefire-plugin:2.22.0:test (default-test) @ phoenix-hbase-compat-2.0.1 ---
[INFO]
[INFO] --- maven-jar-plugin:3.1.0:jar (default-jar) @ phoenix-hbase-compat-2.0.1 ---
[INFO] Building jar: <https://builds.apache.org/job/Phoenix-master-matrix/HBASE_PROFILE=2.0/ws/phoenix-hbase-compat-2.0.1/target/phoenix-hbase-compat-2.0.1-5.1.0-SNAPSHOT.jar>
[INFO]
[INFO] --- maven-site-plugin:3.7.1:attach-descriptor (attach-descriptor) @ phoenix-hbase-compat-2.0.1 ---
[INFO] Skipping because packaging 'jar' is not pom.
[INFO]
[INFO] --- maven-install-plugin:2.5.2:install (default-install) @ phoenix-hbase-compat-2.0.1 ---
[INFO] Installing <https://builds.apache.org/job/Phoenix-master-matrix/HBASE_PROFILE=2.0/ws/phoenix-hbase-compat-2.0.1/target/phoenix-hbase-compat-2.0.1-5.1.0-SNAPSHOT.jar> to /home/jenkins/.m2/repository/org/apache/phoenix/phoenix-hbase-compat-2.0.1/5.1.0-SNAPSHOT/phoenix-hbase-compat-2.0.1-5.1.0-SNAPSHOT.jar
[INFO] Installing <https://builds.apache.org/job/Phoenix-master-matrix/HBASE_PROFILE=2.0/ws/phoenix-hbase-compat-2.0.1/pom.xml> to /home/jenkins/.m2/repository/org/apache/phoenix/phoenix-hbase-compat-2.0.1/5.1.0-SNAPSHOT/phoenix-hbase-compat-2.0.1-5.1.0-SNAPSHOT.pom
[INFO]
[INFO] ---------------------< org.apache.phoenix:phoenix >---------------------
[INFO] Building Apache Phoenix 5.1.0-SNAPSHOT [4/10]
[INFO] --------------------------------[ pom ]---------------------------------
[INFO]
[INFO] --- maven-clean-plugin:3.1.0:clean (default-clean) @ phoenix ---
[INFO] Deleting <https://builds.apache.org/job/Phoenix-master-matrix/HBASE_PROFILE=2.0/ws/target>
[INFO]
[INFO] --- maven-enforcer-plugin:3.0.0-M3:enforce (enforce-maven-version) @ phoenix ---
[INFO]
[INFO] --- maven-enforcer-plugin:3.0.0-M3:enforce (check-hbase-compatibility) @ phoenix ---
[INFO]
[INFO] --- maven-checkstyle-plugin:3.1.0:check (validate) @ phoenix ---
[INFO]
[INFO] --- jacoco-maven-plugin:0.7.9:prepare-agent (prepare-agent) @ phoenix ---
[INFO] jacocoArgLine set to -javaagent:/home/jenkins/.m2/repository/org/jacoco/org.jacoco.agent/0.7.9/org.jacoco.agent-0.7.9-runtime.jar=destfile=<https://builds.apache.org/job/Phoenix-master-matrix/HBASE_PROFILE=2.0/ws/target/jacoco.exec>
[INFO]
[INFO] --- maven-remote-resources-plugin:1.5:process (process-resource-bundles) @ phoenix ---
[INFO]
[INFO] --- maven-source-plugin:3.0.1:jar-no-fork (attach-sources) @ phoenix ---
[INFO]
[INFO] --- maven-jar-plugin:3.1.0:test-jar (default) @ phoenix ---
[WARNING] JAR will be empty - no content was marked for inclusion!
[INFO] Building jar: <https://builds.apache.org/job/Phoenix-master-matrix/HBASE_PROFILE=2.0/ws/target/phoenix-5.1.0-SNAPSHOT-tests.jar>
[INFO]
[INFO] --- maven-site-plugin:3.7.1:attach-descriptor (attach-descriptor) @ phoenix ---
[INFO] No site descriptor found: nothing to attach.
[INFO]
[INFO] --- jacoco-maven-plugin:0.7.9:report (report) @ phoenix ---
[INFO] Skipping JaCoCo execution due to missing execution data file.
[INFO]
[INFO] --- jacoco-maven-plugin:0.7.9:check (check) @ phoenix ---
[INFO] Skipping JaCoCo execution due to missing execution data <https://builds.apache.org/job/Phoenix-master-matrix/HBASE_PROFILE=2.0/ws/target/jacoco.exec>
[INFO]
[INFO] --- maven-install-plugin:2.5.2:install (default-install) @ phoenix ---
[INFO] Installing <https://builds.apache.org/job/Phoenix-master-matrix/HBASE_PROFILE=2.0/ws/pom.xml> to /home/jenkins/.m2/repository/org/apache/phoenix/phoenix/5.1.0-SNAPSHOT/phoenix-5.1.0-SNAPSHOT.pom
[INFO] Installing <https://builds.apache.org/job/Phoenix-master-matrix/HBASE_PROFILE=2.0/ws/target/phoenix-5.1.0-SNAPSHOT-tests.jar> to /home/jenkins/.m2/repository/org/apache/phoenix/phoenix/5.1.0-SNAPSHOT/phoenix-5.1.0-SNAPSHOT-tests.jar
[INFO]
[INFO] ------------------< org.apache.phoenix:phoenix-core >-------------------
[INFO] Building Phoenix Core 5.1.0-SNAPSHOT [5/10]
[INFO] --------------------------------[ jar ]---------------------------------
Downloading from apache release: https://repository.apache.org/content/repositories/releases/org/glassfish/javax.el/maven-metadata.xml
[INFO]
[INFO] --- maven-clean-plugin:3.1.0:clean (default-clean) @ phoenix-core ---
[INFO] Deleting <https://builds.apache.org/job/Phoenix-master-matrix/HBASE_PROFILE=2.0/ws/phoenix-core/target>
[INFO]
[INFO] --- maven-enforcer-plugin:3.0.0-M3:enforce (enforce-maven-version) @ phoenix-core ---
[INFO]
[INFO] --- maven-enforcer-plugin:3.0.0-M3:enforce (check-hbase-compatibility) @ phoenix-core ---
[INFO]
[INFO] --- maven-checkstyle-plugin:3.1.0:check (validate) @ phoenix-core ---
[INFO]
[INFO] --- build-helper-maven-plugin:1.9.1:add-test-source (add-test-source) @ phoenix-core ---
[INFO] Test Source directory: <https://builds.apache.org/job/Phoenix-master-matrix/HBASE_PROFILE=2.0/ws/phoenix-core/src/it/java> added.
[INFO]
[INFO] --- build-helper-maven-plugin:1.9.1:add-test-resource (add-test-resource) @ phoenix-core ---
[INFO]
[INFO] --- jacoco-maven-plugin:0.7.9:prepare-agent (prepare-agent) @ phoenix-core ---
[INFO] jacocoArgLine set to -javaagent:/home/jenkins/.m2/repository/org/jacoco/org.jacoco.agent/0.7.9/org.jacoco.agent-0.7.9-runtime.jar=destfile=<https://builds.apache.org/job/Phoenix-master-matrix/HBASE_PROFILE=2.0/ws/phoenix-core/target/jacoco.exec>
[INFO]
[INFO] --- build-helper-maven-plugin:1.9.1:add-source (add-source) @ phoenix-core ---
[INFO] Source directory: <https://builds.apache.org/job/Phoenix-master-matrix/HBASE_PROFILE=2.0/ws/phoenix-core/target/generated-sources/antlr3> added.
[INFO] Source directory: <https://builds.apache.org/job/Phoenix-master-matrix/HBASE_PROFILE=2.0/ws/phoenix-core/src/main/antlr3> added.
[INFO]
[INFO] --- antlr3-maven-plugin:3.5.2:antlr (default) @ phoenix-core ---
[INFO] ANTLR: Processing source directory <https://builds.apache.org/job/Phoenix-master-matrix/HBASE_PROFILE=2.0/ws/phoenix-core/src/main/antlr3>
ANTLR Parser Generator Version 3.5.2
Output file <https://builds.apache.org/job/Phoenix-master-matrix/HBASE_PROFILE=2.0/ws/phoenix-core/target/generated-sources/antlr3/org/apache/phoenix/parse/PhoenixSQLParser.java> does not exist: must build <https://builds.apache.org/job/Phoenix-master-matrix/HBASE_PROFILE=2.0/ws/phoenix-core/src/main/antlr3/PhoenixSQL.g>
PhoenixSQL.g
[INFO]
[INFO] --- maven-dependency-plugin:3.1.1:build-classpath (create-phoenix-generated-classpath) @ phoenix-core ---
[INFO] Wrote classpath file '<https://builds.apache.org/job/Phoenix-master-matrix/HBASE_PROFILE=2.0/ws/phoenix-core/target/cached_classpath.txt'.>
[INFO]
[INFO] --- maven-remote-resources-plugin:1.5:process (process-resource-bundles) @ phoenix-core ---
[INFO] artifact org.glassfish:javax.el: checking for updates from apache release
[INFO] artifact org.glassfish:javax.el: checking for updates from central
[INFO] artifact org.glassfish:javax.el: checking for updates from java.net.Releases
[INFO] artifact org.glassfish:javax.el: checking for updates from apache release
[INFO] artifact org.glassfish:javax.el: checking for updates from central
[INFO] artifact org.glassfish:javax.el: checking for updates from java.net.Releases
[INFO]
[INFO] --- maven-resources-plugin:3.1.0:resources (default-resources) @ phoenix-core ---
[INFO] Using 'UTF-8' encoding to copy filtered resources.
[INFO] Copying 3 resources
[INFO] Copying 3 resources
[INFO]
[INFO] --- maven-compiler-plugin:3.7.0:compile (default-compile) @ phoenix-core ---
[INFO] Changes detected - recompiling the module!
[INFO] Compiling 1169 source files to <https://builds.apache.org/job/Phoenix-master-matrix/HBASE_PROFILE=2.0/ws/phoenix-core/target/classes>
[WARNING] <https://builds.apache.org/job/Phoenix-master-matrix/HBASE_PROFILE=2.0/ws/phoenix-core/src/main/java/org/apache/phoenix/execute/DescVarLengthFastByteComparisons.java>:[25,16] sun.misc.Unsafe is internal proprietary API and may be removed in a future release
[WARNING] <https://builds.apache.org/job/Phoenix-master-matrix/HBASE_PROFILE=2.0/ws/phoenix-core/src/main/java/org/apache/phoenix/execute/DescVarLengthFastByteComparisons.java>:[116,26] sun.misc.Unsafe is internal proprietary API and may be removed in a future release
[WARNING] <https://builds.apache.org/job/Phoenix-master-matrix/HBASE_PROFILE=2.0/ws/phoenix-core/src/main/java/org/apache/phoenix/execute/DescVarLengthFastByteComparisons.java>:[122,30] sun.misc.Unsafe is internal proprietary API and may be removed in a future release
[WARNING] <https://builds.apache.org/job/Phoenix-master-matrix/HBASE_PROFILE=2.0/ws/phoenix-core/src/main/java/org/apache/phoenix/execute/DescVarLengthFastByteComparisons.java>:[126,39] sun.misc.Unsafe is internal proprietary API and may be removed in a future release
[INFO] <https://builds.apache.org/job/Phoenix-master-matrix/HBASE_PROFILE=2.0/ws/phoenix-core/src/main/java/org/apache/phoenix/expression/BaseExpression.java>: Some input files use or override a deprecated API.
[INFO] <https://builds.apache.org/job/Phoenix-master-matrix/HBASE_PROFILE=2.0/ws/phoenix-core/src/main/java/org/apache/phoenix/expression/BaseExpression.java>: Recompile with -Xlint:deprecation for details.
[INFO] <https://builds.apache.org/job/Phoenix-master-matrix/HBASE_PROFILE=2.0/ws/phoenix-core/src/main/java/org/apache/phoenix/jdbc/PhoenixStatement.java>: Some input files use unchecked or unsafe operations.
[INFO] <https://builds.apache.org/job/Phoenix-master-matrix/HBASE_PROFILE=2.0/ws/phoenix-core/src/main/java/org/apache/phoenix/jdbc/PhoenixStatement.java>: Recompile with -Xlint:unchecked for details.
[INFO]
[INFO] --- maven-dependency-plugin:3.1.1:build-classpath (create-mrapp-generated-classpath) @ phoenix-core ---
[INFO] Wrote classpath file '<https://builds.apache.org/job/Phoenix-master-matrix/HBASE_PROFILE=2.0/ws/phoenix-core/target/classes/mrapp-generated-classpath'.>
[INFO]
[INFO] --- maven-resources-plugin:3.1.0:testResources (default-testResources) @ phoenix-core ---
[INFO] Using 'UTF-8' encoding to copy filtered resources.
[INFO] Copying 5 resources
[INFO] Copying 12 resources
[INFO] Copying 3 resources
[INFO]
[INFO] --- maven-compiler-plugin:3.7.0:testCompile (default-testCompile) @ phoenix-core ---
[INFO] Changes detected - recompiling the module!
[INFO] Compiling 613 source files to <https://builds.apache.org/job/Phoenix-master-matrix/HBASE_PROFILE=2.0/ws/phoenix-core/target/test-classes>
[INFO] <https://builds.apache.org/job/Phoenix-master-matrix/HBASE_PROFILE=2.0/ws/phoenix-core/src/test/java/org/apache/phoenix/query/BaseTest.java>: Some input files use or override a deprecated API.
[INFO] <https://builds.apache.org/job/Phoenix-master-matrix/HBASE_PROFILE=2.0/ws/phoenix-core/src/test/java/org/apache/phoenix/query/BaseTest.java>: Recompile with -Xlint:deprecation for details.
[INFO] <https://builds.apache.org/job/Phoenix-master-matrix/HBASE_PROFILE=2.0/ws/phoenix-core/src/test/java/org/apache/phoenix/query/BaseTest.java>: Some input files use unchecked or unsafe operations.
[INFO] <https://builds.apache.org/job/Phoenix-master-matrix/HBASE_PROFILE=2.0/ws/phoenix-core/src/test/java/org/apache/phoenix/query/BaseTest.java>: Recompile with -Xlint:unchecked for details.
[INFO] -------------------------------------------------------------
[ERROR] COMPILATION ERROR :
[INFO] -------------------------------------------------------------
[ERROR] <https://builds.apache.org/job/Phoenix-master-matrix/HBASE_PROFILE=2.0/ws/phoenix-core/src/it/java/org/apache/phoenix/end2end/BasePermissionsIT.java>:[39,47] cannot find symbol
symbol: class GetUserPermissionsRequest
location: package org.apache.hadoop.hbase.security.access
[ERROR] <https://builds.apache.org/job/Phoenix-master-matrix/HBASE_PROFILE=2.0/ws/phoenix-core/src/it/java/org/apache/phoenix/end2end/BasePermissionsIT.java>:[1452,48] cannot find symbol
symbol: method hasUserName()
location: variable request of type org.apache.hadoop.hbase.protobuf.generated.AccessControlProtos.GetUserPermissionsRequest
[ERROR] <https://builds.apache.org/job/Phoenix-master-matrix/HBASE_PROFILE=2.0/ws/phoenix-core/src/it/java/org/apache/phoenix/end2end/BasePermissionsIT.java>:[1452,72] cannot find symbol
symbol: method getUserName()
location: variable request of type org.apache.hadoop.hbase.protobuf.generated.AccessControlProtos.GetUserPermissionsRequest
[ERROR] <https://builds.apache.org/job/Phoenix-master-matrix/HBASE_PROFILE=2.0/ws/phoenix-core/src/it/java/org/apache/phoenix/end2end/BasePermissionsIT.java>:[1458,32] cannot find symbol
symbol: method hasColumnFamily()
location: variable request of type org.apache.hadoop.hbase.protobuf.generated.AccessControlProtos.GetUserPermissionsRequest
[ERROR] <https://builds.apache.org/job/Phoenix-master-matrix/HBASE_PROFILE=2.0/ws/phoenix-core/src/it/java/org/apache/phoenix/end2end/BasePermissionsIT.java>:[1458,60] cannot find symbol
symbol: method getColumnFamily()
location: variable request of type org.apache.hadoop.hbase.protobuf.generated.AccessControlProtos.GetUserPermissionsRequest
[ERROR] <https://builds.apache.org/job/Phoenix-master-matrix/HBASE_PROFILE=2.0/ws/phoenix-core/src/it/java/org/apache/phoenix/end2end/BasePermissionsIT.java>:[1460,32] cannot find symbol
symbol: method hasColumnQualifier()
location: variable request of type org.apache.hadoop.hbase.protobuf.generated.AccessControlProtos.GetUserPermissionsRequest
[ERROR] <https://builds.apache.org/job/Phoenix-master-matrix/HBASE_PROFILE=2.0/ws/phoenix-core/src/it/java/org/apache/phoenix/end2end/BasePermissionsIT.java>:[1460,63] cannot find symbol
symbol: method getColumnQualifier()
location: variable request of type org.apache.hadoop.hbase.protobuf.generated.AccessControlProtos.GetUserPermissionsRequest
[ERROR] <https://builds.apache.org/job/Phoenix-master-matrix/HBASE_PROFILE=2.0/ws/phoenix-core/src/it/java/org/apache/phoenix/end2end/BasePermissionsIT.java>:[1461,17] cannot find symbol
symbol: class GetUserPermissionsRequest
location: class org.apache.phoenix.end2end.BasePermissionsIT.CustomAccessController
[ERROR] <https://builds.apache.org/job/Phoenix-master-matrix/HBASE_PROFILE=2.0/ws/phoenix-core/src/it/java/org/apache/phoenix/end2end/BasePermissionsIT.java>:[1463,49] cannot find symbol
symbol: variable GetUserPermissionsRequest
location: class org.apache.phoenix.end2end.BasePermissionsIT.CustomAccessController
[ERROR] <https://builds.apache.org/job/Phoenix-master-matrix/HBASE_PROFILE=2.0/ws/phoenix-core/src/it/java/org/apache/phoenix/end2end/BasePermissionsIT.java>:[1467,29] cannot find symbol
symbol: variable GetUserPermissionsRequest
location: class org.apache.phoenix.end2end.BasePermissionsIT.CustomAccessController
[ERROR] <https://builds.apache.org/job/Phoenix-master-matrix/HBASE_PROFILE=2.0/ws/phoenix-core/src/it/java/org/apache/phoenix/end2end/BasePermissionsIT.java>:[1470,29] cannot find symbol
symbol: variable GetUserPermissionsRequest
location: class org.apache.phoenix.end2end.BasePermissionsIT.CustomAccessController
[INFO] 11 errors
[INFO] -------------------------------------------------------------
[INFO] ------------------------------------------------------------------------
[INFO] Reactor Summary for Apache Phoenix 5.1.0-SNAPSHOT:
[INFO]
[INFO] Phoenix Hbase 2.2.1 compatibility .................. SUCCESS [ 13.657 s]
[INFO] Phoenix Hbase 2.1.6 compatibility .................. SUCCESS [ 2.912 s]
[INFO] Phoenix Hbase 2.0.1 compatibility .................. SUCCESS [ 3.596 s]
[INFO] Apache Phoenix ..................................... SUCCESS [ 1.933 s]
[INFO] Phoenix Core ....................................... FAILURE [01:52 min]
[INFO] Phoenix - Pherf .................................... SKIPPED
[INFO] Phoenix Client ..................................... SKIPPED
[INFO] Phoenix Server ..................................... SKIPPED
[INFO] Phoenix - Tracing Web Application .................. SKIPPED
[INFO] Phoenix Assembly ................................... SKIPPED
[INFO] ------------------------------------------------------------------------
[INFO] BUILD FAILURE
[INFO] ------------------------------------------------------------------------
[INFO] Total time: 02:15 min
[INFO] Finished at: 2020-06-17T23:49:59Z
[INFO] ------------------------------------------------------------------------
[ERROR] Failed to execute goal org.apache.maven.plugins:maven-compiler-plugin:3.7.0:testCompile (default-testCompile) on project phoenix-core: Compilation failure: Compilation failure:
[ERROR] <https://builds.apache.org/job/Phoenix-master-matrix/HBASE_PROFILE=2.0/ws/phoenix-core/src/it/java/org/apache/phoenix/end2end/BasePermissionsIT.java>:[39,47] cannot find symbol
[ERROR] symbol: class GetUserPermissionsRequest
[ERROR] location: package org.apache.hadoop.hbase.security.access
[ERROR] <https://builds.apache.org/job/Phoenix-master-matrix/HBASE_PROFILE=2.0/ws/phoenix-core/src/it/java/org/apache/phoenix/end2end/BasePermissionsIT.java>:[1452,48] cannot find symbol
[ERROR] symbol: method hasUserName()
[ERROR] location: variable request of type org.apache.hadoop.hbase.protobuf.generated.AccessControlProtos.GetUserPermissionsRequest
[ERROR] <https://builds.apache.org/job/Phoenix-master-matrix/HBASE_PROFILE=2.0/ws/phoenix-core/src/it/java/org/apache/phoenix/end2end/BasePermissionsIT.java>:[1452,72] cannot find symbol
[ERROR] symbol: method getUserName()
[ERROR] location: variable request of type org.apache.hadoop.hbase.protobuf.generated.AccessControlProtos.GetUserPermissionsRequest
[ERROR] <https://builds.apache.org/job/Phoenix-master-matrix/HBASE_PROFILE=2.0/ws/phoenix-core/src/it/java/org/apache/phoenix/end2end/BasePermissionsIT.java>:[1458,32] cannot find symbol
[ERROR] symbol: method hasColumnFamily()
[ERROR] location: variable request of type org.apache.hadoop.hbase.protobuf.generated.AccessControlProtos.GetUserPermissionsRequest
[ERROR] <https://builds.apache.org/job/Phoenix-master-matrix/HBASE_PROFILE=2.0/ws/phoenix-core/src/it/java/org/apache/phoenix/end2end/BasePermissionsIT.java>:[1458,60] cannot find symbol
[ERROR] symbol: method getColumnFamily()
[ERROR] location: variable request of type org.apache.hadoop.hbase.protobuf.generated.AccessControlProtos.GetUserPermissionsRequest
[ERROR] <https://builds.apache.org/job/Phoenix-master-matrix/HBASE_PROFILE=2.0/ws/phoenix-core/src/it/java/org/apache/phoenix/end2end/BasePermissionsIT.java>:[1460,32] cannot find symbol
[ERROR] symbol: method hasColumnQualifier()
[ERROR] location: variable request of type org.apache.hadoop.hbase.protobuf.generated.AccessControlProtos.GetUserPermissionsRequest
[ERROR] <https://builds.apache.org/job/Phoenix-master-matrix/HBASE_PROFILE=2.0/ws/phoenix-core/src/it/java/org/apache/phoenix/end2end/BasePermissionsIT.java>:[1460,63] cannot find symbol
[ERROR] symbol: method getColumnQualifier()
[ERROR] location: variable request of type org.apache.hadoop.hbase.protobuf.generated.AccessControlProtos.GetUserPermissionsRequest
[ERROR] <https://builds.apache.org/job/Phoenix-master-matrix/HBASE_PROFILE=2.0/ws/phoenix-core/src/it/java/org/apache/phoenix/end2end/BasePermissionsIT.java>:[1461,17] cannot find symbol
[ERROR] symbol: class GetUserPermissionsRequest
[ERROR] location: class org.apache.phoenix.end2end.BasePermissionsIT.CustomAccessController
[ERROR] <https://builds.apache.org/job/Phoenix-master-matrix/HBASE_PROFILE=2.0/ws/phoenix-core/src/it/java/org/apache/phoenix/end2end/BasePermissionsIT.java>:[1463,49] cannot find symbol
[ERROR] symbol: variable GetUserPermissionsRequest
[ERROR] location: class org.apache.phoenix.end2end.BasePermissionsIT.CustomAccessController
[ERROR] <https://builds.apache.org/job/Phoenix-master-matrix/HBASE_PROFILE=2.0/ws/phoenix-core/src/it/java/org/apache/phoenix/end2end/BasePermissionsIT.java>:[1467,29] cannot find symbol
[ERROR] symbol: variable GetUserPermissionsRequest
[ERROR] location: class org.apache.phoenix.end2end.BasePermissionsIT.CustomAccessController
[ERROR] <https://builds.apache.org/job/Phoenix-master-matrix/HBASE_PROFILE=2.0/ws/phoenix-core/src/it/java/org/apache/phoenix/end2end/BasePermissionsIT.java>:[1470,29] cannot find symbol
[ERROR] symbol: variable GetUserPermissionsRequest
[ERROR] location: class org.apache.phoenix.end2end.BasePermissionsIT.CustomAccessController
[ERROR] -> [Help 1]
[ERROR]
[ERROR] To see the full stack trace of the errors, re-run Maven with the -e switch.
[ERROR] Re-run Maven using the -X switch to enable full debug logging.
[ERROR]
[ERROR] For more information about the errors and possible solutions, please read the following articles:
[ERROR] [Help 1] http://cwiki.apache.org/confluence/display/MAVEN/MojoFailureException
[ERROR]
[ERROR] After correcting the problems, you can resume the build with the command
[ERROR] mvn <args> -rf :phoenix-core
Build step 'Invoke top-level Maven targets' marked build as failure
Archiving artifacts
Recording test results
ERROR: Step ?Publish JUnit test result report? failed: No test report files were found. Configuration error?
Not sending mail to unregistered user giskender@salesforce.com
Not sending mail to unregistered user Rajeshbabu Chintaguntla
Not sending mail to unregistered user noreply@github.com
Not sending mail to unregistered user abhishek.chouhan@salesforce.com
Not sending mail to unregistered user s.kadam@salesforce.com
Build failed in Jenkins: Phoenix | Master | HBase Profile » 2.0 #94
Posted by Apache Jenkins Server <je...@builds.apache.org>.
See <https://builds.apache.org/job/Phoenix-master-matrix/HBASE_PROFILE=2.0/94/display/redirect?page=changes>
Changes:
[ankit] PHOENIX-5884 Join query return empty result when filters for both the
------------------------------------------
[...truncated 26.16 KB...]
[INFO] --- maven-compiler-plugin:3.7.0:compile (default-compile) @ phoenix-hbase-compat-2.0.1 ---
[INFO] Changes detected - recompiling the module!
[INFO] Compiling 5 source files to <https://builds.apache.org/job/Phoenix-master-matrix/HBASE_PROFILE=2.0/ws/phoenix-hbase-compat-2.0.1/target/classes>
[INFO] <https://builds.apache.org/job/Phoenix-master-matrix/HBASE_PROFILE=2.0/ws/phoenix-hbase-compat-2.0.1/src/main/java/org/apache/phoenix/compat/hbase/OffsetCell.java>: Some input files use or override a deprecated API.
[INFO] <https://builds.apache.org/job/Phoenix-master-matrix/HBASE_PROFILE=2.0/ws/phoenix-hbase-compat-2.0.1/src/main/java/org/apache/phoenix/compat/hbase/OffsetCell.java>: Recompile with -Xlint:deprecation for details.
[INFO]
[INFO] --- maven-resources-plugin:3.1.0:testResources (default-testResources) @ phoenix-hbase-compat-2.0.1 ---
[INFO] Using 'UTF-8' encoding to copy filtered resources.
[INFO] skip non existing resourceDirectory <https://builds.apache.org/job/Phoenix-master-matrix/HBASE_PROFILE=2.0/ws/phoenix-hbase-compat-2.0.1/src/test/resources>
[INFO] Copying 3 resources
[INFO]
[INFO] --- maven-compiler-plugin:3.7.0:testCompile (default-testCompile) @ phoenix-hbase-compat-2.0.1 ---
[INFO] No sources to compile
[INFO]
[INFO] --- maven-surefire-plugin:2.22.0:test (default-test) @ phoenix-hbase-compat-2.0.1 ---
[INFO]
[INFO] --- maven-jar-plugin:3.1.0:jar (default-jar) @ phoenix-hbase-compat-2.0.1 ---
[INFO] Building jar: <https://builds.apache.org/job/Phoenix-master-matrix/HBASE_PROFILE=2.0/ws/phoenix-hbase-compat-2.0.1/target/phoenix-hbase-compat-2.0.1-5.1.0-SNAPSHOT.jar>
[INFO]
[INFO] --- maven-site-plugin:3.7.1:attach-descriptor (attach-descriptor) @ phoenix-hbase-compat-2.0.1 ---
[INFO] Skipping because packaging 'jar' is not pom.
[INFO]
[INFO] --- maven-install-plugin:2.5.2:install (default-install) @ phoenix-hbase-compat-2.0.1 ---
[INFO] Installing <https://builds.apache.org/job/Phoenix-master-matrix/HBASE_PROFILE=2.0/ws/phoenix-hbase-compat-2.0.1/target/phoenix-hbase-compat-2.0.1-5.1.0-SNAPSHOT.jar> to /home/jenkins/.m2/repository/org/apache/phoenix/phoenix-hbase-compat-2.0.1/5.1.0-SNAPSHOT/phoenix-hbase-compat-2.0.1-5.1.0-SNAPSHOT.jar
[INFO] Installing <https://builds.apache.org/job/Phoenix-master-matrix/HBASE_PROFILE=2.0/ws/phoenix-hbase-compat-2.0.1/pom.xml> to /home/jenkins/.m2/repository/org/apache/phoenix/phoenix-hbase-compat-2.0.1/5.1.0-SNAPSHOT/phoenix-hbase-compat-2.0.1-5.1.0-SNAPSHOT.pom
[INFO]
[INFO] ---------------------< org.apache.phoenix:phoenix >---------------------
[INFO] Building Apache Phoenix 5.1.0-SNAPSHOT [4/10]
[INFO] --------------------------------[ pom ]---------------------------------
[INFO]
[INFO] --- maven-clean-plugin:3.1.0:clean (default-clean) @ phoenix ---
[INFO] Deleting <https://builds.apache.org/job/Phoenix-master-matrix/HBASE_PROFILE=2.0/ws/target>
[INFO]
[INFO] --- maven-enforcer-plugin:3.0.0-M3:enforce (enforce-maven-version) @ phoenix ---
[INFO]
[INFO] --- maven-enforcer-plugin:3.0.0-M3:enforce (check-hbase-compatibility) @ phoenix ---
[INFO]
[INFO] --- maven-checkstyle-plugin:3.1.0:check (validate) @ phoenix ---
[INFO]
[INFO] --- jacoco-maven-plugin:0.7.9:prepare-agent (prepare-agent) @ phoenix ---
[INFO] jacocoArgLine set to -javaagent:/home/jenkins/.m2/repository/org/jacoco/org.jacoco.agent/0.7.9/org.jacoco.agent-0.7.9-runtime.jar=destfile=<https://builds.apache.org/job/Phoenix-master-matrix/HBASE_PROFILE=2.0/ws/target/jacoco.exec>
[INFO]
[INFO] --- maven-remote-resources-plugin:1.5:process (process-resource-bundles) @ phoenix ---
[INFO]
[INFO] --- maven-source-plugin:3.0.1:jar-no-fork (attach-sources) @ phoenix ---
[INFO]
[INFO] --- maven-jar-plugin:3.1.0:test-jar (default) @ phoenix ---
[WARNING] JAR will be empty - no content was marked for inclusion!
[INFO] Building jar: <https://builds.apache.org/job/Phoenix-master-matrix/HBASE_PROFILE=2.0/ws/target/phoenix-5.1.0-SNAPSHOT-tests.jar>
[INFO]
[INFO] --- maven-site-plugin:3.7.1:attach-descriptor (attach-descriptor) @ phoenix ---
[INFO] No site descriptor found: nothing to attach.
[INFO]
[INFO] --- jacoco-maven-plugin:0.7.9:report (report) @ phoenix ---
[INFO] Skipping JaCoCo execution due to missing execution data file.
[INFO]
[INFO] --- jacoco-maven-plugin:0.7.9:check (check) @ phoenix ---
[INFO] Skipping JaCoCo execution due to missing execution data <https://builds.apache.org/job/Phoenix-master-matrix/HBASE_PROFILE=2.0/ws/target/jacoco.exec>
[INFO]
[INFO] --- maven-install-plugin:2.5.2:install (default-install) @ phoenix ---
[INFO] Installing <https://builds.apache.org/job/Phoenix-master-matrix/HBASE_PROFILE=2.0/ws/pom.xml> to /home/jenkins/.m2/repository/org/apache/phoenix/phoenix/5.1.0-SNAPSHOT/phoenix-5.1.0-SNAPSHOT.pom
[INFO] Installing <https://builds.apache.org/job/Phoenix-master-matrix/HBASE_PROFILE=2.0/ws/target/phoenix-5.1.0-SNAPSHOT-tests.jar> to /home/jenkins/.m2/repository/org/apache/phoenix/phoenix/5.1.0-SNAPSHOT/phoenix-5.1.0-SNAPSHOT-tests.jar
[INFO]
[INFO] ------------------< org.apache.phoenix:phoenix-core >-------------------
[INFO] Building Phoenix Core 5.1.0-SNAPSHOT [5/10]
[INFO] --------------------------------[ jar ]---------------------------------
Downloading from apache release: https://repository.apache.org/content/repositories/releases/org/glassfish/javax.el/maven-metadata.xml
[INFO]
[INFO] --- maven-clean-plugin:3.1.0:clean (default-clean) @ phoenix-core ---
[INFO] Deleting <https://builds.apache.org/job/Phoenix-master-matrix/HBASE_PROFILE=2.0/ws/phoenix-core/target>
[INFO]
[INFO] --- maven-enforcer-plugin:3.0.0-M3:enforce (enforce-maven-version) @ phoenix-core ---
[INFO]
[INFO] --- maven-enforcer-plugin:3.0.0-M3:enforce (check-hbase-compatibility) @ phoenix-core ---
[INFO]
[INFO] --- maven-checkstyle-plugin:3.1.0:check (validate) @ phoenix-core ---
[INFO]
[INFO] --- build-helper-maven-plugin:1.9.1:add-test-source (add-test-source) @ phoenix-core ---
[INFO] Test Source directory: <https://builds.apache.org/job/Phoenix-master-matrix/HBASE_PROFILE=2.0/ws/phoenix-core/src/it/java> added.
[INFO]
[INFO] --- build-helper-maven-plugin:1.9.1:add-test-resource (add-test-resource) @ phoenix-core ---
[INFO]
[INFO] --- jacoco-maven-plugin:0.7.9:prepare-agent (prepare-agent) @ phoenix-core ---
[INFO] jacocoArgLine set to -javaagent:/home/jenkins/.m2/repository/org/jacoco/org.jacoco.agent/0.7.9/org.jacoco.agent-0.7.9-runtime.jar=destfile=<https://builds.apache.org/job/Phoenix-master-matrix/HBASE_PROFILE=2.0/ws/phoenix-core/target/jacoco.exec>
[INFO]
[INFO] --- build-helper-maven-plugin:1.9.1:add-source (add-source) @ phoenix-core ---
[INFO] Source directory: <https://builds.apache.org/job/Phoenix-master-matrix/HBASE_PROFILE=2.0/ws/phoenix-core/target/generated-sources/antlr3> added.
[INFO] Source directory: <https://builds.apache.org/job/Phoenix-master-matrix/HBASE_PROFILE=2.0/ws/phoenix-core/src/main/antlr3> added.
[INFO]
[INFO] --- antlr3-maven-plugin:3.5.2:antlr (default) @ phoenix-core ---
[INFO] ANTLR: Processing source directory <https://builds.apache.org/job/Phoenix-master-matrix/HBASE_PROFILE=2.0/ws/phoenix-core/src/main/antlr3>
ANTLR Parser Generator Version 3.5.2
Output file <https://builds.apache.org/job/Phoenix-master-matrix/HBASE_PROFILE=2.0/ws/phoenix-core/target/generated-sources/antlr3/org/apache/phoenix/parse/PhoenixSQLParser.java> does not exist: must build <https://builds.apache.org/job/Phoenix-master-matrix/HBASE_PROFILE=2.0/ws/phoenix-core/src/main/antlr3/PhoenixSQL.g>
PhoenixSQL.g
[INFO]
[INFO] --- maven-dependency-plugin:3.1.1:build-classpath (create-phoenix-generated-classpath) @ phoenix-core ---
[INFO] Wrote classpath file '<https://builds.apache.org/job/Phoenix-master-matrix/HBASE_PROFILE=2.0/ws/phoenix-core/target/cached_classpath.txt'.>
[INFO]
[INFO] --- maven-remote-resources-plugin:1.5:process (process-resource-bundles) @ phoenix-core ---
[INFO] artifact org.glassfish:javax.el: checking for updates from apache release
[INFO] artifact org.glassfish:javax.el: checking for updates from central
[INFO] artifact org.glassfish:javax.el: checking for updates from java.net.Releases
[INFO] artifact org.glassfish:javax.el: checking for updates from apache release
[INFO] artifact org.glassfish:javax.el: checking for updates from central
[INFO] artifact org.glassfish:javax.el: checking for updates from java.net.Releases
[INFO]
[INFO] --- maven-resources-plugin:3.1.0:resources (default-resources) @ phoenix-core ---
[INFO] Using 'UTF-8' encoding to copy filtered resources.
[INFO] Copying 3 resources
[INFO] Copying 3 resources
[INFO]
[INFO] --- maven-compiler-plugin:3.7.0:compile (default-compile) @ phoenix-core ---
[INFO] Changes detected - recompiling the module!
[INFO] Compiling 1169 source files to <https://builds.apache.org/job/Phoenix-master-matrix/HBASE_PROFILE=2.0/ws/phoenix-core/target/classes>
[WARNING] <https://builds.apache.org/job/Phoenix-master-matrix/HBASE_PROFILE=2.0/ws/phoenix-core/src/main/java/org/apache/phoenix/execute/DescVarLengthFastByteComparisons.java>:[25,16] sun.misc.Unsafe is internal proprietary API and may be removed in a future release
[WARNING] <https://builds.apache.org/job/Phoenix-master-matrix/HBASE_PROFILE=2.0/ws/phoenix-core/src/main/java/org/apache/phoenix/execute/DescVarLengthFastByteComparisons.java>:[116,26] sun.misc.Unsafe is internal proprietary API and may be removed in a future release
[WARNING] <https://builds.apache.org/job/Phoenix-master-matrix/HBASE_PROFILE=2.0/ws/phoenix-core/src/main/java/org/apache/phoenix/execute/DescVarLengthFastByteComparisons.java>:[122,30] sun.misc.Unsafe is internal proprietary API and may be removed in a future release
[WARNING] <https://builds.apache.org/job/Phoenix-master-matrix/HBASE_PROFILE=2.0/ws/phoenix-core/src/main/java/org/apache/phoenix/execute/DescVarLengthFastByteComparisons.java>:[126,39] sun.misc.Unsafe is internal proprietary API and may be removed in a future release
[INFO] <https://builds.apache.org/job/Phoenix-master-matrix/HBASE_PROFILE=2.0/ws/phoenix-core/src/main/java/org/apache/phoenix/expression/BaseExpression.java>: Some input files use or override a deprecated API.
[INFO] <https://builds.apache.org/job/Phoenix-master-matrix/HBASE_PROFILE=2.0/ws/phoenix-core/src/main/java/org/apache/phoenix/expression/BaseExpression.java>: Recompile with -Xlint:deprecation for details.
[INFO] <https://builds.apache.org/job/Phoenix-master-matrix/HBASE_PROFILE=2.0/ws/phoenix-core/src/main/java/org/apache/phoenix/jdbc/PhoenixStatement.java>: Some input files use unchecked or unsafe operations.
[INFO] <https://builds.apache.org/job/Phoenix-master-matrix/HBASE_PROFILE=2.0/ws/phoenix-core/src/main/java/org/apache/phoenix/jdbc/PhoenixStatement.java>: Recompile with -Xlint:unchecked for details.
[INFO]
[INFO] --- maven-dependency-plugin:3.1.1:build-classpath (create-mrapp-generated-classpath) @ phoenix-core ---
[INFO] Wrote classpath file '<https://builds.apache.org/job/Phoenix-master-matrix/HBASE_PROFILE=2.0/ws/phoenix-core/target/classes/mrapp-generated-classpath'.>
[INFO]
[INFO] --- maven-resources-plugin:3.1.0:testResources (default-testResources) @ phoenix-core ---
[INFO] Using 'UTF-8' encoding to copy filtered resources.
[INFO] Copying 5 resources
[INFO] Copying 12 resources
[INFO] Copying 3 resources
[INFO]
[INFO] --- maven-compiler-plugin:3.7.0:testCompile (default-testCompile) @ phoenix-core ---
[INFO] Changes detected - recompiling the module!
[INFO] Compiling 613 source files to <https://builds.apache.org/job/Phoenix-master-matrix/HBASE_PROFILE=2.0/ws/phoenix-core/target/test-classes>
[INFO] <https://builds.apache.org/job/Phoenix-master-matrix/HBASE_PROFILE=2.0/ws/phoenix-core/src/test/java/org/apache/phoenix/query/BaseTest.java>: Some input files use or override a deprecated API.
[INFO] <https://builds.apache.org/job/Phoenix-master-matrix/HBASE_PROFILE=2.0/ws/phoenix-core/src/test/java/org/apache/phoenix/query/BaseTest.java>: Recompile with -Xlint:deprecation for details.
[INFO] <https://builds.apache.org/job/Phoenix-master-matrix/HBASE_PROFILE=2.0/ws/phoenix-core/src/test/java/org/apache/phoenix/query/BaseTest.java>: Some input files use unchecked or unsafe operations.
[INFO] <https://builds.apache.org/job/Phoenix-master-matrix/HBASE_PROFILE=2.0/ws/phoenix-core/src/test/java/org/apache/phoenix/query/BaseTest.java>: Recompile with -Xlint:unchecked for details.
[INFO] -------------------------------------------------------------
[ERROR] COMPILATION ERROR :
[INFO] -------------------------------------------------------------
[ERROR] <https://builds.apache.org/job/Phoenix-master-matrix/HBASE_PROFILE=2.0/ws/phoenix-core/src/it/java/org/apache/phoenix/end2end/BasePermissionsIT.java>:[39,47] cannot find symbol
symbol: class GetUserPermissionsRequest
location: package org.apache.hadoop.hbase.security.access
[ERROR] <https://builds.apache.org/job/Phoenix-master-matrix/HBASE_PROFILE=2.0/ws/phoenix-core/src/it/java/org/apache/phoenix/end2end/BasePermissionsIT.java>:[1452,48] cannot find symbol
symbol: method hasUserName()
location: variable request of type org.apache.hadoop.hbase.protobuf.generated.AccessControlProtos.GetUserPermissionsRequest
[ERROR] <https://builds.apache.org/job/Phoenix-master-matrix/HBASE_PROFILE=2.0/ws/phoenix-core/src/it/java/org/apache/phoenix/end2end/BasePermissionsIT.java>:[1452,72] cannot find symbol
symbol: method getUserName()
location: variable request of type org.apache.hadoop.hbase.protobuf.generated.AccessControlProtos.GetUserPermissionsRequest
[ERROR] <https://builds.apache.org/job/Phoenix-master-matrix/HBASE_PROFILE=2.0/ws/phoenix-core/src/it/java/org/apache/phoenix/end2end/BasePermissionsIT.java>:[1458,32] cannot find symbol
symbol: method hasColumnFamily()
location: variable request of type org.apache.hadoop.hbase.protobuf.generated.AccessControlProtos.GetUserPermissionsRequest
[ERROR] <https://builds.apache.org/job/Phoenix-master-matrix/HBASE_PROFILE=2.0/ws/phoenix-core/src/it/java/org/apache/phoenix/end2end/BasePermissionsIT.java>:[1458,60] cannot find symbol
symbol: method getColumnFamily()
location: variable request of type org.apache.hadoop.hbase.protobuf.generated.AccessControlProtos.GetUserPermissionsRequest
[ERROR] <https://builds.apache.org/job/Phoenix-master-matrix/HBASE_PROFILE=2.0/ws/phoenix-core/src/it/java/org/apache/phoenix/end2end/BasePermissionsIT.java>:[1460,32] cannot find symbol
symbol: method hasColumnQualifier()
location: variable request of type org.apache.hadoop.hbase.protobuf.generated.AccessControlProtos.GetUserPermissionsRequest
[ERROR] <https://builds.apache.org/job/Phoenix-master-matrix/HBASE_PROFILE=2.0/ws/phoenix-core/src/it/java/org/apache/phoenix/end2end/BasePermissionsIT.java>:[1460,63] cannot find symbol
symbol: method getColumnQualifier()
location: variable request of type org.apache.hadoop.hbase.protobuf.generated.AccessControlProtos.GetUserPermissionsRequest
[ERROR] <https://builds.apache.org/job/Phoenix-master-matrix/HBASE_PROFILE=2.0/ws/phoenix-core/src/it/java/org/apache/phoenix/end2end/BasePermissionsIT.java>:[1461,17] cannot find symbol
symbol: class GetUserPermissionsRequest
location: class org.apache.phoenix.end2end.BasePermissionsIT.CustomAccessController
[ERROR] <https://builds.apache.org/job/Phoenix-master-matrix/HBASE_PROFILE=2.0/ws/phoenix-core/src/it/java/org/apache/phoenix/end2end/BasePermissionsIT.java>:[1463,49] cannot find symbol
symbol: variable GetUserPermissionsRequest
location: class org.apache.phoenix.end2end.BasePermissionsIT.CustomAccessController
[ERROR] <https://builds.apache.org/job/Phoenix-master-matrix/HBASE_PROFILE=2.0/ws/phoenix-core/src/it/java/org/apache/phoenix/end2end/BasePermissionsIT.java>:[1467,29] cannot find symbol
symbol: variable GetUserPermissionsRequest
location: class org.apache.phoenix.end2end.BasePermissionsIT.CustomAccessController
[ERROR] <https://builds.apache.org/job/Phoenix-master-matrix/HBASE_PROFILE=2.0/ws/phoenix-core/src/it/java/org/apache/phoenix/end2end/BasePermissionsIT.java>:[1470,29] cannot find symbol
symbol: variable GetUserPermissionsRequest
location: class org.apache.phoenix.end2end.BasePermissionsIT.CustomAccessController
[INFO] 11 errors
[INFO] -------------------------------------------------------------
[INFO] ------------------------------------------------------------------------
[INFO] Reactor Summary for Apache Phoenix 5.1.0-SNAPSHOT:
[INFO]
[INFO] Phoenix Hbase 2.2.1 compatibility .................. SUCCESS [ 14.648 s]
[INFO] Phoenix Hbase 2.1.6 compatibility .................. SUCCESS [ 2.904 s]
[INFO] Phoenix Hbase 2.0.1 compatibility .................. SUCCESS [ 4.446 s]
[INFO] Apache Phoenix ..................................... SUCCESS [ 2.204 s]
[INFO] Phoenix Core ....................................... FAILURE [ 55.229 s]
[INFO] Phoenix - Pherf .................................... SKIPPED
[INFO] Phoenix Client ..................................... SKIPPED
[INFO] Phoenix Server ..................................... SKIPPED
[INFO] Phoenix - Tracing Web Application .................. SKIPPED
[INFO] Phoenix Assembly ................................... SKIPPED
[INFO] ------------------------------------------------------------------------
[INFO] BUILD FAILURE
[INFO] ------------------------------------------------------------------------
[INFO] Total time: 01:20 min
[INFO] Finished at: 2020-06-12T23:37:47Z
[INFO] ------------------------------------------------------------------------
[ERROR] Failed to execute goal org.apache.maven.plugins:maven-compiler-plugin:3.7.0:testCompile (default-testCompile) on project phoenix-core: Compilation failure: Compilation failure:
[ERROR] <https://builds.apache.org/job/Phoenix-master-matrix/HBASE_PROFILE=2.0/ws/phoenix-core/src/it/java/org/apache/phoenix/end2end/BasePermissionsIT.java>:[39,47] cannot find symbol
[ERROR] symbol: class GetUserPermissionsRequest
[ERROR] location: package org.apache.hadoop.hbase.security.access
[ERROR] <https://builds.apache.org/job/Phoenix-master-matrix/HBASE_PROFILE=2.0/ws/phoenix-core/src/it/java/org/apache/phoenix/end2end/BasePermissionsIT.java>:[1452,48] cannot find symbol
[ERROR] symbol: method hasUserName()
[ERROR] location: variable request of type org.apache.hadoop.hbase.protobuf.generated.AccessControlProtos.GetUserPermissionsRequest
[ERROR] <https://builds.apache.org/job/Phoenix-master-matrix/HBASE_PROFILE=2.0/ws/phoenix-core/src/it/java/org/apache/phoenix/end2end/BasePermissionsIT.java>:[1452,72] cannot find symbol
[ERROR] symbol: method getUserName()
[ERROR] location: variable request of type org.apache.hadoop.hbase.protobuf.generated.AccessControlProtos.GetUserPermissionsRequest
[ERROR] <https://builds.apache.org/job/Phoenix-master-matrix/HBASE_PROFILE=2.0/ws/phoenix-core/src/it/java/org/apache/phoenix/end2end/BasePermissionsIT.java>:[1458,32] cannot find symbol
[ERROR] symbol: method hasColumnFamily()
[ERROR] location: variable request of type org.apache.hadoop.hbase.protobuf.generated.AccessControlProtos.GetUserPermissionsRequest
[ERROR] <https://builds.apache.org/job/Phoenix-master-matrix/HBASE_PROFILE=2.0/ws/phoenix-core/src/it/java/org/apache/phoenix/end2end/BasePermissionsIT.java>:[1458,60] cannot find symbol
[ERROR] symbol: method getColumnFamily()
[ERROR] location: variable request of type org.apache.hadoop.hbase.protobuf.generated.AccessControlProtos.GetUserPermissionsRequest
[ERROR] <https://builds.apache.org/job/Phoenix-master-matrix/HBASE_PROFILE=2.0/ws/phoenix-core/src/it/java/org/apache/phoenix/end2end/BasePermissionsIT.java>:[1460,32] cannot find symbol
[ERROR] symbol: method hasColumnQualifier()
[ERROR] location: variable request of type org.apache.hadoop.hbase.protobuf.generated.AccessControlProtos.GetUserPermissionsRequest
[ERROR] <https://builds.apache.org/job/Phoenix-master-matrix/HBASE_PROFILE=2.0/ws/phoenix-core/src/it/java/org/apache/phoenix/end2end/BasePermissionsIT.java>:[1460,63] cannot find symbol
[ERROR] symbol: method getColumnQualifier()
[ERROR] location: variable request of type org.apache.hadoop.hbase.protobuf.generated.AccessControlProtos.GetUserPermissionsRequest
[ERROR] <https://builds.apache.org/job/Phoenix-master-matrix/HBASE_PROFILE=2.0/ws/phoenix-core/src/it/java/org/apache/phoenix/end2end/BasePermissionsIT.java>:[1461,17] cannot find symbol
[ERROR] symbol: class GetUserPermissionsRequest
[ERROR] location: class org.apache.phoenix.end2end.BasePermissionsIT.CustomAccessController
[ERROR] <https://builds.apache.org/job/Phoenix-master-matrix/HBASE_PROFILE=2.0/ws/phoenix-core/src/it/java/org/apache/phoenix/end2end/BasePermissionsIT.java>:[1463,49] cannot find symbol
[ERROR] symbol: variable GetUserPermissionsRequest
[ERROR] location: class org.apache.phoenix.end2end.BasePermissionsIT.CustomAccessController
[ERROR] <https://builds.apache.org/job/Phoenix-master-matrix/HBASE_PROFILE=2.0/ws/phoenix-core/src/it/java/org/apache/phoenix/end2end/BasePermissionsIT.java>:[1467,29] cannot find symbol
[ERROR] symbol: variable GetUserPermissionsRequest
[ERROR] location: class org.apache.phoenix.end2end.BasePermissionsIT.CustomAccessController
[ERROR] <https://builds.apache.org/job/Phoenix-master-matrix/HBASE_PROFILE=2.0/ws/phoenix-core/src/it/java/org/apache/phoenix/end2end/BasePermissionsIT.java>:[1470,29] cannot find symbol
[ERROR] symbol: variable GetUserPermissionsRequest
[ERROR] location: class org.apache.phoenix.end2end.BasePermissionsIT.CustomAccessController
[ERROR] -> [Help 1]
[ERROR]
[ERROR] To see the full stack trace of the errors, re-run Maven with the -e switch.
[ERROR] Re-run Maven using the -X switch to enable full debug logging.
[ERROR]
[ERROR] For more information about the errors and possible solutions, please read the following articles:
[ERROR] [Help 1] http://cwiki.apache.org/confluence/display/MAVEN/MojoFailureException
[ERROR]
[ERROR] After correcting the problems, you can resume the build with the command
[ERROR] mvn <args> -rf :phoenix-core
Build step 'Invoke top-level Maven targets' marked build as failure
Archiving artifacts
Recording test results
ERROR: Step ?Publish JUnit test result report? failed: No test report files were found. Configuration error?
Not sending mail to unregistered user giskender@salesforce.com
Not sending mail to unregistered user Rajeshbabu Chintaguntla
Not sending mail to unregistered user noreply@github.com
Not sending mail to unregistered user abhishek.chouhan@salesforce.com
Not sending mail to unregistered user s.kadam@salesforce.com
Build failed in Jenkins: Phoenix | Master | HBase Profile » 2.0 #93
Posted by Apache Jenkins Server <je...@builds.apache.org>.
See <https://builds.apache.org/job/Phoenix-master-matrix/HBASE_PROFILE=2.0/93/display/redirect?page=changes>
Changes:
[gjacoby] PHOENIX-5875 - Optional logging for IndexTool verification
------------------------------------------
[...truncated 25.73 KB...]
[INFO] --- maven-compiler-plugin:3.7.0:compile (default-compile) @ phoenix-hbase-compat-2.0.1 ---
[INFO] Changes detected - recompiling the module!
[INFO] Compiling 5 source files to <https://builds.apache.org/job/Phoenix-master-matrix/HBASE_PROFILE=2.0/ws/phoenix-hbase-compat-2.0.1/target/classes>
[INFO] <https://builds.apache.org/job/Phoenix-master-matrix/HBASE_PROFILE=2.0/ws/phoenix-hbase-compat-2.0.1/src/main/java/org/apache/phoenix/compat/hbase/OffsetCell.java>: Some input files use or override a deprecated API.
[INFO] <https://builds.apache.org/job/Phoenix-master-matrix/HBASE_PROFILE=2.0/ws/phoenix-hbase-compat-2.0.1/src/main/java/org/apache/phoenix/compat/hbase/OffsetCell.java>: Recompile with -Xlint:deprecation for details.
[INFO]
[INFO] --- maven-resources-plugin:3.1.0:testResources (default-testResources) @ phoenix-hbase-compat-2.0.1 ---
[INFO] Using 'UTF-8' encoding to copy filtered resources.
[INFO] skip non existing resourceDirectory <https://builds.apache.org/job/Phoenix-master-matrix/HBASE_PROFILE=2.0/ws/phoenix-hbase-compat-2.0.1/src/test/resources>
[INFO] Copying 3 resources
[INFO]
[INFO] --- maven-compiler-plugin:3.7.0:testCompile (default-testCompile) @ phoenix-hbase-compat-2.0.1 ---
[INFO] No sources to compile
[INFO]
[INFO] --- maven-surefire-plugin:2.22.0:test (default-test) @ phoenix-hbase-compat-2.0.1 ---
[INFO]
[INFO] --- maven-jar-plugin:3.1.0:jar (default-jar) @ phoenix-hbase-compat-2.0.1 ---
[INFO] Building jar: <https://builds.apache.org/job/Phoenix-master-matrix/HBASE_PROFILE=2.0/ws/phoenix-hbase-compat-2.0.1/target/phoenix-hbase-compat-2.0.1-5.1.0-SNAPSHOT.jar>
[INFO]
[INFO] --- maven-site-plugin:3.7.1:attach-descriptor (attach-descriptor) @ phoenix-hbase-compat-2.0.1 ---
[INFO] Skipping because packaging 'jar' is not pom.
[INFO]
[INFO] --- maven-install-plugin:2.5.2:install (default-install) @ phoenix-hbase-compat-2.0.1 ---
[INFO] Installing <https://builds.apache.org/job/Phoenix-master-matrix/HBASE_PROFILE=2.0/ws/phoenix-hbase-compat-2.0.1/target/phoenix-hbase-compat-2.0.1-5.1.0-SNAPSHOT.jar> to /home/jenkins/.m2/repository/org/apache/phoenix/phoenix-hbase-compat-2.0.1/5.1.0-SNAPSHOT/phoenix-hbase-compat-2.0.1-5.1.0-SNAPSHOT.jar
[INFO] Installing <https://builds.apache.org/job/Phoenix-master-matrix/HBASE_PROFILE=2.0/ws/phoenix-hbase-compat-2.0.1/pom.xml> to /home/jenkins/.m2/repository/org/apache/phoenix/phoenix-hbase-compat-2.0.1/5.1.0-SNAPSHOT/phoenix-hbase-compat-2.0.1-5.1.0-SNAPSHOT.pom
[INFO]
[INFO] ---------------------< org.apache.phoenix:phoenix >---------------------
[INFO] Building Apache Phoenix 5.1.0-SNAPSHOT [4/10]
[INFO] --------------------------------[ pom ]---------------------------------
[INFO]
[INFO] --- maven-clean-plugin:3.1.0:clean (default-clean) @ phoenix ---
[INFO] Deleting <https://builds.apache.org/job/Phoenix-master-matrix/HBASE_PROFILE=2.0/ws/target>
[INFO]
[INFO] --- maven-enforcer-plugin:3.0.0-M3:enforce (enforce-maven-version) @ phoenix ---
[INFO]
[INFO] --- maven-enforcer-plugin:3.0.0-M3:enforce (check-hbase-compatibility) @ phoenix ---
[INFO]
[INFO] --- maven-checkstyle-plugin:3.1.0:check (validate) @ phoenix ---
[INFO]
[INFO] --- jacoco-maven-plugin:0.7.9:prepare-agent (prepare-agent) @ phoenix ---
[INFO] jacocoArgLine set to -javaagent:/home/jenkins/.m2/repository/org/jacoco/org.jacoco.agent/0.7.9/org.jacoco.agent-0.7.9-runtime.jar=destfile=<https://builds.apache.org/job/Phoenix-master-matrix/HBASE_PROFILE=2.0/ws/target/jacoco.exec>
[INFO]
[INFO] --- maven-remote-resources-plugin:1.5:process (process-resource-bundles) @ phoenix ---
[INFO]
[INFO] --- maven-source-plugin:3.0.1:jar-no-fork (attach-sources) @ phoenix ---
[INFO]
[INFO] --- maven-jar-plugin:3.1.0:test-jar (default) @ phoenix ---
[WARNING] JAR will be empty - no content was marked for inclusion!
[INFO] Building jar: <https://builds.apache.org/job/Phoenix-master-matrix/HBASE_PROFILE=2.0/ws/target/phoenix-5.1.0-SNAPSHOT-tests.jar>
[INFO]
[INFO] --- maven-site-plugin:3.7.1:attach-descriptor (attach-descriptor) @ phoenix ---
[INFO] No site descriptor found: nothing to attach.
[INFO]
[INFO] --- jacoco-maven-plugin:0.7.9:report (report) @ phoenix ---
[INFO] Skipping JaCoCo execution due to missing execution data file.
[INFO]
[INFO] --- jacoco-maven-plugin:0.7.9:check (check) @ phoenix ---
[INFO] Skipping JaCoCo execution due to missing execution data <https://builds.apache.org/job/Phoenix-master-matrix/HBASE_PROFILE=2.0/ws/target/jacoco.exec>
[INFO]
[INFO] --- maven-install-plugin:2.5.2:install (default-install) @ phoenix ---
[INFO] Installing <https://builds.apache.org/job/Phoenix-master-matrix/HBASE_PROFILE=2.0/ws/pom.xml> to /home/jenkins/.m2/repository/org/apache/phoenix/phoenix/5.1.0-SNAPSHOT/phoenix-5.1.0-SNAPSHOT.pom
[INFO] Installing <https://builds.apache.org/job/Phoenix-master-matrix/HBASE_PROFILE=2.0/ws/target/phoenix-5.1.0-SNAPSHOT-tests.jar> to /home/jenkins/.m2/repository/org/apache/phoenix/phoenix/5.1.0-SNAPSHOT/phoenix-5.1.0-SNAPSHOT-tests.jar
[INFO]
[INFO] ------------------< org.apache.phoenix:phoenix-core >-------------------
[INFO] Building Phoenix Core 5.1.0-SNAPSHOT [5/10]
[INFO] --------------------------------[ jar ]---------------------------------
Downloading from apache release: https://repository.apache.org/content/repositories/releases/org/glassfish/javax.el/maven-metadata.xml
[INFO]
[INFO] --- maven-clean-plugin:3.1.0:clean (default-clean) @ phoenix-core ---
[INFO] Deleting <https://builds.apache.org/job/Phoenix-master-matrix/HBASE_PROFILE=2.0/ws/phoenix-core/target>
[INFO]
[INFO] --- maven-enforcer-plugin:3.0.0-M3:enforce (enforce-maven-version) @ phoenix-core ---
[INFO]
[INFO] --- maven-enforcer-plugin:3.0.0-M3:enforce (check-hbase-compatibility) @ phoenix-core ---
[INFO]
[INFO] --- maven-checkstyle-plugin:3.1.0:check (validate) @ phoenix-core ---
[INFO]
[INFO] --- build-helper-maven-plugin:1.9.1:add-test-source (add-test-source) @ phoenix-core ---
[INFO] Test Source directory: <https://builds.apache.org/job/Phoenix-master-matrix/HBASE_PROFILE=2.0/ws/phoenix-core/src/it/java> added.
[INFO]
[INFO] --- build-helper-maven-plugin:1.9.1:add-test-resource (add-test-resource) @ phoenix-core ---
[INFO]
[INFO] --- jacoco-maven-plugin:0.7.9:prepare-agent (prepare-agent) @ phoenix-core ---
[INFO] jacocoArgLine set to -javaagent:/home/jenkins/.m2/repository/org/jacoco/org.jacoco.agent/0.7.9/org.jacoco.agent-0.7.9-runtime.jar=destfile=<https://builds.apache.org/job/Phoenix-master-matrix/HBASE_PROFILE=2.0/ws/phoenix-core/target/jacoco.exec>
[INFO]
[INFO] --- build-helper-maven-plugin:1.9.1:add-source (add-source) @ phoenix-core ---
[INFO] Source directory: <https://builds.apache.org/job/Phoenix-master-matrix/HBASE_PROFILE=2.0/ws/phoenix-core/target/generated-sources/antlr3> added.
[INFO] Source directory: <https://builds.apache.org/job/Phoenix-master-matrix/HBASE_PROFILE=2.0/ws/phoenix-core/src/main/antlr3> added.
[INFO]
[INFO] --- antlr3-maven-plugin:3.5.2:antlr (default) @ phoenix-core ---
[INFO] ANTLR: Processing source directory <https://builds.apache.org/job/Phoenix-master-matrix/HBASE_PROFILE=2.0/ws/phoenix-core/src/main/antlr3>
ANTLR Parser Generator Version 3.5.2
Output file <https://builds.apache.org/job/Phoenix-master-matrix/HBASE_PROFILE=2.0/ws/phoenix-core/target/generated-sources/antlr3/org/apache/phoenix/parse/PhoenixSQLParser.java> does not exist: must build <https://builds.apache.org/job/Phoenix-master-matrix/HBASE_PROFILE=2.0/ws/phoenix-core/src/main/antlr3/PhoenixSQL.g>
PhoenixSQL.g
[INFO]
[INFO] --- maven-dependency-plugin:3.1.1:build-classpath (create-phoenix-generated-classpath) @ phoenix-core ---
[INFO] Wrote classpath file '<https://builds.apache.org/job/Phoenix-master-matrix/HBASE_PROFILE=2.0/ws/phoenix-core/target/cached_classpath.txt'.>
[INFO]
[INFO] --- maven-remote-resources-plugin:1.5:process (process-resource-bundles) @ phoenix-core ---
[INFO] artifact org.glassfish:javax.el: checking for updates from apache release
[INFO] artifact org.glassfish:javax.el: checking for updates from central
[INFO] artifact org.glassfish:javax.el: checking for updates from java.net.Releases
[INFO] artifact org.glassfish:javax.el: checking for updates from apache release
[INFO] artifact org.glassfish:javax.el: checking for updates from central
[INFO] artifact org.glassfish:javax.el: checking for updates from java.net.Releases
[INFO]
[INFO] --- maven-resources-plugin:3.1.0:resources (default-resources) @ phoenix-core ---
[INFO] Using 'UTF-8' encoding to copy filtered resources.
[INFO] Copying 3 resources
[INFO] Copying 3 resources
[INFO]
[INFO] --- maven-compiler-plugin:3.7.0:compile (default-compile) @ phoenix-core ---
[INFO] Changes detected - recompiling the module!
[INFO] Compiling 1169 source files to <https://builds.apache.org/job/Phoenix-master-matrix/HBASE_PROFILE=2.0/ws/phoenix-core/target/classes>
[WARNING] <https://builds.apache.org/job/Phoenix-master-matrix/HBASE_PROFILE=2.0/ws/phoenix-core/src/main/java/org/apache/phoenix/execute/DescVarLengthFastByteComparisons.java>:[25,16] sun.misc.Unsafe is internal proprietary API and may be removed in a future release
[WARNING] <https://builds.apache.org/job/Phoenix-master-matrix/HBASE_PROFILE=2.0/ws/phoenix-core/src/main/java/org/apache/phoenix/execute/DescVarLengthFastByteComparisons.java>:[116,26] sun.misc.Unsafe is internal proprietary API and may be removed in a future release
[WARNING] <https://builds.apache.org/job/Phoenix-master-matrix/HBASE_PROFILE=2.0/ws/phoenix-core/src/main/java/org/apache/phoenix/execute/DescVarLengthFastByteComparisons.java>:[122,30] sun.misc.Unsafe is internal proprietary API and may be removed in a future release
[WARNING] <https://builds.apache.org/job/Phoenix-master-matrix/HBASE_PROFILE=2.0/ws/phoenix-core/src/main/java/org/apache/phoenix/execute/DescVarLengthFastByteComparisons.java>:[126,39] sun.misc.Unsafe is internal proprietary API and may be removed in a future release
[INFO] <https://builds.apache.org/job/Phoenix-master-matrix/HBASE_PROFILE=2.0/ws/phoenix-core/src/main/java/org/apache/phoenix/expression/BaseExpression.java>: Some input files use or override a deprecated API.
[INFO] <https://builds.apache.org/job/Phoenix-master-matrix/HBASE_PROFILE=2.0/ws/phoenix-core/src/main/java/org/apache/phoenix/expression/BaseExpression.java>: Recompile with -Xlint:deprecation for details.
[INFO] <https://builds.apache.org/job/Phoenix-master-matrix/HBASE_PROFILE=2.0/ws/phoenix-core/src/main/java/org/apache/phoenix/jdbc/PhoenixStatement.java>: Some input files use unchecked or unsafe operations.
[INFO] <https://builds.apache.org/job/Phoenix-master-matrix/HBASE_PROFILE=2.0/ws/phoenix-core/src/main/java/org/apache/phoenix/jdbc/PhoenixStatement.java>: Recompile with -Xlint:unchecked for details.
[INFO]
[INFO] --- maven-dependency-plugin:3.1.1:build-classpath (create-mrapp-generated-classpath) @ phoenix-core ---
[INFO] Wrote classpath file '<https://builds.apache.org/job/Phoenix-master-matrix/HBASE_PROFILE=2.0/ws/phoenix-core/target/classes/mrapp-generated-classpath'.>
[INFO]
[INFO] --- maven-resources-plugin:3.1.0:testResources (default-testResources) @ phoenix-core ---
[INFO] Using 'UTF-8' encoding to copy filtered resources.
[INFO] Copying 5 resources
[INFO] Copying 12 resources
[INFO] Copying 3 resources
[INFO]
[INFO] --- maven-compiler-plugin:3.7.0:testCompile (default-testCompile) @ phoenix-core ---
[INFO] Changes detected - recompiling the module!
[INFO] Compiling 613 source files to <https://builds.apache.org/job/Phoenix-master-matrix/HBASE_PROFILE=2.0/ws/phoenix-core/target/test-classes>
[INFO] <https://builds.apache.org/job/Phoenix-master-matrix/HBASE_PROFILE=2.0/ws/phoenix-core/src/test/java/org/apache/phoenix/query/BaseTest.java>: Some input files use or override a deprecated API.
[INFO] <https://builds.apache.org/job/Phoenix-master-matrix/HBASE_PROFILE=2.0/ws/phoenix-core/src/test/java/org/apache/phoenix/query/BaseTest.java>: Recompile with -Xlint:deprecation for details.
[INFO] <https://builds.apache.org/job/Phoenix-master-matrix/HBASE_PROFILE=2.0/ws/phoenix-core/src/test/java/org/apache/phoenix/query/BaseTest.java>: Some input files use unchecked or unsafe operations.
[INFO] <https://builds.apache.org/job/Phoenix-master-matrix/HBASE_PROFILE=2.0/ws/phoenix-core/src/test/java/org/apache/phoenix/query/BaseTest.java>: Recompile with -Xlint:unchecked for details.
[INFO] -------------------------------------------------------------
[ERROR] COMPILATION ERROR :
[INFO] -------------------------------------------------------------
[ERROR] <https://builds.apache.org/job/Phoenix-master-matrix/HBASE_PROFILE=2.0/ws/phoenix-core/src/it/java/org/apache/phoenix/end2end/BasePermissionsIT.java>:[39,47] cannot find symbol
symbol: class GetUserPermissionsRequest
location: package org.apache.hadoop.hbase.security.access
[ERROR] <https://builds.apache.org/job/Phoenix-master-matrix/HBASE_PROFILE=2.0/ws/phoenix-core/src/it/java/org/apache/phoenix/end2end/BasePermissionsIT.java>:[1452,48] cannot find symbol
symbol: method hasUserName()
location: variable request of type org.apache.hadoop.hbase.protobuf.generated.AccessControlProtos.GetUserPermissionsRequest
[ERROR] <https://builds.apache.org/job/Phoenix-master-matrix/HBASE_PROFILE=2.0/ws/phoenix-core/src/it/java/org/apache/phoenix/end2end/BasePermissionsIT.java>:[1452,72] cannot find symbol
symbol: method getUserName()
location: variable request of type org.apache.hadoop.hbase.protobuf.generated.AccessControlProtos.GetUserPermissionsRequest
[ERROR] <https://builds.apache.org/job/Phoenix-master-matrix/HBASE_PROFILE=2.0/ws/phoenix-core/src/it/java/org/apache/phoenix/end2end/BasePermissionsIT.java>:[1458,32] cannot find symbol
symbol: method hasColumnFamily()
location: variable request of type org.apache.hadoop.hbase.protobuf.generated.AccessControlProtos.GetUserPermissionsRequest
[ERROR] <https://builds.apache.org/job/Phoenix-master-matrix/HBASE_PROFILE=2.0/ws/phoenix-core/src/it/java/org/apache/phoenix/end2end/BasePermissionsIT.java>:[1458,60] cannot find symbol
symbol: method getColumnFamily()
location: variable request of type org.apache.hadoop.hbase.protobuf.generated.AccessControlProtos.GetUserPermissionsRequest
[ERROR] <https://builds.apache.org/job/Phoenix-master-matrix/HBASE_PROFILE=2.0/ws/phoenix-core/src/it/java/org/apache/phoenix/end2end/BasePermissionsIT.java>:[1460,32] cannot find symbol
symbol: method hasColumnQualifier()
location: variable request of type org.apache.hadoop.hbase.protobuf.generated.AccessControlProtos.GetUserPermissionsRequest
[ERROR] <https://builds.apache.org/job/Phoenix-master-matrix/HBASE_PROFILE=2.0/ws/phoenix-core/src/it/java/org/apache/phoenix/end2end/BasePermissionsIT.java>:[1460,63] cannot find symbol
symbol: method getColumnQualifier()
location: variable request of type org.apache.hadoop.hbase.protobuf.generated.AccessControlProtos.GetUserPermissionsRequest
[ERROR] <https://builds.apache.org/job/Phoenix-master-matrix/HBASE_PROFILE=2.0/ws/phoenix-core/src/it/java/org/apache/phoenix/end2end/BasePermissionsIT.java>:[1461,17] cannot find symbol
symbol: class GetUserPermissionsRequest
location: class org.apache.phoenix.end2end.BasePermissionsIT.CustomAccessController
[ERROR] <https://builds.apache.org/job/Phoenix-master-matrix/HBASE_PROFILE=2.0/ws/phoenix-core/src/it/java/org/apache/phoenix/end2end/BasePermissionsIT.java>:[1463,49] cannot find symbol
symbol: variable GetUserPermissionsRequest
location: class org.apache.phoenix.end2end.BasePermissionsIT.CustomAccessController
[ERROR] <https://builds.apache.org/job/Phoenix-master-matrix/HBASE_PROFILE=2.0/ws/phoenix-core/src/it/java/org/apache/phoenix/end2end/BasePermissionsIT.java>:[1467,29] cannot find symbol
symbol: variable GetUserPermissionsRequest
location: class org.apache.phoenix.end2end.BasePermissionsIT.CustomAccessController
[ERROR] <https://builds.apache.org/job/Phoenix-master-matrix/HBASE_PROFILE=2.0/ws/phoenix-core/src/it/java/org/apache/phoenix/end2end/BasePermissionsIT.java>:[1470,29] cannot find symbol
symbol: variable GetUserPermissionsRequest
location: class org.apache.phoenix.end2end.BasePermissionsIT.CustomAccessController
[INFO] 11 errors
[INFO] -------------------------------------------------------------
[INFO] ------------------------------------------------------------------------
[INFO] Reactor Summary for Apache Phoenix 5.1.0-SNAPSHOT:
[INFO]
[INFO] Phoenix Hbase 2.2.1 compatibility .................. SUCCESS [ 14.355 s]
[INFO] Phoenix Hbase 2.1.6 compatibility .................. SUCCESS [ 3.098 s]
[INFO] Phoenix Hbase 2.0.1 compatibility .................. SUCCESS [ 3.096 s]
[INFO] Apache Phoenix ..................................... SUCCESS [ 2.005 s]
[INFO] Phoenix Core ....................................... FAILURE [ 50.871 s]
[INFO] Phoenix - Pherf .................................... SKIPPED
[INFO] Phoenix Client ..................................... SKIPPED
[INFO] Phoenix Server ..................................... SKIPPED
[INFO] Phoenix - Tracing Web Application .................. SKIPPED
[INFO] Phoenix Assembly ................................... SKIPPED
[INFO] ------------------------------------------------------------------------
[INFO] BUILD FAILURE
[INFO] ------------------------------------------------------------------------
[INFO] Total time: 01:14 min
[INFO] Finished at: 2020-06-12T17:37:24Z
[INFO] ------------------------------------------------------------------------
[ERROR] Failed to execute goal org.apache.maven.plugins:maven-compiler-plugin:3.7.0:testCompile (default-testCompile) on project phoenix-core: Compilation failure: Compilation failure:
[ERROR] <https://builds.apache.org/job/Phoenix-master-matrix/HBASE_PROFILE=2.0/ws/phoenix-core/src/it/java/org/apache/phoenix/end2end/BasePermissionsIT.java>:[39,47] cannot find symbol
[ERROR] symbol: class GetUserPermissionsRequest
[ERROR] location: package org.apache.hadoop.hbase.security.access
[ERROR] <https://builds.apache.org/job/Phoenix-master-matrix/HBASE_PROFILE=2.0/ws/phoenix-core/src/it/java/org/apache/phoenix/end2end/BasePermissionsIT.java>:[1452,48] cannot find symbol
[ERROR] symbol: method hasUserName()
[ERROR] location: variable request of type org.apache.hadoop.hbase.protobuf.generated.AccessControlProtos.GetUserPermissionsRequest
[ERROR] <https://builds.apache.org/job/Phoenix-master-matrix/HBASE_PROFILE=2.0/ws/phoenix-core/src/it/java/org/apache/phoenix/end2end/BasePermissionsIT.java>:[1452,72] cannot find symbol
[ERROR] symbol: method getUserName()
[ERROR] location: variable request of type org.apache.hadoop.hbase.protobuf.generated.AccessControlProtos.GetUserPermissionsRequest
[ERROR] <https://builds.apache.org/job/Phoenix-master-matrix/HBASE_PROFILE=2.0/ws/phoenix-core/src/it/java/org/apache/phoenix/end2end/BasePermissionsIT.java>:[1458,32] cannot find symbol
[ERROR] symbol: method hasColumnFamily()
[ERROR] location: variable request of type org.apache.hadoop.hbase.protobuf.generated.AccessControlProtos.GetUserPermissionsRequest
[ERROR] <https://builds.apache.org/job/Phoenix-master-matrix/HBASE_PROFILE=2.0/ws/phoenix-core/src/it/java/org/apache/phoenix/end2end/BasePermissionsIT.java>:[1458,60] cannot find symbol
[ERROR] symbol: method getColumnFamily()
[ERROR] location: variable request of type org.apache.hadoop.hbase.protobuf.generated.AccessControlProtos.GetUserPermissionsRequest
[ERROR] <https://builds.apache.org/job/Phoenix-master-matrix/HBASE_PROFILE=2.0/ws/phoenix-core/src/it/java/org/apache/phoenix/end2end/BasePermissionsIT.java>:[1460,32] cannot find symbol
[ERROR] symbol: method hasColumnQualifier()
[ERROR] location: variable request of type org.apache.hadoop.hbase.protobuf.generated.AccessControlProtos.GetUserPermissionsRequest
[ERROR] <https://builds.apache.org/job/Phoenix-master-matrix/HBASE_PROFILE=2.0/ws/phoenix-core/src/it/java/org/apache/phoenix/end2end/BasePermissionsIT.java>:[1460,63] cannot find symbol
[ERROR] symbol: method getColumnQualifier()
[ERROR] location: variable request of type org.apache.hadoop.hbase.protobuf.generated.AccessControlProtos.GetUserPermissionsRequest
[ERROR] <https://builds.apache.org/job/Phoenix-master-matrix/HBASE_PROFILE=2.0/ws/phoenix-core/src/it/java/org/apache/phoenix/end2end/BasePermissionsIT.java>:[1461,17] cannot find symbol
[ERROR] symbol: class GetUserPermissionsRequest
[ERROR] location: class org.apache.phoenix.end2end.BasePermissionsIT.CustomAccessController
[ERROR] <https://builds.apache.org/job/Phoenix-master-matrix/HBASE_PROFILE=2.0/ws/phoenix-core/src/it/java/org/apache/phoenix/end2end/BasePermissionsIT.java>:[1463,49] cannot find symbol
[ERROR] symbol: variable GetUserPermissionsRequest
[ERROR] location: class org.apache.phoenix.end2end.BasePermissionsIT.CustomAccessController
[ERROR] <https://builds.apache.org/job/Phoenix-master-matrix/HBASE_PROFILE=2.0/ws/phoenix-core/src/it/java/org/apache/phoenix/end2end/BasePermissionsIT.java>:[1467,29] cannot find symbol
[ERROR] symbol: variable GetUserPermissionsRequest
[ERROR] location: class org.apache.phoenix.end2end.BasePermissionsIT.CustomAccessController
[ERROR] <https://builds.apache.org/job/Phoenix-master-matrix/HBASE_PROFILE=2.0/ws/phoenix-core/src/it/java/org/apache/phoenix/end2end/BasePermissionsIT.java>:[1470,29] cannot find symbol
[ERROR] symbol: variable GetUserPermissionsRequest
[ERROR] location: class org.apache.phoenix.end2end.BasePermissionsIT.CustomAccessController
[ERROR] -> [Help 1]
[ERROR]
[ERROR] To see the full stack trace of the errors, re-run Maven with the -e switch.
[ERROR] Re-run Maven using the -X switch to enable full debug logging.
[ERROR]
[ERROR] For more information about the errors and possible solutions, please read the following articles:
[ERROR] [Help 1] http://cwiki.apache.org/confluence/display/MAVEN/MojoFailureException
[ERROR]
[ERROR] After correcting the problems, you can resume the build with the command
[ERROR] mvn <args> -rf :phoenix-core
Build step 'Invoke top-level Maven targets' marked build as failure
Archiving artifacts
Recording test results
ERROR: Step ?Publish JUnit test result report? failed: No test report files were found. Configuration error?
Not sending mail to unregistered user giskender@salesforce.com
Not sending mail to unregistered user Rajeshbabu Chintaguntla
Not sending mail to unregistered user noreply@github.com
Not sending mail to unregistered user abhishek.chouhan@salesforce.com
Not sending mail to unregistered user s.kadam@salesforce.com
Build failed in Jenkins: Phoenix | Master | HBase Profile » 2.0 #92
Posted by Apache Jenkins Server <je...@builds.apache.org>.
See <https://builds.apache.org/job/Phoenix-master-matrix/HBASE_PROFILE=2.0/92/display/redirect?page=changes>
Changes:
[gjacoby] PHOENIX-5942 - ParameterizedIndexUpgradeToolIT is too slow (#798)
------------------------------------------
[...truncated 25.74 KB...]
[INFO] Changes detected - recompiling the module!
[INFO] Compiling 5 source files to <https://builds.apache.org/job/Phoenix-master-matrix/HBASE_PROFILE=2.0/ws/phoenix-hbase-compat-2.0.1/target/classes>
[INFO] <https://builds.apache.org/job/Phoenix-master-matrix/HBASE_PROFILE=2.0/ws/phoenix-hbase-compat-2.0.1/src/main/java/org/apache/phoenix/compat/hbase/OffsetCell.java>: Some input files use or override a deprecated API.
[INFO] <https://builds.apache.org/job/Phoenix-master-matrix/HBASE_PROFILE=2.0/ws/phoenix-hbase-compat-2.0.1/src/main/java/org/apache/phoenix/compat/hbase/OffsetCell.java>: Recompile with -Xlint:deprecation for details.
[INFO]
[INFO] --- maven-resources-plugin:3.1.0:testResources (default-testResources) @ phoenix-hbase-compat-2.0.1 ---
[INFO] Using 'UTF-8' encoding to copy filtered resources.
[INFO] skip non existing resourceDirectory <https://builds.apache.org/job/Phoenix-master-matrix/HBASE_PROFILE=2.0/ws/phoenix-hbase-compat-2.0.1/src/test/resources>
[INFO] Copying 3 resources
[INFO]
[INFO] --- maven-compiler-plugin:3.7.0:testCompile (default-testCompile) @ phoenix-hbase-compat-2.0.1 ---
[INFO] No sources to compile
[INFO]
[INFO] --- maven-surefire-plugin:2.22.0:test (default-test) @ phoenix-hbase-compat-2.0.1 ---
[INFO]
[INFO] --- maven-jar-plugin:3.1.0:jar (default-jar) @ phoenix-hbase-compat-2.0.1 ---
[INFO] Building jar: <https://builds.apache.org/job/Phoenix-master-matrix/HBASE_PROFILE=2.0/ws/phoenix-hbase-compat-2.0.1/target/phoenix-hbase-compat-2.0.1-5.1.0-SNAPSHOT.jar>
[INFO]
[INFO] --- maven-site-plugin:3.7.1:attach-descriptor (attach-descriptor) @ phoenix-hbase-compat-2.0.1 ---
[INFO] Skipping because packaging 'jar' is not pom.
[INFO]
[INFO] --- maven-install-plugin:2.5.2:install (default-install) @ phoenix-hbase-compat-2.0.1 ---
[INFO] Installing <https://builds.apache.org/job/Phoenix-master-matrix/HBASE_PROFILE=2.0/ws/phoenix-hbase-compat-2.0.1/target/phoenix-hbase-compat-2.0.1-5.1.0-SNAPSHOT.jar> to /home/jenkins/.m2/repository/org/apache/phoenix/phoenix-hbase-compat-2.0.1/5.1.0-SNAPSHOT/phoenix-hbase-compat-2.0.1-5.1.0-SNAPSHOT.jar
[INFO] Installing <https://builds.apache.org/job/Phoenix-master-matrix/HBASE_PROFILE=2.0/ws/phoenix-hbase-compat-2.0.1/pom.xml> to /home/jenkins/.m2/repository/org/apache/phoenix/phoenix-hbase-compat-2.0.1/5.1.0-SNAPSHOT/phoenix-hbase-compat-2.0.1-5.1.0-SNAPSHOT.pom
[INFO]
[INFO] ---------------------< org.apache.phoenix:phoenix >---------------------
[INFO] Building Apache Phoenix 5.1.0-SNAPSHOT [4/10]
[INFO] --------------------------------[ pom ]---------------------------------
[INFO]
[INFO] --- maven-clean-plugin:3.1.0:clean (default-clean) @ phoenix ---
[INFO] Deleting <https://builds.apache.org/job/Phoenix-master-matrix/HBASE_PROFILE=2.0/ws/target>
[INFO]
[INFO] --- maven-enforcer-plugin:3.0.0-M3:enforce (enforce-maven-version) @ phoenix ---
[INFO]
[INFO] --- maven-enforcer-plugin:3.0.0-M3:enforce (check-hbase-compatibility) @ phoenix ---
[INFO]
[INFO] --- maven-checkstyle-plugin:3.1.0:check (validate) @ phoenix ---
[INFO]
[INFO] --- jacoco-maven-plugin:0.7.9:prepare-agent (prepare-agent) @ phoenix ---
[INFO] jacocoArgLine set to -javaagent:/home/jenkins/.m2/repository/org/jacoco/org.jacoco.agent/0.7.9/org.jacoco.agent-0.7.9-runtime.jar=destfile=<https://builds.apache.org/job/Phoenix-master-matrix/HBASE_PROFILE=2.0/ws/target/jacoco.exec>
[INFO]
[INFO] --- maven-remote-resources-plugin:1.5:process (process-resource-bundles) @ phoenix ---
[INFO]
[INFO] --- maven-source-plugin:3.0.1:jar-no-fork (attach-sources) @ phoenix ---
[INFO]
[INFO] --- maven-jar-plugin:3.1.0:test-jar (default) @ phoenix ---
[WARNING] JAR will be empty - no content was marked for inclusion!
[INFO] Building jar: <https://builds.apache.org/job/Phoenix-master-matrix/HBASE_PROFILE=2.0/ws/target/phoenix-5.1.0-SNAPSHOT-tests.jar>
[INFO]
[INFO] --- maven-site-plugin:3.7.1:attach-descriptor (attach-descriptor) @ phoenix ---
[INFO] No site descriptor found: nothing to attach.
[INFO]
[INFO] --- jacoco-maven-plugin:0.7.9:report (report) @ phoenix ---
[INFO] Skipping JaCoCo execution due to missing execution data file.
[INFO]
[INFO] --- jacoco-maven-plugin:0.7.9:check (check) @ phoenix ---
[INFO] Skipping JaCoCo execution due to missing execution data <https://builds.apache.org/job/Phoenix-master-matrix/HBASE_PROFILE=2.0/ws/target/jacoco.exec>
[INFO]
[INFO] --- maven-install-plugin:2.5.2:install (default-install) @ phoenix ---
[INFO] Installing <https://builds.apache.org/job/Phoenix-master-matrix/HBASE_PROFILE=2.0/ws/pom.xml> to /home/jenkins/.m2/repository/org/apache/phoenix/phoenix/5.1.0-SNAPSHOT/phoenix-5.1.0-SNAPSHOT.pom
[INFO] Installing <https://builds.apache.org/job/Phoenix-master-matrix/HBASE_PROFILE=2.0/ws/target/phoenix-5.1.0-SNAPSHOT-tests.jar> to /home/jenkins/.m2/repository/org/apache/phoenix/phoenix/5.1.0-SNAPSHOT/phoenix-5.1.0-SNAPSHOT-tests.jar
[INFO]
[INFO] ------------------< org.apache.phoenix:phoenix-core >-------------------
[INFO] Building Phoenix Core 5.1.0-SNAPSHOT [5/10]
[INFO] --------------------------------[ jar ]---------------------------------
Downloading from apache release: https://repository.apache.org/content/repositories/releases/org/glassfish/javax.el/maven-metadata.xml
[INFO]
[INFO] --- maven-clean-plugin:3.1.0:clean (default-clean) @ phoenix-core ---
[INFO] Deleting <https://builds.apache.org/job/Phoenix-master-matrix/HBASE_PROFILE=2.0/ws/phoenix-core/target>
[INFO]
[INFO] --- maven-enforcer-plugin:3.0.0-M3:enforce (enforce-maven-version) @ phoenix-core ---
[INFO]
[INFO] --- maven-enforcer-plugin:3.0.0-M3:enforce (check-hbase-compatibility) @ phoenix-core ---
[INFO]
[INFO] --- maven-checkstyle-plugin:3.1.0:check (validate) @ phoenix-core ---
[INFO]
[INFO] --- build-helper-maven-plugin:1.9.1:add-test-source (add-test-source) @ phoenix-core ---
[INFO] Test Source directory: <https://builds.apache.org/job/Phoenix-master-matrix/HBASE_PROFILE=2.0/ws/phoenix-core/src/it/java> added.
[INFO]
[INFO] --- build-helper-maven-plugin:1.9.1:add-test-resource (add-test-resource) @ phoenix-core ---
[INFO]
[INFO] --- jacoco-maven-plugin:0.7.9:prepare-agent (prepare-agent) @ phoenix-core ---
[INFO] jacocoArgLine set to -javaagent:/home/jenkins/.m2/repository/org/jacoco/org.jacoco.agent/0.7.9/org.jacoco.agent-0.7.9-runtime.jar=destfile=<https://builds.apache.org/job/Phoenix-master-matrix/HBASE_PROFILE=2.0/ws/phoenix-core/target/jacoco.exec>
[INFO]
[INFO] --- build-helper-maven-plugin:1.9.1:add-source (add-source) @ phoenix-core ---
[INFO] Source directory: <https://builds.apache.org/job/Phoenix-master-matrix/HBASE_PROFILE=2.0/ws/phoenix-core/target/generated-sources/antlr3> added.
[INFO] Source directory: <https://builds.apache.org/job/Phoenix-master-matrix/HBASE_PROFILE=2.0/ws/phoenix-core/src/main/antlr3> added.
[INFO]
[INFO] --- antlr3-maven-plugin:3.5.2:antlr (default) @ phoenix-core ---
[INFO] ANTLR: Processing source directory <https://builds.apache.org/job/Phoenix-master-matrix/HBASE_PROFILE=2.0/ws/phoenix-core/src/main/antlr3>
ANTLR Parser Generator Version 3.5.2
Output file <https://builds.apache.org/job/Phoenix-master-matrix/HBASE_PROFILE=2.0/ws/phoenix-core/target/generated-sources/antlr3/org/apache/phoenix/parse/PhoenixSQLParser.java> does not exist: must build <https://builds.apache.org/job/Phoenix-master-matrix/HBASE_PROFILE=2.0/ws/phoenix-core/src/main/antlr3/PhoenixSQL.g>
PhoenixSQL.g
[INFO]
[INFO] --- maven-dependency-plugin:3.1.1:build-classpath (create-phoenix-generated-classpath) @ phoenix-core ---
[INFO] Wrote classpath file '<https://builds.apache.org/job/Phoenix-master-matrix/HBASE_PROFILE=2.0/ws/phoenix-core/target/cached_classpath.txt'.>
[INFO]
[INFO] --- maven-remote-resources-plugin:1.5:process (process-resource-bundles) @ phoenix-core ---
[INFO] artifact org.glassfish:javax.el: checking for updates from apache release
[INFO] artifact org.glassfish:javax.el: checking for updates from central
[INFO] artifact org.glassfish:javax.el: checking for updates from java.net.Releases
[INFO] artifact org.glassfish:javax.el: checking for updates from apache release
[INFO] artifact org.glassfish:javax.el: checking for updates from central
[INFO] artifact org.glassfish:javax.el: checking for updates from java.net.Releases
[INFO]
[INFO] --- maven-resources-plugin:3.1.0:resources (default-resources) @ phoenix-core ---
[INFO] Using 'UTF-8' encoding to copy filtered resources.
[INFO] Copying 3 resources
[INFO] Copying 3 resources
[INFO]
[INFO] --- maven-compiler-plugin:3.7.0:compile (default-compile) @ phoenix-core ---
[INFO] Changes detected - recompiling the module!
[INFO] Compiling 1169 source files to <https://builds.apache.org/job/Phoenix-master-matrix/HBASE_PROFILE=2.0/ws/phoenix-core/target/classes>
[WARNING] <https://builds.apache.org/job/Phoenix-master-matrix/HBASE_PROFILE=2.0/ws/phoenix-core/src/main/java/org/apache/phoenix/coprocessor/IndexRebuildRegionScanner.java>:[42,52] com.sun.org.apache.xpath.internal.operations.Bool is internal proprietary API and may be removed in a future release
[WARNING] <https://builds.apache.org/job/Phoenix-master-matrix/HBASE_PROFILE=2.0/ws/phoenix-core/src/main/java/org/apache/phoenix/execute/DescVarLengthFastByteComparisons.java>:[25,16] sun.misc.Unsafe is internal proprietary API and may be removed in a future release
[WARNING] <https://builds.apache.org/job/Phoenix-master-matrix/HBASE_PROFILE=2.0/ws/phoenix-core/src/main/java/org/apache/phoenix/execute/DescVarLengthFastByteComparisons.java>:[116,26] sun.misc.Unsafe is internal proprietary API and may be removed in a future release
[WARNING] <https://builds.apache.org/job/Phoenix-master-matrix/HBASE_PROFILE=2.0/ws/phoenix-core/src/main/java/org/apache/phoenix/execute/DescVarLengthFastByteComparisons.java>:[122,30] sun.misc.Unsafe is internal proprietary API and may be removed in a future release
[WARNING] <https://builds.apache.org/job/Phoenix-master-matrix/HBASE_PROFILE=2.0/ws/phoenix-core/src/main/java/org/apache/phoenix/execute/DescVarLengthFastByteComparisons.java>:[126,39] sun.misc.Unsafe is internal proprietary API and may be removed in a future release
[INFO] <https://builds.apache.org/job/Phoenix-master-matrix/HBASE_PROFILE=2.0/ws/phoenix-core/src/main/java/org/apache/phoenix/expression/BaseExpression.java>: Some input files use or override a deprecated API.
[INFO] <https://builds.apache.org/job/Phoenix-master-matrix/HBASE_PROFILE=2.0/ws/phoenix-core/src/main/java/org/apache/phoenix/expression/BaseExpression.java>: Recompile with -Xlint:deprecation for details.
[INFO] <https://builds.apache.org/job/Phoenix-master-matrix/HBASE_PROFILE=2.0/ws/phoenix-core/src/main/java/org/apache/phoenix/jdbc/PhoenixStatement.java>: Some input files use unchecked or unsafe operations.
[INFO] <https://builds.apache.org/job/Phoenix-master-matrix/HBASE_PROFILE=2.0/ws/phoenix-core/src/main/java/org/apache/phoenix/jdbc/PhoenixStatement.java>: Recompile with -Xlint:unchecked for details.
[INFO]
[INFO] --- maven-dependency-plugin:3.1.1:build-classpath (create-mrapp-generated-classpath) @ phoenix-core ---
[INFO] Wrote classpath file '<https://builds.apache.org/job/Phoenix-master-matrix/HBASE_PROFILE=2.0/ws/phoenix-core/target/classes/mrapp-generated-classpath'.>
[INFO]
[INFO] --- maven-resources-plugin:3.1.0:testResources (default-testResources) @ phoenix-core ---
[INFO] Using 'UTF-8' encoding to copy filtered resources.
[INFO] Copying 5 resources
[INFO] Copying 12 resources
[INFO] Copying 3 resources
[INFO]
[INFO] --- maven-compiler-plugin:3.7.0:testCompile (default-testCompile) @ phoenix-core ---
[INFO] Changes detected - recompiling the module!
[INFO] Compiling 613 source files to <https://builds.apache.org/job/Phoenix-master-matrix/HBASE_PROFILE=2.0/ws/phoenix-core/target/test-classes>
[INFO] <https://builds.apache.org/job/Phoenix-master-matrix/HBASE_PROFILE=2.0/ws/phoenix-core/src/test/java/org/apache/phoenix/query/BaseTest.java>: Some input files use or override a deprecated API.
[INFO] <https://builds.apache.org/job/Phoenix-master-matrix/HBASE_PROFILE=2.0/ws/phoenix-core/src/test/java/org/apache/phoenix/query/BaseTest.java>: Recompile with -Xlint:deprecation for details.
[INFO] <https://builds.apache.org/job/Phoenix-master-matrix/HBASE_PROFILE=2.0/ws/phoenix-core/src/test/java/org/apache/phoenix/query/BaseTest.java>: Some input files use unchecked or unsafe operations.
[INFO] <https://builds.apache.org/job/Phoenix-master-matrix/HBASE_PROFILE=2.0/ws/phoenix-core/src/test/java/org/apache/phoenix/query/BaseTest.java>: Recompile with -Xlint:unchecked for details.
[INFO] -------------------------------------------------------------
[ERROR] COMPILATION ERROR :
[INFO] -------------------------------------------------------------
[ERROR] <https://builds.apache.org/job/Phoenix-master-matrix/HBASE_PROFILE=2.0/ws/phoenix-core/src/it/java/org/apache/phoenix/end2end/BasePermissionsIT.java>:[39,47] cannot find symbol
symbol: class GetUserPermissionsRequest
location: package org.apache.hadoop.hbase.security.access
[ERROR] <https://builds.apache.org/job/Phoenix-master-matrix/HBASE_PROFILE=2.0/ws/phoenix-core/src/it/java/org/apache/phoenix/end2end/BasePermissionsIT.java>:[1452,48] cannot find symbol
symbol: method hasUserName()
location: variable request of type org.apache.hadoop.hbase.protobuf.generated.AccessControlProtos.GetUserPermissionsRequest
[ERROR] <https://builds.apache.org/job/Phoenix-master-matrix/HBASE_PROFILE=2.0/ws/phoenix-core/src/it/java/org/apache/phoenix/end2end/BasePermissionsIT.java>:[1452,72] cannot find symbol
symbol: method getUserName()
location: variable request of type org.apache.hadoop.hbase.protobuf.generated.AccessControlProtos.GetUserPermissionsRequest
[ERROR] <https://builds.apache.org/job/Phoenix-master-matrix/HBASE_PROFILE=2.0/ws/phoenix-core/src/it/java/org/apache/phoenix/end2end/BasePermissionsIT.java>:[1458,32] cannot find symbol
symbol: method hasColumnFamily()
location: variable request of type org.apache.hadoop.hbase.protobuf.generated.AccessControlProtos.GetUserPermissionsRequest
[ERROR] <https://builds.apache.org/job/Phoenix-master-matrix/HBASE_PROFILE=2.0/ws/phoenix-core/src/it/java/org/apache/phoenix/end2end/BasePermissionsIT.java>:[1458,60] cannot find symbol
symbol: method getColumnFamily()
location: variable request of type org.apache.hadoop.hbase.protobuf.generated.AccessControlProtos.GetUserPermissionsRequest
[ERROR] <https://builds.apache.org/job/Phoenix-master-matrix/HBASE_PROFILE=2.0/ws/phoenix-core/src/it/java/org/apache/phoenix/end2end/BasePermissionsIT.java>:[1460,32] cannot find symbol
symbol: method hasColumnQualifier()
location: variable request of type org.apache.hadoop.hbase.protobuf.generated.AccessControlProtos.GetUserPermissionsRequest
[ERROR] <https://builds.apache.org/job/Phoenix-master-matrix/HBASE_PROFILE=2.0/ws/phoenix-core/src/it/java/org/apache/phoenix/end2end/BasePermissionsIT.java>:[1460,63] cannot find symbol
symbol: method getColumnQualifier()
location: variable request of type org.apache.hadoop.hbase.protobuf.generated.AccessControlProtos.GetUserPermissionsRequest
[ERROR] <https://builds.apache.org/job/Phoenix-master-matrix/HBASE_PROFILE=2.0/ws/phoenix-core/src/it/java/org/apache/phoenix/end2end/BasePermissionsIT.java>:[1461,17] cannot find symbol
symbol: class GetUserPermissionsRequest
location: class org.apache.phoenix.end2end.BasePermissionsIT.CustomAccessController
[ERROR] <https://builds.apache.org/job/Phoenix-master-matrix/HBASE_PROFILE=2.0/ws/phoenix-core/src/it/java/org/apache/phoenix/end2end/BasePermissionsIT.java>:[1463,49] cannot find symbol
symbol: variable GetUserPermissionsRequest
location: class org.apache.phoenix.end2end.BasePermissionsIT.CustomAccessController
[ERROR] <https://builds.apache.org/job/Phoenix-master-matrix/HBASE_PROFILE=2.0/ws/phoenix-core/src/it/java/org/apache/phoenix/end2end/BasePermissionsIT.java>:[1467,29] cannot find symbol
symbol: variable GetUserPermissionsRequest
location: class org.apache.phoenix.end2end.BasePermissionsIT.CustomAccessController
[ERROR] <https://builds.apache.org/job/Phoenix-master-matrix/HBASE_PROFILE=2.0/ws/phoenix-core/src/it/java/org/apache/phoenix/end2end/BasePermissionsIT.java>:[1470,29] cannot find symbol
symbol: variable GetUserPermissionsRequest
location: class org.apache.phoenix.end2end.BasePermissionsIT.CustomAccessController
[INFO] 11 errors
[INFO] -------------------------------------------------------------
[INFO] ------------------------------------------------------------------------
[INFO] Reactor Summary for Apache Phoenix 5.1.0-SNAPSHOT:
[INFO]
[INFO] Phoenix Hbase 2.2.1 compatibility .................. SUCCESS [ 15.655 s]
[INFO] Phoenix Hbase 2.1.6 compatibility .................. SUCCESS [ 3.119 s]
[INFO] Phoenix Hbase 2.0.1 compatibility .................. SUCCESS [ 3.260 s]
[INFO] Apache Phoenix ..................................... SUCCESS [ 2.897 s]
[INFO] Phoenix Core ....................................... FAILURE [ 53.953 s]
[INFO] Phoenix - Pherf .................................... SKIPPED
[INFO] Phoenix Client ..................................... SKIPPED
[INFO] Phoenix Server ..................................... SKIPPED
[INFO] Phoenix - Tracing Web Application .................. SKIPPED
[INFO] Phoenix Assembly ................................... SKIPPED
[INFO] ------------------------------------------------------------------------
[INFO] BUILD FAILURE
[INFO] ------------------------------------------------------------------------
[INFO] Total time: 01:20 min
[INFO] Finished at: 2020-06-10T21:10:41Z
[INFO] ------------------------------------------------------------------------
[ERROR] Failed to execute goal org.apache.maven.plugins:maven-compiler-plugin:3.7.0:testCompile (default-testCompile) on project phoenix-core: Compilation failure: Compilation failure:
[ERROR] <https://builds.apache.org/job/Phoenix-master-matrix/HBASE_PROFILE=2.0/ws/phoenix-core/src/it/java/org/apache/phoenix/end2end/BasePermissionsIT.java>:[39,47] cannot find symbol
[ERROR] symbol: class GetUserPermissionsRequest
[ERROR] location: package org.apache.hadoop.hbase.security.access
[ERROR] <https://builds.apache.org/job/Phoenix-master-matrix/HBASE_PROFILE=2.0/ws/phoenix-core/src/it/java/org/apache/phoenix/end2end/BasePermissionsIT.java>:[1452,48] cannot find symbol
[ERROR] symbol: method hasUserName()
[ERROR] location: variable request of type org.apache.hadoop.hbase.protobuf.generated.AccessControlProtos.GetUserPermissionsRequest
[ERROR] <https://builds.apache.org/job/Phoenix-master-matrix/HBASE_PROFILE=2.0/ws/phoenix-core/src/it/java/org/apache/phoenix/end2end/BasePermissionsIT.java>:[1452,72] cannot find symbol
[ERROR] symbol: method getUserName()
[ERROR] location: variable request of type org.apache.hadoop.hbase.protobuf.generated.AccessControlProtos.GetUserPermissionsRequest
[ERROR] <https://builds.apache.org/job/Phoenix-master-matrix/HBASE_PROFILE=2.0/ws/phoenix-core/src/it/java/org/apache/phoenix/end2end/BasePermissionsIT.java>:[1458,32] cannot find symbol
[ERROR] symbol: method hasColumnFamily()
[ERROR] location: variable request of type org.apache.hadoop.hbase.protobuf.generated.AccessControlProtos.GetUserPermissionsRequest
[ERROR] <https://builds.apache.org/job/Phoenix-master-matrix/HBASE_PROFILE=2.0/ws/phoenix-core/src/it/java/org/apache/phoenix/end2end/BasePermissionsIT.java>:[1458,60] cannot find symbol
[ERROR] symbol: method getColumnFamily()
[ERROR] location: variable request of type org.apache.hadoop.hbase.protobuf.generated.AccessControlProtos.GetUserPermissionsRequest
[ERROR] <https://builds.apache.org/job/Phoenix-master-matrix/HBASE_PROFILE=2.0/ws/phoenix-core/src/it/java/org/apache/phoenix/end2end/BasePermissionsIT.java>:[1460,32] cannot find symbol
[ERROR] symbol: method hasColumnQualifier()
[ERROR] location: variable request of type org.apache.hadoop.hbase.protobuf.generated.AccessControlProtos.GetUserPermissionsRequest
[ERROR] <https://builds.apache.org/job/Phoenix-master-matrix/HBASE_PROFILE=2.0/ws/phoenix-core/src/it/java/org/apache/phoenix/end2end/BasePermissionsIT.java>:[1460,63] cannot find symbol
[ERROR] symbol: method getColumnQualifier()
[ERROR] location: variable request of type org.apache.hadoop.hbase.protobuf.generated.AccessControlProtos.GetUserPermissionsRequest
[ERROR] <https://builds.apache.org/job/Phoenix-master-matrix/HBASE_PROFILE=2.0/ws/phoenix-core/src/it/java/org/apache/phoenix/end2end/BasePermissionsIT.java>:[1461,17] cannot find symbol
[ERROR] symbol: class GetUserPermissionsRequest
[ERROR] location: class org.apache.phoenix.end2end.BasePermissionsIT.CustomAccessController
[ERROR] <https://builds.apache.org/job/Phoenix-master-matrix/HBASE_PROFILE=2.0/ws/phoenix-core/src/it/java/org/apache/phoenix/end2end/BasePermissionsIT.java>:[1463,49] cannot find symbol
[ERROR] symbol: variable GetUserPermissionsRequest
[ERROR] location: class org.apache.phoenix.end2end.BasePermissionsIT.CustomAccessController
[ERROR] <https://builds.apache.org/job/Phoenix-master-matrix/HBASE_PROFILE=2.0/ws/phoenix-core/src/it/java/org/apache/phoenix/end2end/BasePermissionsIT.java>:[1467,29] cannot find symbol
[ERROR] symbol: variable GetUserPermissionsRequest
[ERROR] location: class org.apache.phoenix.end2end.BasePermissionsIT.CustomAccessController
[ERROR] <https://builds.apache.org/job/Phoenix-master-matrix/HBASE_PROFILE=2.0/ws/phoenix-core/src/it/java/org/apache/phoenix/end2end/BasePermissionsIT.java>:[1470,29] cannot find symbol
[ERROR] symbol: variable GetUserPermissionsRequest
[ERROR] location: class org.apache.phoenix.end2end.BasePermissionsIT.CustomAccessController
[ERROR] -> [Help 1]
[ERROR]
[ERROR] To see the full stack trace of the errors, re-run Maven with the -e switch.
[ERROR] Re-run Maven using the -X switch to enable full debug logging.
[ERROR]
[ERROR] For more information about the errors and possible solutions, please read the following articles:
[ERROR] [Help 1] http://cwiki.apache.org/confluence/display/MAVEN/MojoFailureException
[ERROR]
[ERROR] After correcting the problems, you can resume the build with the command
[ERROR] mvn <args> -rf :phoenix-core
Build step 'Invoke top-level Maven targets' marked build as failure
Archiving artifacts
Recording test results
ERROR: Step ?Publish JUnit test result report? failed: No test report files were found. Configuration error?
Not sending mail to unregistered user giskender@salesforce.com
Not sending mail to unregistered user Rajeshbabu Chintaguntla
Not sending mail to unregistered user noreply@github.com
Not sending mail to unregistered user abhishek.chouhan@salesforce.com
Not sending mail to unregistered user s.kadam@salesforce.com
Build failed in Jenkins: Phoenix | Master | HBase Profile » 2.0 #91
Posted by Apache Jenkins Server <je...@builds.apache.org>.
See <https://builds.apache.org/job/Phoenix-master-matrix/HBASE_PROFILE=2.0/91/display/redirect?page=changes>
Changes:
[stoty] PHOENIX-5903 Mark more hbase dependency's scope as provided for
------------------------------------------
[...truncated 25.82 KB...]
[INFO]
[INFO] --- maven-compiler-plugin:3.7.0:compile (default-compile) @ phoenix-hbase-compat-2.0.1 ---
[INFO] Changes detected - recompiling the module!
[INFO] Compiling 5 source files to <https://builds.apache.org/job/Phoenix-master-matrix/HBASE_PROFILE=2.0/ws/phoenix-hbase-compat-2.0.1/target/classes>
[INFO] <https://builds.apache.org/job/Phoenix-master-matrix/HBASE_PROFILE=2.0/ws/phoenix-hbase-compat-2.0.1/src/main/java/org/apache/phoenix/compat/hbase/OffsetCell.java>: Some input files use or override a deprecated API.
[INFO] <https://builds.apache.org/job/Phoenix-master-matrix/HBASE_PROFILE=2.0/ws/phoenix-hbase-compat-2.0.1/src/main/java/org/apache/phoenix/compat/hbase/OffsetCell.java>: Recompile with -Xlint:deprecation for details.
[INFO]
[INFO] --- maven-resources-plugin:3.1.0:testResources (default-testResources) @ phoenix-hbase-compat-2.0.1 ---
[INFO] Using 'UTF-8' encoding to copy filtered resources.
[INFO] skip non existing resourceDirectory <https://builds.apache.org/job/Phoenix-master-matrix/HBASE_PROFILE=2.0/ws/phoenix-hbase-compat-2.0.1/src/test/resources>
[INFO] Copying 3 resources
[INFO]
[INFO] --- maven-compiler-plugin:3.7.0:testCompile (default-testCompile) @ phoenix-hbase-compat-2.0.1 ---
[INFO] No sources to compile
[INFO]
[INFO] --- maven-surefire-plugin:2.22.0:test (default-test) @ phoenix-hbase-compat-2.0.1 ---
[INFO]
[INFO] --- maven-jar-plugin:3.1.0:jar (default-jar) @ phoenix-hbase-compat-2.0.1 ---
[INFO] Building jar: <https://builds.apache.org/job/Phoenix-master-matrix/HBASE_PROFILE=2.0/ws/phoenix-hbase-compat-2.0.1/target/phoenix-hbase-compat-2.0.1-5.1.0-SNAPSHOT.jar>
[INFO]
[INFO] --- maven-site-plugin:3.7.1:attach-descriptor (attach-descriptor) @ phoenix-hbase-compat-2.0.1 ---
[INFO] Skipping because packaging 'jar' is not pom.
[INFO]
[INFO] --- maven-install-plugin:2.5.2:install (default-install) @ phoenix-hbase-compat-2.0.1 ---
[INFO] Installing <https://builds.apache.org/job/Phoenix-master-matrix/HBASE_PROFILE=2.0/ws/phoenix-hbase-compat-2.0.1/target/phoenix-hbase-compat-2.0.1-5.1.0-SNAPSHOT.jar> to /home/jenkins/.m2/repository/org/apache/phoenix/phoenix-hbase-compat-2.0.1/5.1.0-SNAPSHOT/phoenix-hbase-compat-2.0.1-5.1.0-SNAPSHOT.jar
[INFO] Installing <https://builds.apache.org/job/Phoenix-master-matrix/HBASE_PROFILE=2.0/ws/phoenix-hbase-compat-2.0.1/pom.xml> to /home/jenkins/.m2/repository/org/apache/phoenix/phoenix-hbase-compat-2.0.1/5.1.0-SNAPSHOT/phoenix-hbase-compat-2.0.1-5.1.0-SNAPSHOT.pom
[INFO]
[INFO] ---------------------< org.apache.phoenix:phoenix >---------------------
[INFO] Building Apache Phoenix 5.1.0-SNAPSHOT [4/10]
[INFO] --------------------------------[ pom ]---------------------------------
[INFO]
[INFO] --- maven-clean-plugin:3.1.0:clean (default-clean) @ phoenix ---
[INFO]
[INFO] --- maven-enforcer-plugin:3.0.0-M3:enforce (enforce-maven-version) @ phoenix ---
[INFO]
[INFO] --- maven-enforcer-plugin:3.0.0-M3:enforce (check-hbase-compatibility) @ phoenix ---
[INFO]
[INFO] --- maven-checkstyle-plugin:3.1.0:check (validate) @ phoenix ---
[INFO]
[INFO] --- jacoco-maven-plugin:0.7.9:prepare-agent (prepare-agent) @ phoenix ---
[INFO] jacocoArgLine set to -javaagent:/home/jenkins/.m2/repository/org/jacoco/org.jacoco.agent/0.7.9/org.jacoco.agent-0.7.9-runtime.jar=destfile=<https://builds.apache.org/job/Phoenix-master-matrix/HBASE_PROFILE=2.0/ws/target/jacoco.exec>
[INFO]
[INFO] --- maven-remote-resources-plugin:1.5:process (process-resource-bundles) @ phoenix ---
[INFO]
[INFO] --- maven-source-plugin:3.0.1:jar-no-fork (attach-sources) @ phoenix ---
[INFO]
[INFO] --- maven-jar-plugin:3.1.0:test-jar (default) @ phoenix ---
[WARNING] JAR will be empty - no content was marked for inclusion!
[INFO] Building jar: <https://builds.apache.org/job/Phoenix-master-matrix/HBASE_PROFILE=2.0/ws/target/phoenix-5.1.0-SNAPSHOT-tests.jar>
[INFO]
[INFO] --- maven-site-plugin:3.7.1:attach-descriptor (attach-descriptor) @ phoenix ---
[INFO] No site descriptor found: nothing to attach.
[INFO]
[INFO] --- jacoco-maven-plugin:0.7.9:report (report) @ phoenix ---
[INFO] Skipping JaCoCo execution due to missing execution data file.
[INFO]
[INFO] --- jacoco-maven-plugin:0.7.9:check (check) @ phoenix ---
[INFO] Skipping JaCoCo execution due to missing execution data <https://builds.apache.org/job/Phoenix-master-matrix/HBASE_PROFILE=2.0/ws/target/jacoco.exec>
[INFO]
[INFO] --- maven-install-plugin:2.5.2:install (default-install) @ phoenix ---
[INFO] Installing <https://builds.apache.org/job/Phoenix-master-matrix/HBASE_PROFILE=2.0/ws/pom.xml> to /home/jenkins/.m2/repository/org/apache/phoenix/phoenix/5.1.0-SNAPSHOT/phoenix-5.1.0-SNAPSHOT.pom
[INFO] Installing <https://builds.apache.org/job/Phoenix-master-matrix/HBASE_PROFILE=2.0/ws/target/phoenix-5.1.0-SNAPSHOT-tests.jar> to /home/jenkins/.m2/repository/org/apache/phoenix/phoenix/5.1.0-SNAPSHOT/phoenix-5.1.0-SNAPSHOT-tests.jar
[INFO]
[INFO] ------------------< org.apache.phoenix:phoenix-core >-------------------
[INFO] Building Phoenix Core 5.1.0-SNAPSHOT [5/10]
[INFO] --------------------------------[ jar ]---------------------------------
Downloading from apache release: https://repository.apache.org/content/repositories/releases/org/glassfish/javax.el/maven-metadata.xml
[INFO]
[INFO] --- maven-clean-plugin:3.1.0:clean (default-clean) @ phoenix-core ---
[INFO]
[INFO] --- maven-enforcer-plugin:3.0.0-M3:enforce (enforce-maven-version) @ phoenix-core ---
[INFO]
[INFO] --- maven-enforcer-plugin:3.0.0-M3:enforce (check-hbase-compatibility) @ phoenix-core ---
[INFO]
[INFO] --- maven-checkstyle-plugin:3.1.0:check (validate) @ phoenix-core ---
[INFO]
[INFO] --- build-helper-maven-plugin:1.9.1:add-test-source (add-test-source) @ phoenix-core ---
[INFO] Test Source directory: <https://builds.apache.org/job/Phoenix-master-matrix/HBASE_PROFILE=2.0/ws/phoenix-core/src/it/java> added.
[INFO]
[INFO] --- build-helper-maven-plugin:1.9.1:add-test-resource (add-test-resource) @ phoenix-core ---
[INFO]
[INFO] --- jacoco-maven-plugin:0.7.9:prepare-agent (prepare-agent) @ phoenix-core ---
[INFO] jacocoArgLine set to -javaagent:/home/jenkins/.m2/repository/org/jacoco/org.jacoco.agent/0.7.9/org.jacoco.agent-0.7.9-runtime.jar=destfile=<https://builds.apache.org/job/Phoenix-master-matrix/HBASE_PROFILE=2.0/ws/phoenix-core/target/jacoco.exec>
[INFO]
[INFO] --- build-helper-maven-plugin:1.9.1:add-source (add-source) @ phoenix-core ---
[INFO] Source directory: <https://builds.apache.org/job/Phoenix-master-matrix/HBASE_PROFILE=2.0/ws/phoenix-core/target/generated-sources/antlr3> added.
[INFO] Source directory: <https://builds.apache.org/job/Phoenix-master-matrix/HBASE_PROFILE=2.0/ws/phoenix-core/src/main/antlr3> added.
[INFO]
[INFO] --- antlr3-maven-plugin:3.5.2:antlr (default) @ phoenix-core ---
[INFO] ANTLR: Processing source directory <https://builds.apache.org/job/Phoenix-master-matrix/HBASE_PROFILE=2.0/ws/phoenix-core/src/main/antlr3>
ANTLR Parser Generator Version 3.5.2
Output file <https://builds.apache.org/job/Phoenix-master-matrix/HBASE_PROFILE=2.0/ws/phoenix-core/target/generated-sources/antlr3/org/apache/phoenix/parse/PhoenixSQLParser.java> does not exist: must build <https://builds.apache.org/job/Phoenix-master-matrix/HBASE_PROFILE=2.0/ws/phoenix-core/src/main/antlr3/PhoenixSQL.g>
PhoenixSQL.g
[INFO]
[INFO] --- maven-dependency-plugin:3.1.1:build-classpath (create-phoenix-generated-classpath) @ phoenix-core ---
[INFO] Wrote classpath file '<https://builds.apache.org/job/Phoenix-master-matrix/HBASE_PROFILE=2.0/ws/phoenix-core/target/cached_classpath.txt'.>
[INFO]
[INFO] --- maven-remote-resources-plugin:1.5:process (process-resource-bundles) @ phoenix-core ---
[INFO] artifact org.glassfish:javax.el: checking for updates from apache release
[INFO] artifact org.glassfish:javax.el: checking for updates from central
[INFO] artifact org.glassfish:javax.el: checking for updates from java.net.Releases
[INFO] artifact org.glassfish:javax.el: checking for updates from apache release
[INFO] artifact org.glassfish:javax.el: checking for updates from central
[INFO] artifact org.glassfish:javax.el: checking for updates from java.net.Releases
[INFO]
[INFO] --- maven-resources-plugin:3.1.0:resources (default-resources) @ phoenix-core ---
[INFO] Using 'UTF-8' encoding to copy filtered resources.
[INFO] Copying 3 resources
[INFO] Copying 3 resources
[INFO]
[INFO] --- maven-compiler-plugin:3.7.0:compile (default-compile) @ phoenix-core ---
[INFO] Changes detected - recompiling the module!
[INFO] Compiling 1169 source files to <https://builds.apache.org/job/Phoenix-master-matrix/HBASE_PROFILE=2.0/ws/phoenix-core/target/classes>
[WARNING] <https://builds.apache.org/job/Phoenix-master-matrix/HBASE_PROFILE=2.0/ws/phoenix-core/src/main/java/org/apache/phoenix/coprocessor/IndexRebuildRegionScanner.java>:[42,52] com.sun.org.apache.xpath.internal.operations.Bool is internal proprietary API and may be removed in a future release
[WARNING] <https://builds.apache.org/job/Phoenix-master-matrix/HBASE_PROFILE=2.0/ws/phoenix-core/src/main/java/org/apache/phoenix/execute/DescVarLengthFastByteComparisons.java>:[25,16] sun.misc.Unsafe is internal proprietary API and may be removed in a future release
[WARNING] <https://builds.apache.org/job/Phoenix-master-matrix/HBASE_PROFILE=2.0/ws/phoenix-core/src/main/java/org/apache/phoenix/execute/DescVarLengthFastByteComparisons.java>:[116,26] sun.misc.Unsafe is internal proprietary API and may be removed in a future release
[WARNING] <https://builds.apache.org/job/Phoenix-master-matrix/HBASE_PROFILE=2.0/ws/phoenix-core/src/main/java/org/apache/phoenix/execute/DescVarLengthFastByteComparisons.java>:[122,30] sun.misc.Unsafe is internal proprietary API and may be removed in a future release
[WARNING] <https://builds.apache.org/job/Phoenix-master-matrix/HBASE_PROFILE=2.0/ws/phoenix-core/src/main/java/org/apache/phoenix/execute/DescVarLengthFastByteComparisons.java>:[126,39] sun.misc.Unsafe is internal proprietary API and may be removed in a future release
[INFO] <https://builds.apache.org/job/Phoenix-master-matrix/HBASE_PROFILE=2.0/ws/phoenix-core/src/main/java/org/apache/phoenix/expression/BaseExpression.java>: Some input files use or override a deprecated API.
[INFO] <https://builds.apache.org/job/Phoenix-master-matrix/HBASE_PROFILE=2.0/ws/phoenix-core/src/main/java/org/apache/phoenix/expression/BaseExpression.java>: Recompile with -Xlint:deprecation for details.
[INFO] <https://builds.apache.org/job/Phoenix-master-matrix/HBASE_PROFILE=2.0/ws/phoenix-core/src/main/java/org/apache/phoenix/jdbc/PhoenixStatement.java>: Some input files use unchecked or unsafe operations.
[INFO] <https://builds.apache.org/job/Phoenix-master-matrix/HBASE_PROFILE=2.0/ws/phoenix-core/src/main/java/org/apache/phoenix/jdbc/PhoenixStatement.java>: Recompile with -Xlint:unchecked for details.
[INFO]
[INFO] --- maven-dependency-plugin:3.1.1:build-classpath (create-mrapp-generated-classpath) @ phoenix-core ---
[INFO] Wrote classpath file '<https://builds.apache.org/job/Phoenix-master-matrix/HBASE_PROFILE=2.0/ws/phoenix-core/target/classes/mrapp-generated-classpath'.>
[INFO]
[INFO] --- maven-resources-plugin:3.1.0:testResources (default-testResources) @ phoenix-core ---
[INFO] Using 'UTF-8' encoding to copy filtered resources.
[INFO] Copying 5 resources
[INFO] Copying 12 resources
[INFO] Copying 3 resources
[INFO]
[INFO] --- maven-compiler-plugin:3.7.0:testCompile (default-testCompile) @ phoenix-core ---
[INFO] Changes detected - recompiling the module!
[INFO] Compiling 613 source files to <https://builds.apache.org/job/Phoenix-master-matrix/HBASE_PROFILE=2.0/ws/phoenix-core/target/test-classes>
[INFO] <https://builds.apache.org/job/Phoenix-master-matrix/HBASE_PROFILE=2.0/ws/phoenix-core/src/test/java/org/apache/phoenix/query/BaseTest.java>: Some input files use or override a deprecated API.
[INFO] <https://builds.apache.org/job/Phoenix-master-matrix/HBASE_PROFILE=2.0/ws/phoenix-core/src/test/java/org/apache/phoenix/query/BaseTest.java>: Recompile with -Xlint:deprecation for details.
[INFO] <https://builds.apache.org/job/Phoenix-master-matrix/HBASE_PROFILE=2.0/ws/phoenix-core/src/test/java/org/apache/phoenix/query/BaseTest.java>: Some input files use unchecked or unsafe operations.
[INFO] <https://builds.apache.org/job/Phoenix-master-matrix/HBASE_PROFILE=2.0/ws/phoenix-core/src/test/java/org/apache/phoenix/query/BaseTest.java>: Recompile with -Xlint:unchecked for details.
[INFO] -------------------------------------------------------------
[ERROR] COMPILATION ERROR :
[INFO] -------------------------------------------------------------
[ERROR] <https://builds.apache.org/job/Phoenix-master-matrix/HBASE_PROFILE=2.0/ws/phoenix-core/src/it/java/org/apache/phoenix/end2end/BasePermissionsIT.java>:[39,47] cannot find symbol
symbol: class GetUserPermissionsRequest
location: package org.apache.hadoop.hbase.security.access
[ERROR] <https://builds.apache.org/job/Phoenix-master-matrix/HBASE_PROFILE=2.0/ws/phoenix-core/src/it/java/org/apache/phoenix/end2end/BasePermissionsIT.java>:[1452,48] cannot find symbol
symbol: method hasUserName()
location: variable request of type org.apache.hadoop.hbase.protobuf.generated.AccessControlProtos.GetUserPermissionsRequest
[ERROR] <https://builds.apache.org/job/Phoenix-master-matrix/HBASE_PROFILE=2.0/ws/phoenix-core/src/it/java/org/apache/phoenix/end2end/BasePermissionsIT.java>:[1452,72] cannot find symbol
symbol: method getUserName()
location: variable request of type org.apache.hadoop.hbase.protobuf.generated.AccessControlProtos.GetUserPermissionsRequest
[ERROR] <https://builds.apache.org/job/Phoenix-master-matrix/HBASE_PROFILE=2.0/ws/phoenix-core/src/it/java/org/apache/phoenix/end2end/BasePermissionsIT.java>:[1458,32] cannot find symbol
symbol: method hasColumnFamily()
location: variable request of type org.apache.hadoop.hbase.protobuf.generated.AccessControlProtos.GetUserPermissionsRequest
[ERROR] <https://builds.apache.org/job/Phoenix-master-matrix/HBASE_PROFILE=2.0/ws/phoenix-core/src/it/java/org/apache/phoenix/end2end/BasePermissionsIT.java>:[1458,60] cannot find symbol
symbol: method getColumnFamily()
location: variable request of type org.apache.hadoop.hbase.protobuf.generated.AccessControlProtos.GetUserPermissionsRequest
[ERROR] <https://builds.apache.org/job/Phoenix-master-matrix/HBASE_PROFILE=2.0/ws/phoenix-core/src/it/java/org/apache/phoenix/end2end/BasePermissionsIT.java>:[1460,32] cannot find symbol
symbol: method hasColumnQualifier()
location: variable request of type org.apache.hadoop.hbase.protobuf.generated.AccessControlProtos.GetUserPermissionsRequest
[ERROR] <https://builds.apache.org/job/Phoenix-master-matrix/HBASE_PROFILE=2.0/ws/phoenix-core/src/it/java/org/apache/phoenix/end2end/BasePermissionsIT.java>:[1460,63] cannot find symbol
symbol: method getColumnQualifier()
location: variable request of type org.apache.hadoop.hbase.protobuf.generated.AccessControlProtos.GetUserPermissionsRequest
[ERROR] <https://builds.apache.org/job/Phoenix-master-matrix/HBASE_PROFILE=2.0/ws/phoenix-core/src/it/java/org/apache/phoenix/end2end/BasePermissionsIT.java>:[1461,17] cannot find symbol
symbol: class GetUserPermissionsRequest
location: class org.apache.phoenix.end2end.BasePermissionsIT.CustomAccessController
[ERROR] <https://builds.apache.org/job/Phoenix-master-matrix/HBASE_PROFILE=2.0/ws/phoenix-core/src/it/java/org/apache/phoenix/end2end/BasePermissionsIT.java>:[1463,49] cannot find symbol
symbol: variable GetUserPermissionsRequest
location: class org.apache.phoenix.end2end.BasePermissionsIT.CustomAccessController
[ERROR] <https://builds.apache.org/job/Phoenix-master-matrix/HBASE_PROFILE=2.0/ws/phoenix-core/src/it/java/org/apache/phoenix/end2end/BasePermissionsIT.java>:[1467,29] cannot find symbol
symbol: variable GetUserPermissionsRequest
location: class org.apache.phoenix.end2end.BasePermissionsIT.CustomAccessController
[ERROR] <https://builds.apache.org/job/Phoenix-master-matrix/HBASE_PROFILE=2.0/ws/phoenix-core/src/it/java/org/apache/phoenix/end2end/BasePermissionsIT.java>:[1470,29] cannot find symbol
symbol: variable GetUserPermissionsRequest
location: class org.apache.phoenix.end2end.BasePermissionsIT.CustomAccessController
[INFO] 11 errors
[INFO] -------------------------------------------------------------
[INFO] ------------------------------------------------------------------------
[INFO] Reactor Summary for Apache Phoenix 5.1.0-SNAPSHOT:
[INFO]
[INFO] Phoenix Hbase 2.2.1 compatibility .................. SUCCESS [ 19.555 s]
[INFO] Phoenix Hbase 2.1.6 compatibility .................. SUCCESS [ 3.957 s]
[INFO] Phoenix Hbase 2.0.1 compatibility .................. SUCCESS [ 4.376 s]
[INFO] Apache Phoenix ..................................... SUCCESS [ 3.131 s]
[INFO] Phoenix Core ....................................... FAILURE [ 56.682 s]
[INFO] Phoenix - Pherf .................................... SKIPPED
[INFO] Phoenix Client ..................................... SKIPPED
[INFO] Phoenix Server ..................................... SKIPPED
[INFO] Phoenix - Tracing Web Application .................. SKIPPED
[INFO] Phoenix Assembly ................................... SKIPPED
[INFO] ------------------------------------------------------------------------
[INFO] BUILD FAILURE
[INFO] ------------------------------------------------------------------------
[INFO] Total time: 01:29 min
[INFO] Finished at: 2020-06-10T15:12:23Z
[INFO] ------------------------------------------------------------------------
[ERROR] Failed to execute goal org.apache.maven.plugins:maven-compiler-plugin:3.7.0:testCompile (default-testCompile) on project phoenix-core: Compilation failure: Compilation failure:
[ERROR] <https://builds.apache.org/job/Phoenix-master-matrix/HBASE_PROFILE=2.0/ws/phoenix-core/src/it/java/org/apache/phoenix/end2end/BasePermissionsIT.java>:[39,47] cannot find symbol
[ERROR] symbol: class GetUserPermissionsRequest
[ERROR] location: package org.apache.hadoop.hbase.security.access
[ERROR] <https://builds.apache.org/job/Phoenix-master-matrix/HBASE_PROFILE=2.0/ws/phoenix-core/src/it/java/org/apache/phoenix/end2end/BasePermissionsIT.java>:[1452,48] cannot find symbol
[ERROR] symbol: method hasUserName()
[ERROR] location: variable request of type org.apache.hadoop.hbase.protobuf.generated.AccessControlProtos.GetUserPermissionsRequest
[ERROR] <https://builds.apache.org/job/Phoenix-master-matrix/HBASE_PROFILE=2.0/ws/phoenix-core/src/it/java/org/apache/phoenix/end2end/BasePermissionsIT.java>:[1452,72] cannot find symbol
[ERROR] symbol: method getUserName()
[ERROR] location: variable request of type org.apache.hadoop.hbase.protobuf.generated.AccessControlProtos.GetUserPermissionsRequest
[ERROR] <https://builds.apache.org/job/Phoenix-master-matrix/HBASE_PROFILE=2.0/ws/phoenix-core/src/it/java/org/apache/phoenix/end2end/BasePermissionsIT.java>:[1458,32] cannot find symbol
[ERROR] symbol: method hasColumnFamily()
[ERROR] location: variable request of type org.apache.hadoop.hbase.protobuf.generated.AccessControlProtos.GetUserPermissionsRequest
[ERROR] <https://builds.apache.org/job/Phoenix-master-matrix/HBASE_PROFILE=2.0/ws/phoenix-core/src/it/java/org/apache/phoenix/end2end/BasePermissionsIT.java>:[1458,60] cannot find symbol
[ERROR] symbol: method getColumnFamily()
[ERROR] location: variable request of type org.apache.hadoop.hbase.protobuf.generated.AccessControlProtos.GetUserPermissionsRequest
[ERROR] <https://builds.apache.org/job/Phoenix-master-matrix/HBASE_PROFILE=2.0/ws/phoenix-core/src/it/java/org/apache/phoenix/end2end/BasePermissionsIT.java>:[1460,32] cannot find symbol
[ERROR] symbol: method hasColumnQualifier()
[ERROR] location: variable request of type org.apache.hadoop.hbase.protobuf.generated.AccessControlProtos.GetUserPermissionsRequest
[ERROR] <https://builds.apache.org/job/Phoenix-master-matrix/HBASE_PROFILE=2.0/ws/phoenix-core/src/it/java/org/apache/phoenix/end2end/BasePermissionsIT.java>:[1460,63] cannot find symbol
[ERROR] symbol: method getColumnQualifier()
[ERROR] location: variable request of type org.apache.hadoop.hbase.protobuf.generated.AccessControlProtos.GetUserPermissionsRequest
[ERROR] <https://builds.apache.org/job/Phoenix-master-matrix/HBASE_PROFILE=2.0/ws/phoenix-core/src/it/java/org/apache/phoenix/end2end/BasePermissionsIT.java>:[1461,17] cannot find symbol
[ERROR] symbol: class GetUserPermissionsRequest
[ERROR] location: class org.apache.phoenix.end2end.BasePermissionsIT.CustomAccessController
[ERROR] <https://builds.apache.org/job/Phoenix-master-matrix/HBASE_PROFILE=2.0/ws/phoenix-core/src/it/java/org/apache/phoenix/end2end/BasePermissionsIT.java>:[1463,49] cannot find symbol
[ERROR] symbol: variable GetUserPermissionsRequest
[ERROR] location: class org.apache.phoenix.end2end.BasePermissionsIT.CustomAccessController
[ERROR] <https://builds.apache.org/job/Phoenix-master-matrix/HBASE_PROFILE=2.0/ws/phoenix-core/src/it/java/org/apache/phoenix/end2end/BasePermissionsIT.java>:[1467,29] cannot find symbol
[ERROR] symbol: variable GetUserPermissionsRequest
[ERROR] location: class org.apache.phoenix.end2end.BasePermissionsIT.CustomAccessController
[ERROR] <https://builds.apache.org/job/Phoenix-master-matrix/HBASE_PROFILE=2.0/ws/phoenix-core/src/it/java/org/apache/phoenix/end2end/BasePermissionsIT.java>:[1470,29] cannot find symbol
[ERROR] symbol: variable GetUserPermissionsRequest
[ERROR] location: class org.apache.phoenix.end2end.BasePermissionsIT.CustomAccessController
[ERROR] -> [Help 1]
[ERROR]
[ERROR] To see the full stack trace of the errors, re-run Maven with the -e switch.
[ERROR] Re-run Maven using the -X switch to enable full debug logging.
[ERROR]
[ERROR] For more information about the errors and possible solutions, please read the following articles:
[ERROR] [Help 1] http://cwiki.apache.org/confluence/display/MAVEN/MojoFailureException
[ERROR]
[ERROR] After correcting the problems, you can resume the build with the command
[ERROR] mvn <args> -rf :phoenix-core
Build step 'Invoke top-level Maven targets' marked build as failure
Archiving artifacts
Recording test results
ERROR: Step ?Publish JUnit test result report? failed: No test report files were found. Configuration error?
Not sending mail to unregistered user giskender@salesforce.com
Not sending mail to unregistered user Rajeshbabu Chintaguntla
Not sending mail to unregistered user noreply@github.com
Not sending mail to unregistered user abhishek.chouhan@salesforce.com
Not sending mail to unregistered user s.kadam@salesforce.com
Build failed in Jenkins: Phoenix | Master | HBase Profile » 2.0 #90
Posted by Apache Jenkins Server <je...@builds.apache.org>.
See <https://builds.apache.org/job/Phoenix-master-matrix/HBASE_PROFILE=2.0/90/display/redirect?page=changes>
Changes:
[achouhan] PHOENIX-5932 View Index rebuild results in surplus rows from other view
------------------------------------------
[...truncated 25.65 KB...]
[INFO] Changes detected - recompiling the module!
[INFO] Compiling 5 source files to <https://builds.apache.org/job/Phoenix-master-matrix/HBASE_PROFILE=2.0/ws/phoenix-hbase-compat-2.0.1/target/classes>
[INFO] <https://builds.apache.org/job/Phoenix-master-matrix/HBASE_PROFILE=2.0/ws/phoenix-hbase-compat-2.0.1/src/main/java/org/apache/phoenix/compat/hbase/OffsetCell.java>: Some input files use or override a deprecated API.
[INFO] <https://builds.apache.org/job/Phoenix-master-matrix/HBASE_PROFILE=2.0/ws/phoenix-hbase-compat-2.0.1/src/main/java/org/apache/phoenix/compat/hbase/OffsetCell.java>: Recompile with -Xlint:deprecation for details.
[INFO]
[INFO] --- maven-resources-plugin:3.1.0:testResources (default-testResources) @ phoenix-hbase-compat-2.0.1 ---
[INFO] Using 'UTF-8' encoding to copy filtered resources.
[INFO] skip non existing resourceDirectory <https://builds.apache.org/job/Phoenix-master-matrix/HBASE_PROFILE=2.0/ws/phoenix-hbase-compat-2.0.1/src/test/resources>
[INFO] Copying 3 resources
[INFO]
[INFO] --- maven-compiler-plugin:3.7.0:testCompile (default-testCompile) @ phoenix-hbase-compat-2.0.1 ---
[INFO] No sources to compile
[INFO]
[INFO] --- maven-surefire-plugin:2.22.0:test (default-test) @ phoenix-hbase-compat-2.0.1 ---
[INFO]
[INFO] --- maven-jar-plugin:3.1.0:jar (default-jar) @ phoenix-hbase-compat-2.0.1 ---
[INFO] Building jar: <https://builds.apache.org/job/Phoenix-master-matrix/HBASE_PROFILE=2.0/ws/phoenix-hbase-compat-2.0.1/target/phoenix-hbase-compat-2.0.1-5.1.0-SNAPSHOT.jar>
[INFO]
[INFO] --- maven-site-plugin:3.7.1:attach-descriptor (attach-descriptor) @ phoenix-hbase-compat-2.0.1 ---
[INFO] Skipping because packaging 'jar' is not pom.
[INFO]
[INFO] --- maven-install-plugin:2.5.2:install (default-install) @ phoenix-hbase-compat-2.0.1 ---
[INFO] Installing <https://builds.apache.org/job/Phoenix-master-matrix/HBASE_PROFILE=2.0/ws/phoenix-hbase-compat-2.0.1/target/phoenix-hbase-compat-2.0.1-5.1.0-SNAPSHOT.jar> to /home/jenkins/.m2/repository/org/apache/phoenix/phoenix-hbase-compat-2.0.1/5.1.0-SNAPSHOT/phoenix-hbase-compat-2.0.1-5.1.0-SNAPSHOT.jar
[INFO] Installing <https://builds.apache.org/job/Phoenix-master-matrix/HBASE_PROFILE=2.0/ws/phoenix-hbase-compat-2.0.1/pom.xml> to /home/jenkins/.m2/repository/org/apache/phoenix/phoenix-hbase-compat-2.0.1/5.1.0-SNAPSHOT/phoenix-hbase-compat-2.0.1-5.1.0-SNAPSHOT.pom
[INFO]
[INFO] ---------------------< org.apache.phoenix:phoenix >---------------------
[INFO] Building Apache Phoenix 5.1.0-SNAPSHOT [4/10]
[INFO] --------------------------------[ pom ]---------------------------------
[INFO]
[INFO] --- maven-clean-plugin:3.1.0:clean (default-clean) @ phoenix ---
[INFO] Deleting <https://builds.apache.org/job/Phoenix-master-matrix/HBASE_PROFILE=2.0/ws/target>
[INFO]
[INFO] --- maven-enforcer-plugin:3.0.0-M3:enforce (enforce-maven-version) @ phoenix ---
[INFO]
[INFO] --- maven-enforcer-plugin:3.0.0-M3:enforce (check-hbase-compatibility) @ phoenix ---
[INFO]
[INFO] --- maven-checkstyle-plugin:3.1.0:check (validate) @ phoenix ---
[INFO]
[INFO] --- jacoco-maven-plugin:0.7.9:prepare-agent (prepare-agent) @ phoenix ---
[INFO] jacocoArgLine set to -javaagent:/home/jenkins/.m2/repository/org/jacoco/org.jacoco.agent/0.7.9/org.jacoco.agent-0.7.9-runtime.jar=destfile=<https://builds.apache.org/job/Phoenix-master-matrix/HBASE_PROFILE=2.0/ws/target/jacoco.exec>
[INFO]
[INFO] --- maven-remote-resources-plugin:1.5:process (process-resource-bundles) @ phoenix ---
[INFO]
[INFO] --- maven-source-plugin:3.0.1:jar-no-fork (attach-sources) @ phoenix ---
[INFO]
[INFO] --- maven-jar-plugin:3.1.0:test-jar (default) @ phoenix ---
[WARNING] JAR will be empty - no content was marked for inclusion!
[INFO] Building jar: <https://builds.apache.org/job/Phoenix-master-matrix/HBASE_PROFILE=2.0/ws/target/phoenix-5.1.0-SNAPSHOT-tests.jar>
[INFO]
[INFO] --- maven-site-plugin:3.7.1:attach-descriptor (attach-descriptor) @ phoenix ---
[INFO] No site descriptor found: nothing to attach.
[INFO]
[INFO] --- jacoco-maven-plugin:0.7.9:report (report) @ phoenix ---
[INFO] Skipping JaCoCo execution due to missing execution data file.
[INFO]
[INFO] --- jacoco-maven-plugin:0.7.9:check (check) @ phoenix ---
[INFO] Skipping JaCoCo execution due to missing execution data <https://builds.apache.org/job/Phoenix-master-matrix/HBASE_PROFILE=2.0/ws/target/jacoco.exec>
[INFO]
[INFO] --- maven-install-plugin:2.5.2:install (default-install) @ phoenix ---
[INFO] Installing <https://builds.apache.org/job/Phoenix-master-matrix/HBASE_PROFILE=2.0/ws/pom.xml> to /home/jenkins/.m2/repository/org/apache/phoenix/phoenix/5.1.0-SNAPSHOT/phoenix-5.1.0-SNAPSHOT.pom
[INFO] Installing <https://builds.apache.org/job/Phoenix-master-matrix/HBASE_PROFILE=2.0/ws/target/phoenix-5.1.0-SNAPSHOT-tests.jar> to /home/jenkins/.m2/repository/org/apache/phoenix/phoenix/5.1.0-SNAPSHOT/phoenix-5.1.0-SNAPSHOT-tests.jar
[INFO]
[INFO] ------------------< org.apache.phoenix:phoenix-core >-------------------
[INFO] Building Phoenix Core 5.1.0-SNAPSHOT [5/10]
[INFO] --------------------------------[ jar ]---------------------------------
Downloading from apache release: https://repository.apache.org/content/repositories/releases/org/glassfish/javax.el/maven-metadata.xml
[INFO]
[INFO] --- maven-clean-plugin:3.1.0:clean (default-clean) @ phoenix-core ---
[INFO] Deleting <https://builds.apache.org/job/Phoenix-master-matrix/HBASE_PROFILE=2.0/ws/phoenix-core/target>
[INFO]
[INFO] --- maven-enforcer-plugin:3.0.0-M3:enforce (enforce-maven-version) @ phoenix-core ---
[INFO]
[INFO] --- maven-enforcer-plugin:3.0.0-M3:enforce (check-hbase-compatibility) @ phoenix-core ---
[INFO]
[INFO] --- maven-checkstyle-plugin:3.1.0:check (validate) @ phoenix-core ---
[INFO]
[INFO] --- build-helper-maven-plugin:1.9.1:add-test-source (add-test-source) @ phoenix-core ---
[INFO] Test Source directory: <https://builds.apache.org/job/Phoenix-master-matrix/HBASE_PROFILE=2.0/ws/phoenix-core/src/it/java> added.
[INFO]
[INFO] --- build-helper-maven-plugin:1.9.1:add-test-resource (add-test-resource) @ phoenix-core ---
[INFO]
[INFO] --- jacoco-maven-plugin:0.7.9:prepare-agent (prepare-agent) @ phoenix-core ---
[INFO] jacocoArgLine set to -javaagent:/home/jenkins/.m2/repository/org/jacoco/org.jacoco.agent/0.7.9/org.jacoco.agent-0.7.9-runtime.jar=destfile=<https://builds.apache.org/job/Phoenix-master-matrix/HBASE_PROFILE=2.0/ws/phoenix-core/target/jacoco.exec>
[INFO]
[INFO] --- build-helper-maven-plugin:1.9.1:add-source (add-source) @ phoenix-core ---
[INFO] Source directory: <https://builds.apache.org/job/Phoenix-master-matrix/HBASE_PROFILE=2.0/ws/phoenix-core/target/generated-sources/antlr3> added.
[INFO] Source directory: <https://builds.apache.org/job/Phoenix-master-matrix/HBASE_PROFILE=2.0/ws/phoenix-core/src/main/antlr3> added.
[INFO]
[INFO] --- antlr3-maven-plugin:3.5.2:antlr (default) @ phoenix-core ---
[INFO] ANTLR: Processing source directory <https://builds.apache.org/job/Phoenix-master-matrix/HBASE_PROFILE=2.0/ws/phoenix-core/src/main/antlr3>
ANTLR Parser Generator Version 3.5.2
Output file <https://builds.apache.org/job/Phoenix-master-matrix/HBASE_PROFILE=2.0/ws/phoenix-core/target/generated-sources/antlr3/org/apache/phoenix/parse/PhoenixSQLParser.java> does not exist: must build <https://builds.apache.org/job/Phoenix-master-matrix/HBASE_PROFILE=2.0/ws/phoenix-core/src/main/antlr3/PhoenixSQL.g>
PhoenixSQL.g
[INFO]
[INFO] --- maven-dependency-plugin:3.1.1:build-classpath (create-phoenix-generated-classpath) @ phoenix-core ---
[INFO] Wrote classpath file '<https://builds.apache.org/job/Phoenix-master-matrix/HBASE_PROFILE=2.0/ws/phoenix-core/target/cached_classpath.txt'.>
[INFO]
[INFO] --- maven-remote-resources-plugin:1.5:process (process-resource-bundles) @ phoenix-core ---
[INFO] artifact org.glassfish:javax.el: checking for updates from apache release
[INFO] artifact org.glassfish:javax.el: checking for updates from central
[INFO] artifact org.glassfish:javax.el: checking for updates from java.net.Releases
[INFO] artifact org.glassfish:javax.el: checking for updates from apache release
[INFO] artifact org.glassfish:javax.el: checking for updates from central
[INFO] artifact org.glassfish:javax.el: checking for updates from java.net.Releases
[INFO]
[INFO] --- maven-resources-plugin:3.1.0:resources (default-resources) @ phoenix-core ---
[INFO] Using 'UTF-8' encoding to copy filtered resources.
[INFO] Copying 3 resources
[INFO] Copying 3 resources
[INFO]
[INFO] --- maven-compiler-plugin:3.7.0:compile (default-compile) @ phoenix-core ---
[INFO] Changes detected - recompiling the module!
[INFO] Compiling 1169 source files to <https://builds.apache.org/job/Phoenix-master-matrix/HBASE_PROFILE=2.0/ws/phoenix-core/target/classes>
[WARNING] <https://builds.apache.org/job/Phoenix-master-matrix/HBASE_PROFILE=2.0/ws/phoenix-core/src/main/java/org/apache/phoenix/coprocessor/IndexRebuildRegionScanner.java>:[42,52] com.sun.org.apache.xpath.internal.operations.Bool is internal proprietary API and may be removed in a future release
[WARNING] <https://builds.apache.org/job/Phoenix-master-matrix/HBASE_PROFILE=2.0/ws/phoenix-core/src/main/java/org/apache/phoenix/execute/DescVarLengthFastByteComparisons.java>:[25,16] sun.misc.Unsafe is internal proprietary API and may be removed in a future release
[WARNING] <https://builds.apache.org/job/Phoenix-master-matrix/HBASE_PROFILE=2.0/ws/phoenix-core/src/main/java/org/apache/phoenix/execute/DescVarLengthFastByteComparisons.java>:[116,26] sun.misc.Unsafe is internal proprietary API and may be removed in a future release
[WARNING] <https://builds.apache.org/job/Phoenix-master-matrix/HBASE_PROFILE=2.0/ws/phoenix-core/src/main/java/org/apache/phoenix/execute/DescVarLengthFastByteComparisons.java>:[122,30] sun.misc.Unsafe is internal proprietary API and may be removed in a future release
[WARNING] <https://builds.apache.org/job/Phoenix-master-matrix/HBASE_PROFILE=2.0/ws/phoenix-core/src/main/java/org/apache/phoenix/execute/DescVarLengthFastByteComparisons.java>:[126,39] sun.misc.Unsafe is internal proprietary API and may be removed in a future release
[INFO] <https://builds.apache.org/job/Phoenix-master-matrix/HBASE_PROFILE=2.0/ws/phoenix-core/src/main/java/org/apache/phoenix/expression/BaseExpression.java>: Some input files use or override a deprecated API.
[INFO] <https://builds.apache.org/job/Phoenix-master-matrix/HBASE_PROFILE=2.0/ws/phoenix-core/src/main/java/org/apache/phoenix/expression/BaseExpression.java>: Recompile with -Xlint:deprecation for details.
[INFO] <https://builds.apache.org/job/Phoenix-master-matrix/HBASE_PROFILE=2.0/ws/phoenix-core/src/main/java/org/apache/phoenix/jdbc/PhoenixStatement.java>: Some input files use unchecked or unsafe operations.
[INFO] <https://builds.apache.org/job/Phoenix-master-matrix/HBASE_PROFILE=2.0/ws/phoenix-core/src/main/java/org/apache/phoenix/jdbc/PhoenixStatement.java>: Recompile with -Xlint:unchecked for details.
[INFO]
[INFO] --- maven-dependency-plugin:3.1.1:build-classpath (create-mrapp-generated-classpath) @ phoenix-core ---
[INFO] Wrote classpath file '<https://builds.apache.org/job/Phoenix-master-matrix/HBASE_PROFILE=2.0/ws/phoenix-core/target/classes/mrapp-generated-classpath'.>
[INFO]
[INFO] --- maven-resources-plugin:3.1.0:testResources (default-testResources) @ phoenix-core ---
[INFO] Using 'UTF-8' encoding to copy filtered resources.
[INFO] Copying 5 resources
[INFO] Copying 12 resources
[INFO] Copying 3 resources
[INFO]
[INFO] --- maven-compiler-plugin:3.7.0:testCompile (default-testCompile) @ phoenix-core ---
[INFO] Changes detected - recompiling the module!
[INFO] Compiling 613 source files to <https://builds.apache.org/job/Phoenix-master-matrix/HBASE_PROFILE=2.0/ws/phoenix-core/target/test-classes>
[INFO] <https://builds.apache.org/job/Phoenix-master-matrix/HBASE_PROFILE=2.0/ws/phoenix-core/src/test/java/org/apache/phoenix/query/BaseTest.java>: Some input files use or override a deprecated API.
[INFO] <https://builds.apache.org/job/Phoenix-master-matrix/HBASE_PROFILE=2.0/ws/phoenix-core/src/test/java/org/apache/phoenix/query/BaseTest.java>: Recompile with -Xlint:deprecation for details.
[INFO] <https://builds.apache.org/job/Phoenix-master-matrix/HBASE_PROFILE=2.0/ws/phoenix-core/src/test/java/org/apache/phoenix/query/BaseTest.java>: Some input files use unchecked or unsafe operations.
[INFO] <https://builds.apache.org/job/Phoenix-master-matrix/HBASE_PROFILE=2.0/ws/phoenix-core/src/test/java/org/apache/phoenix/query/BaseTest.java>: Recompile with -Xlint:unchecked for details.
[INFO] -------------------------------------------------------------
[ERROR] COMPILATION ERROR :
[INFO] -------------------------------------------------------------
[ERROR] <https://builds.apache.org/job/Phoenix-master-matrix/HBASE_PROFILE=2.0/ws/phoenix-core/src/it/java/org/apache/phoenix/end2end/BasePermissionsIT.java>:[39,47] cannot find symbol
symbol: class GetUserPermissionsRequest
location: package org.apache.hadoop.hbase.security.access
[ERROR] <https://builds.apache.org/job/Phoenix-master-matrix/HBASE_PROFILE=2.0/ws/phoenix-core/src/it/java/org/apache/phoenix/end2end/BasePermissionsIT.java>:[1452,48] cannot find symbol
symbol: method hasUserName()
location: variable request of type org.apache.hadoop.hbase.protobuf.generated.AccessControlProtos.GetUserPermissionsRequest
[ERROR] <https://builds.apache.org/job/Phoenix-master-matrix/HBASE_PROFILE=2.0/ws/phoenix-core/src/it/java/org/apache/phoenix/end2end/BasePermissionsIT.java>:[1452,72] cannot find symbol
symbol: method getUserName()
location: variable request of type org.apache.hadoop.hbase.protobuf.generated.AccessControlProtos.GetUserPermissionsRequest
[ERROR] <https://builds.apache.org/job/Phoenix-master-matrix/HBASE_PROFILE=2.0/ws/phoenix-core/src/it/java/org/apache/phoenix/end2end/BasePermissionsIT.java>:[1458,32] cannot find symbol
symbol: method hasColumnFamily()
location: variable request of type org.apache.hadoop.hbase.protobuf.generated.AccessControlProtos.GetUserPermissionsRequest
[ERROR] <https://builds.apache.org/job/Phoenix-master-matrix/HBASE_PROFILE=2.0/ws/phoenix-core/src/it/java/org/apache/phoenix/end2end/BasePermissionsIT.java>:[1458,60] cannot find symbol
symbol: method getColumnFamily()
location: variable request of type org.apache.hadoop.hbase.protobuf.generated.AccessControlProtos.GetUserPermissionsRequest
[ERROR] <https://builds.apache.org/job/Phoenix-master-matrix/HBASE_PROFILE=2.0/ws/phoenix-core/src/it/java/org/apache/phoenix/end2end/BasePermissionsIT.java>:[1460,32] cannot find symbol
symbol: method hasColumnQualifier()
location: variable request of type org.apache.hadoop.hbase.protobuf.generated.AccessControlProtos.GetUserPermissionsRequest
[ERROR] <https://builds.apache.org/job/Phoenix-master-matrix/HBASE_PROFILE=2.0/ws/phoenix-core/src/it/java/org/apache/phoenix/end2end/BasePermissionsIT.java>:[1460,63] cannot find symbol
symbol: method getColumnQualifier()
location: variable request of type org.apache.hadoop.hbase.protobuf.generated.AccessControlProtos.GetUserPermissionsRequest
[ERROR] <https://builds.apache.org/job/Phoenix-master-matrix/HBASE_PROFILE=2.0/ws/phoenix-core/src/it/java/org/apache/phoenix/end2end/BasePermissionsIT.java>:[1461,17] cannot find symbol
symbol: class GetUserPermissionsRequest
location: class org.apache.phoenix.end2end.BasePermissionsIT.CustomAccessController
[ERROR] <https://builds.apache.org/job/Phoenix-master-matrix/HBASE_PROFILE=2.0/ws/phoenix-core/src/it/java/org/apache/phoenix/end2end/BasePermissionsIT.java>:[1463,49] cannot find symbol
symbol: variable GetUserPermissionsRequest
location: class org.apache.phoenix.end2end.BasePermissionsIT.CustomAccessController
[ERROR] <https://builds.apache.org/job/Phoenix-master-matrix/HBASE_PROFILE=2.0/ws/phoenix-core/src/it/java/org/apache/phoenix/end2end/BasePermissionsIT.java>:[1467,29] cannot find symbol
symbol: variable GetUserPermissionsRequest
location: class org.apache.phoenix.end2end.BasePermissionsIT.CustomAccessController
[ERROR] <https://builds.apache.org/job/Phoenix-master-matrix/HBASE_PROFILE=2.0/ws/phoenix-core/src/it/java/org/apache/phoenix/end2end/BasePermissionsIT.java>:[1470,29] cannot find symbol
symbol: variable GetUserPermissionsRequest
location: class org.apache.phoenix.end2end.BasePermissionsIT.CustomAccessController
[INFO] 11 errors
[INFO] -------------------------------------------------------------
[INFO] ------------------------------------------------------------------------
[INFO] Reactor Summary for Apache Phoenix 5.1.0-SNAPSHOT:
[INFO]
[INFO] Phoenix Hbase 2.2.1 compatibility .................. SUCCESS [ 11.989 s]
[INFO] Phoenix Hbase 2.1.6 compatibility .................. SUCCESS [ 1.856 s]
[INFO] Phoenix Hbase 2.0.1 compatibility .................. SUCCESS [ 2.485 s]
[INFO] Apache Phoenix ..................................... SUCCESS [ 1.918 s]
[INFO] Phoenix Core ....................................... FAILURE [ 50.644 s]
[INFO] Phoenix - Pherf .................................... SKIPPED
[INFO] Phoenix Client ..................................... SKIPPED
[INFO] Phoenix Server ..................................... SKIPPED
[INFO] Phoenix - Tracing Web Application .................. SKIPPED
[INFO] Phoenix Assembly ................................... SKIPPED
[INFO] ------------------------------------------------------------------------
[INFO] BUILD FAILURE
[INFO] ------------------------------------------------------------------------
[INFO] Total time: 01:09 min
[INFO] Finished at: 2020-06-09T21:47:55Z
[INFO] ------------------------------------------------------------------------
[ERROR] Failed to execute goal org.apache.maven.plugins:maven-compiler-plugin:3.7.0:testCompile (default-testCompile) on project phoenix-core: Compilation failure: Compilation failure:
[ERROR] <https://builds.apache.org/job/Phoenix-master-matrix/HBASE_PROFILE=2.0/ws/phoenix-core/src/it/java/org/apache/phoenix/end2end/BasePermissionsIT.java>:[39,47] cannot find symbol
[ERROR] symbol: class GetUserPermissionsRequest
[ERROR] location: package org.apache.hadoop.hbase.security.access
[ERROR] <https://builds.apache.org/job/Phoenix-master-matrix/HBASE_PROFILE=2.0/ws/phoenix-core/src/it/java/org/apache/phoenix/end2end/BasePermissionsIT.java>:[1452,48] cannot find symbol
[ERROR] symbol: method hasUserName()
[ERROR] location: variable request of type org.apache.hadoop.hbase.protobuf.generated.AccessControlProtos.GetUserPermissionsRequest
[ERROR] <https://builds.apache.org/job/Phoenix-master-matrix/HBASE_PROFILE=2.0/ws/phoenix-core/src/it/java/org/apache/phoenix/end2end/BasePermissionsIT.java>:[1452,72] cannot find symbol
[ERROR] symbol: method getUserName()
[ERROR] location: variable request of type org.apache.hadoop.hbase.protobuf.generated.AccessControlProtos.GetUserPermissionsRequest
[ERROR] <https://builds.apache.org/job/Phoenix-master-matrix/HBASE_PROFILE=2.0/ws/phoenix-core/src/it/java/org/apache/phoenix/end2end/BasePermissionsIT.java>:[1458,32] cannot find symbol
[ERROR] symbol: method hasColumnFamily()
[ERROR] location: variable request of type org.apache.hadoop.hbase.protobuf.generated.AccessControlProtos.GetUserPermissionsRequest
[ERROR] <https://builds.apache.org/job/Phoenix-master-matrix/HBASE_PROFILE=2.0/ws/phoenix-core/src/it/java/org/apache/phoenix/end2end/BasePermissionsIT.java>:[1458,60] cannot find symbol
[ERROR] symbol: method getColumnFamily()
[ERROR] location: variable request of type org.apache.hadoop.hbase.protobuf.generated.AccessControlProtos.GetUserPermissionsRequest
[ERROR] <https://builds.apache.org/job/Phoenix-master-matrix/HBASE_PROFILE=2.0/ws/phoenix-core/src/it/java/org/apache/phoenix/end2end/BasePermissionsIT.java>:[1460,32] cannot find symbol
[ERROR] symbol: method hasColumnQualifier()
[ERROR] location: variable request of type org.apache.hadoop.hbase.protobuf.generated.AccessControlProtos.GetUserPermissionsRequest
[ERROR] <https://builds.apache.org/job/Phoenix-master-matrix/HBASE_PROFILE=2.0/ws/phoenix-core/src/it/java/org/apache/phoenix/end2end/BasePermissionsIT.java>:[1460,63] cannot find symbol
[ERROR] symbol: method getColumnQualifier()
[ERROR] location: variable request of type org.apache.hadoop.hbase.protobuf.generated.AccessControlProtos.GetUserPermissionsRequest
[ERROR] <https://builds.apache.org/job/Phoenix-master-matrix/HBASE_PROFILE=2.0/ws/phoenix-core/src/it/java/org/apache/phoenix/end2end/BasePermissionsIT.java>:[1461,17] cannot find symbol
[ERROR] symbol: class GetUserPermissionsRequest
[ERROR] location: class org.apache.phoenix.end2end.BasePermissionsIT.CustomAccessController
[ERROR] <https://builds.apache.org/job/Phoenix-master-matrix/HBASE_PROFILE=2.0/ws/phoenix-core/src/it/java/org/apache/phoenix/end2end/BasePermissionsIT.java>:[1463,49] cannot find symbol
[ERROR] symbol: variable GetUserPermissionsRequest
[ERROR] location: class org.apache.phoenix.end2end.BasePermissionsIT.CustomAccessController
[ERROR] <https://builds.apache.org/job/Phoenix-master-matrix/HBASE_PROFILE=2.0/ws/phoenix-core/src/it/java/org/apache/phoenix/end2end/BasePermissionsIT.java>:[1467,29] cannot find symbol
[ERROR] symbol: variable GetUserPermissionsRequest
[ERROR] location: class org.apache.phoenix.end2end.BasePermissionsIT.CustomAccessController
[ERROR] <https://builds.apache.org/job/Phoenix-master-matrix/HBASE_PROFILE=2.0/ws/phoenix-core/src/it/java/org/apache/phoenix/end2end/BasePermissionsIT.java>:[1470,29] cannot find symbol
[ERROR] symbol: variable GetUserPermissionsRequest
[ERROR] location: class org.apache.phoenix.end2end.BasePermissionsIT.CustomAccessController
[ERROR] -> [Help 1]
[ERROR]
[ERROR] To see the full stack trace of the errors, re-run Maven with the -e switch.
[ERROR] Re-run Maven using the -X switch to enable full debug logging.
[ERROR]
[ERROR] For more information about the errors and possible solutions, please read the following articles:
[ERROR] [Help 1] http://cwiki.apache.org/confluence/display/MAVEN/MojoFailureException
[ERROR]
[ERROR] After correcting the problems, you can resume the build with the command
[ERROR] mvn <args> -rf :phoenix-core
Build step 'Invoke top-level Maven targets' marked build as failure
Archiving artifacts
Recording test results
ERROR: Step ?Publish JUnit test result report? failed: No test report files were found. Configuration error?
Not sending mail to unregistered user giskender@salesforce.com
Not sending mail to unregistered user Rajeshbabu Chintaguntla
Not sending mail to unregistered user noreply@github.com
Not sending mail to unregistered user abhishek.chouhan@salesforce.com
Not sending mail to unregistered user s.kadam@salesforce.com
Build failed in Jenkins: Phoenix | Master | HBase Profile » 2.0 #89
Posted by Apache Jenkins Server <je...@builds.apache.org>.
See <https://builds.apache.org/job/Phoenix-master-matrix/HBASE_PROFILE=2.0/89/display/redirect?page=changes>
Changes:
[s.kadam] PHOENIX-5896: Implement incremental rebuild along the failed regions in
------------------------------------------
[...truncated 25.76 KB...]
[INFO] Changes detected - recompiling the module!
[INFO] Compiling 5 source files to <https://builds.apache.org/job/Phoenix-master-matrix/HBASE_PROFILE=2.0/ws/phoenix-hbase-compat-2.0.1/target/classes>
[INFO] <https://builds.apache.org/job/Phoenix-master-matrix/HBASE_PROFILE=2.0/ws/phoenix-hbase-compat-2.0.1/src/main/java/org/apache/phoenix/compat/hbase/OffsetCell.java>: Some input files use or override a deprecated API.
[INFO] <https://builds.apache.org/job/Phoenix-master-matrix/HBASE_PROFILE=2.0/ws/phoenix-hbase-compat-2.0.1/src/main/java/org/apache/phoenix/compat/hbase/OffsetCell.java>: Recompile with -Xlint:deprecation for details.
[INFO]
[INFO] --- maven-resources-plugin:3.1.0:testResources (default-testResources) @ phoenix-hbase-compat-2.0.1 ---
[INFO] Using 'UTF-8' encoding to copy filtered resources.
[INFO] skip non existing resourceDirectory <https://builds.apache.org/job/Phoenix-master-matrix/HBASE_PROFILE=2.0/ws/phoenix-hbase-compat-2.0.1/src/test/resources>
[INFO] Copying 3 resources
[INFO]
[INFO] --- maven-compiler-plugin:3.7.0:testCompile (default-testCompile) @ phoenix-hbase-compat-2.0.1 ---
[INFO] No sources to compile
[INFO]
[INFO] --- maven-surefire-plugin:2.22.0:test (default-test) @ phoenix-hbase-compat-2.0.1 ---
[INFO]
[INFO] --- maven-jar-plugin:3.1.0:jar (default-jar) @ phoenix-hbase-compat-2.0.1 ---
[INFO] Building jar: <https://builds.apache.org/job/Phoenix-master-matrix/HBASE_PROFILE=2.0/ws/phoenix-hbase-compat-2.0.1/target/phoenix-hbase-compat-2.0.1-5.1.0-SNAPSHOT.jar>
[INFO]
[INFO] --- maven-site-plugin:3.7.1:attach-descriptor (attach-descriptor) @ phoenix-hbase-compat-2.0.1 ---
[INFO] Skipping because packaging 'jar' is not pom.
[INFO]
[INFO] --- maven-install-plugin:2.5.2:install (default-install) @ phoenix-hbase-compat-2.0.1 ---
[INFO] Installing <https://builds.apache.org/job/Phoenix-master-matrix/HBASE_PROFILE=2.0/ws/phoenix-hbase-compat-2.0.1/target/phoenix-hbase-compat-2.0.1-5.1.0-SNAPSHOT.jar> to /home/jenkins/.m2/repository/org/apache/phoenix/phoenix-hbase-compat-2.0.1/5.1.0-SNAPSHOT/phoenix-hbase-compat-2.0.1-5.1.0-SNAPSHOT.jar
[INFO] Installing <https://builds.apache.org/job/Phoenix-master-matrix/HBASE_PROFILE=2.0/ws/phoenix-hbase-compat-2.0.1/pom.xml> to /home/jenkins/.m2/repository/org/apache/phoenix/phoenix-hbase-compat-2.0.1/5.1.0-SNAPSHOT/phoenix-hbase-compat-2.0.1-5.1.0-SNAPSHOT.pom
[INFO]
[INFO] ---------------------< org.apache.phoenix:phoenix >---------------------
[INFO] Building Apache Phoenix 5.1.0-SNAPSHOT [4/10]
[INFO] --------------------------------[ pom ]---------------------------------
[INFO]
[INFO] --- maven-clean-plugin:3.1.0:clean (default-clean) @ phoenix ---
[INFO] Deleting <https://builds.apache.org/job/Phoenix-master-matrix/HBASE_PROFILE=2.0/ws/target>
[INFO]
[INFO] --- maven-enforcer-plugin:3.0.0-M3:enforce (enforce-maven-version) @ phoenix ---
[INFO]
[INFO] --- maven-enforcer-plugin:3.0.0-M3:enforce (check-hbase-compatibility) @ phoenix ---
[INFO]
[INFO] --- maven-checkstyle-plugin:3.1.0:check (validate) @ phoenix ---
[INFO]
[INFO] --- jacoco-maven-plugin:0.7.9:prepare-agent (prepare-agent) @ phoenix ---
[INFO] jacocoArgLine set to -javaagent:/home/jenkins/.m2/repository/org/jacoco/org.jacoco.agent/0.7.9/org.jacoco.agent-0.7.9-runtime.jar=destfile=<https://builds.apache.org/job/Phoenix-master-matrix/HBASE_PROFILE=2.0/ws/target/jacoco.exec>
[INFO]
[INFO] --- maven-remote-resources-plugin:1.5:process (process-resource-bundles) @ phoenix ---
[INFO]
[INFO] --- maven-source-plugin:3.0.1:jar-no-fork (attach-sources) @ phoenix ---
[INFO]
[INFO] --- maven-jar-plugin:3.1.0:test-jar (default) @ phoenix ---
[WARNING] JAR will be empty - no content was marked for inclusion!
[INFO] Building jar: <https://builds.apache.org/job/Phoenix-master-matrix/HBASE_PROFILE=2.0/ws/target/phoenix-5.1.0-SNAPSHOT-tests.jar>
[INFO]
[INFO] --- maven-site-plugin:3.7.1:attach-descriptor (attach-descriptor) @ phoenix ---
[INFO] No site descriptor found: nothing to attach.
[INFO]
[INFO] --- jacoco-maven-plugin:0.7.9:report (report) @ phoenix ---
[INFO] Skipping JaCoCo execution due to missing execution data file.
[INFO]
[INFO] --- jacoco-maven-plugin:0.7.9:check (check) @ phoenix ---
[INFO] Skipping JaCoCo execution due to missing execution data <https://builds.apache.org/job/Phoenix-master-matrix/HBASE_PROFILE=2.0/ws/target/jacoco.exec>
[INFO]
[INFO] --- maven-install-plugin:2.5.2:install (default-install) @ phoenix ---
[INFO] Installing <https://builds.apache.org/job/Phoenix-master-matrix/HBASE_PROFILE=2.0/ws/pom.xml> to /home/jenkins/.m2/repository/org/apache/phoenix/phoenix/5.1.0-SNAPSHOT/phoenix-5.1.0-SNAPSHOT.pom
[INFO] Installing <https://builds.apache.org/job/Phoenix-master-matrix/HBASE_PROFILE=2.0/ws/target/phoenix-5.1.0-SNAPSHOT-tests.jar> to /home/jenkins/.m2/repository/org/apache/phoenix/phoenix/5.1.0-SNAPSHOT/phoenix-5.1.0-SNAPSHOT-tests.jar
[INFO]
[INFO] ------------------< org.apache.phoenix:phoenix-core >-------------------
[INFO] Building Phoenix Core 5.1.0-SNAPSHOT [5/10]
[INFO] --------------------------------[ jar ]---------------------------------
Downloading from apache release: https://repository.apache.org/content/repositories/releases/org/glassfish/javax.el/maven-metadata.xml
[INFO]
[INFO] --- maven-clean-plugin:3.1.0:clean (default-clean) @ phoenix-core ---
[INFO] Deleting <https://builds.apache.org/job/Phoenix-master-matrix/HBASE_PROFILE=2.0/ws/phoenix-core/target>
[INFO]
[INFO] --- maven-enforcer-plugin:3.0.0-M3:enforce (enforce-maven-version) @ phoenix-core ---
[INFO]
[INFO] --- maven-enforcer-plugin:3.0.0-M3:enforce (check-hbase-compatibility) @ phoenix-core ---
[INFO]
[INFO] --- maven-checkstyle-plugin:3.1.0:check (validate) @ phoenix-core ---
[INFO]
[INFO] --- build-helper-maven-plugin:1.9.1:add-test-source (add-test-source) @ phoenix-core ---
[INFO] Test Source directory: <https://builds.apache.org/job/Phoenix-master-matrix/HBASE_PROFILE=2.0/ws/phoenix-core/src/it/java> added.
[INFO]
[INFO] --- build-helper-maven-plugin:1.9.1:add-test-resource (add-test-resource) @ phoenix-core ---
[INFO]
[INFO] --- jacoco-maven-plugin:0.7.9:prepare-agent (prepare-agent) @ phoenix-core ---
[INFO] jacocoArgLine set to -javaagent:/home/jenkins/.m2/repository/org/jacoco/org.jacoco.agent/0.7.9/org.jacoco.agent-0.7.9-runtime.jar=destfile=<https://builds.apache.org/job/Phoenix-master-matrix/HBASE_PROFILE=2.0/ws/phoenix-core/target/jacoco.exec>
[INFO]
[INFO] --- build-helper-maven-plugin:1.9.1:add-source (add-source) @ phoenix-core ---
[INFO] Source directory: <https://builds.apache.org/job/Phoenix-master-matrix/HBASE_PROFILE=2.0/ws/phoenix-core/target/generated-sources/antlr3> added.
[INFO] Source directory: <https://builds.apache.org/job/Phoenix-master-matrix/HBASE_PROFILE=2.0/ws/phoenix-core/src/main/antlr3> added.
[INFO]
[INFO] --- antlr3-maven-plugin:3.5.2:antlr (default) @ phoenix-core ---
[INFO] ANTLR: Processing source directory <https://builds.apache.org/job/Phoenix-master-matrix/HBASE_PROFILE=2.0/ws/phoenix-core/src/main/antlr3>
ANTLR Parser Generator Version 3.5.2
Output file <https://builds.apache.org/job/Phoenix-master-matrix/HBASE_PROFILE=2.0/ws/phoenix-core/target/generated-sources/antlr3/org/apache/phoenix/parse/PhoenixSQLParser.java> does not exist: must build <https://builds.apache.org/job/Phoenix-master-matrix/HBASE_PROFILE=2.0/ws/phoenix-core/src/main/antlr3/PhoenixSQL.g>
PhoenixSQL.g
[INFO]
[INFO] --- maven-dependency-plugin:3.1.1:build-classpath (create-phoenix-generated-classpath) @ phoenix-core ---
[INFO] Wrote classpath file '<https://builds.apache.org/job/Phoenix-master-matrix/HBASE_PROFILE=2.0/ws/phoenix-core/target/cached_classpath.txt'.>
[INFO]
[INFO] --- maven-remote-resources-plugin:1.5:process (process-resource-bundles) @ phoenix-core ---
[INFO] artifact org.glassfish:javax.el: checking for updates from apache release
[INFO] artifact org.glassfish:javax.el: checking for updates from central
[INFO] artifact org.glassfish:javax.el: checking for updates from java.net.Releases
[INFO] artifact org.glassfish:javax.el: checking for updates from apache release
[INFO] artifact org.glassfish:javax.el: checking for updates from central
[INFO] artifact org.glassfish:javax.el: checking for updates from java.net.Releases
[INFO]
[INFO] --- maven-resources-plugin:3.1.0:resources (default-resources) @ phoenix-core ---
[INFO] Using 'UTF-8' encoding to copy filtered resources.
[INFO] Copying 3 resources
[INFO] Copying 3 resources
[INFO]
[INFO] --- maven-compiler-plugin:3.7.0:compile (default-compile) @ phoenix-core ---
[INFO] Changes detected - recompiling the module!
[INFO] Compiling 1167 source files to <https://builds.apache.org/job/Phoenix-master-matrix/HBASE_PROFILE=2.0/ws/phoenix-core/target/classes>
[WARNING] <https://builds.apache.org/job/Phoenix-master-matrix/HBASE_PROFILE=2.0/ws/phoenix-core/src/main/java/org/apache/phoenix/coprocessor/IndexRebuildRegionScanner.java>:[42,52] com.sun.org.apache.xpath.internal.operations.Bool is internal proprietary API and may be removed in a future release
[WARNING] <https://builds.apache.org/job/Phoenix-master-matrix/HBASE_PROFILE=2.0/ws/phoenix-core/src/main/java/org/apache/phoenix/execute/DescVarLengthFastByteComparisons.java>:[25,16] sun.misc.Unsafe is internal proprietary API and may be removed in a future release
[WARNING] <https://builds.apache.org/job/Phoenix-master-matrix/HBASE_PROFILE=2.0/ws/phoenix-core/src/main/java/org/apache/phoenix/execute/DescVarLengthFastByteComparisons.java>:[116,26] sun.misc.Unsafe is internal proprietary API and may be removed in a future release
[WARNING] <https://builds.apache.org/job/Phoenix-master-matrix/HBASE_PROFILE=2.0/ws/phoenix-core/src/main/java/org/apache/phoenix/execute/DescVarLengthFastByteComparisons.java>:[122,30] sun.misc.Unsafe is internal proprietary API and may be removed in a future release
[WARNING] <https://builds.apache.org/job/Phoenix-master-matrix/HBASE_PROFILE=2.0/ws/phoenix-core/src/main/java/org/apache/phoenix/execute/DescVarLengthFastByteComparisons.java>:[126,39] sun.misc.Unsafe is internal proprietary API and may be removed in a future release
[INFO] <https://builds.apache.org/job/Phoenix-master-matrix/HBASE_PROFILE=2.0/ws/phoenix-core/src/main/java/org/apache/phoenix/expression/BaseExpression.java>: Some input files use or override a deprecated API.
[INFO] <https://builds.apache.org/job/Phoenix-master-matrix/HBASE_PROFILE=2.0/ws/phoenix-core/src/main/java/org/apache/phoenix/expression/BaseExpression.java>: Recompile with -Xlint:deprecation for details.
[INFO] <https://builds.apache.org/job/Phoenix-master-matrix/HBASE_PROFILE=2.0/ws/phoenix-core/src/main/java/org/apache/phoenix/jdbc/PhoenixStatement.java>: Some input files use unchecked or unsafe operations.
[INFO] <https://builds.apache.org/job/Phoenix-master-matrix/HBASE_PROFILE=2.0/ws/phoenix-core/src/main/java/org/apache/phoenix/jdbc/PhoenixStatement.java>: Recompile with -Xlint:unchecked for details.
[INFO]
[INFO] --- maven-dependency-plugin:3.1.1:build-classpath (create-mrapp-generated-classpath) @ phoenix-core ---
[INFO] Wrote classpath file '<https://builds.apache.org/job/Phoenix-master-matrix/HBASE_PROFILE=2.0/ws/phoenix-core/target/classes/mrapp-generated-classpath'.>
[INFO]
[INFO] --- maven-resources-plugin:3.1.0:testResources (default-testResources) @ phoenix-core ---
[INFO] Using 'UTF-8' encoding to copy filtered resources.
[INFO] Copying 5 resources
[INFO] Copying 12 resources
[INFO] Copying 3 resources
[INFO]
[INFO] --- maven-compiler-plugin:3.7.0:testCompile (default-testCompile) @ phoenix-core ---
[INFO] Changes detected - recompiling the module!
[INFO] Compiling 613 source files to <https://builds.apache.org/job/Phoenix-master-matrix/HBASE_PROFILE=2.0/ws/phoenix-core/target/test-classes>
[INFO] <https://builds.apache.org/job/Phoenix-master-matrix/HBASE_PROFILE=2.0/ws/phoenix-core/src/test/java/org/apache/phoenix/query/BaseTest.java>: Some input files use or override a deprecated API.
[INFO] <https://builds.apache.org/job/Phoenix-master-matrix/HBASE_PROFILE=2.0/ws/phoenix-core/src/test/java/org/apache/phoenix/query/BaseTest.java>: Recompile with -Xlint:deprecation for details.
[INFO] <https://builds.apache.org/job/Phoenix-master-matrix/HBASE_PROFILE=2.0/ws/phoenix-core/src/test/java/org/apache/phoenix/query/BaseTest.java>: Some input files use unchecked or unsafe operations.
[INFO] <https://builds.apache.org/job/Phoenix-master-matrix/HBASE_PROFILE=2.0/ws/phoenix-core/src/test/java/org/apache/phoenix/query/BaseTest.java>: Recompile with -Xlint:unchecked for details.
[INFO] -------------------------------------------------------------
[ERROR] COMPILATION ERROR :
[INFO] -------------------------------------------------------------
[ERROR] <https://builds.apache.org/job/Phoenix-master-matrix/HBASE_PROFILE=2.0/ws/phoenix-core/src/it/java/org/apache/phoenix/end2end/BasePermissionsIT.java>:[39,47] cannot find symbol
symbol: class GetUserPermissionsRequest
location: package org.apache.hadoop.hbase.security.access
[ERROR] <https://builds.apache.org/job/Phoenix-master-matrix/HBASE_PROFILE=2.0/ws/phoenix-core/src/it/java/org/apache/phoenix/end2end/BasePermissionsIT.java>:[1452,48] cannot find symbol
symbol: method hasUserName()
location: variable request of type org.apache.hadoop.hbase.protobuf.generated.AccessControlProtos.GetUserPermissionsRequest
[ERROR] <https://builds.apache.org/job/Phoenix-master-matrix/HBASE_PROFILE=2.0/ws/phoenix-core/src/it/java/org/apache/phoenix/end2end/BasePermissionsIT.java>:[1452,72] cannot find symbol
symbol: method getUserName()
location: variable request of type org.apache.hadoop.hbase.protobuf.generated.AccessControlProtos.GetUserPermissionsRequest
[ERROR] <https://builds.apache.org/job/Phoenix-master-matrix/HBASE_PROFILE=2.0/ws/phoenix-core/src/it/java/org/apache/phoenix/end2end/BasePermissionsIT.java>:[1458,32] cannot find symbol
symbol: method hasColumnFamily()
location: variable request of type org.apache.hadoop.hbase.protobuf.generated.AccessControlProtos.GetUserPermissionsRequest
[ERROR] <https://builds.apache.org/job/Phoenix-master-matrix/HBASE_PROFILE=2.0/ws/phoenix-core/src/it/java/org/apache/phoenix/end2end/BasePermissionsIT.java>:[1458,60] cannot find symbol
symbol: method getColumnFamily()
location: variable request of type org.apache.hadoop.hbase.protobuf.generated.AccessControlProtos.GetUserPermissionsRequest
[ERROR] <https://builds.apache.org/job/Phoenix-master-matrix/HBASE_PROFILE=2.0/ws/phoenix-core/src/it/java/org/apache/phoenix/end2end/BasePermissionsIT.java>:[1460,32] cannot find symbol
symbol: method hasColumnQualifier()
location: variable request of type org.apache.hadoop.hbase.protobuf.generated.AccessControlProtos.GetUserPermissionsRequest
[ERROR] <https://builds.apache.org/job/Phoenix-master-matrix/HBASE_PROFILE=2.0/ws/phoenix-core/src/it/java/org/apache/phoenix/end2end/BasePermissionsIT.java>:[1460,63] cannot find symbol
symbol: method getColumnQualifier()
location: variable request of type org.apache.hadoop.hbase.protobuf.generated.AccessControlProtos.GetUserPermissionsRequest
[ERROR] <https://builds.apache.org/job/Phoenix-master-matrix/HBASE_PROFILE=2.0/ws/phoenix-core/src/it/java/org/apache/phoenix/end2end/BasePermissionsIT.java>:[1461,17] cannot find symbol
symbol: class GetUserPermissionsRequest
location: class org.apache.phoenix.end2end.BasePermissionsIT.CustomAccessController
[ERROR] <https://builds.apache.org/job/Phoenix-master-matrix/HBASE_PROFILE=2.0/ws/phoenix-core/src/it/java/org/apache/phoenix/end2end/BasePermissionsIT.java>:[1463,49] cannot find symbol
symbol: variable GetUserPermissionsRequest
location: class org.apache.phoenix.end2end.BasePermissionsIT.CustomAccessController
[ERROR] <https://builds.apache.org/job/Phoenix-master-matrix/HBASE_PROFILE=2.0/ws/phoenix-core/src/it/java/org/apache/phoenix/end2end/BasePermissionsIT.java>:[1467,29] cannot find symbol
symbol: variable GetUserPermissionsRequest
location: class org.apache.phoenix.end2end.BasePermissionsIT.CustomAccessController
[ERROR] <https://builds.apache.org/job/Phoenix-master-matrix/HBASE_PROFILE=2.0/ws/phoenix-core/src/it/java/org/apache/phoenix/end2end/BasePermissionsIT.java>:[1470,29] cannot find symbol
symbol: variable GetUserPermissionsRequest
location: class org.apache.phoenix.end2end.BasePermissionsIT.CustomAccessController
[INFO] 11 errors
[INFO] -------------------------------------------------------------
[INFO] ------------------------------------------------------------------------
[INFO] Reactor Summary for Apache Phoenix 5.1.0-SNAPSHOT:
[INFO]
[INFO] Phoenix Hbase 2.2.1 compatibility .................. SUCCESS [ 14.471 s]
[INFO] Phoenix Hbase 2.1.6 compatibility .................. SUCCESS [ 3.098 s]
[INFO] Phoenix Hbase 2.0.1 compatibility .................. SUCCESS [ 3.554 s]
[INFO] Apache Phoenix ..................................... SUCCESS [ 2.114 s]
[INFO] Phoenix Core ....................................... FAILURE [ 51.803 s]
[INFO] Phoenix - Pherf .................................... SKIPPED
[INFO] Phoenix Client ..................................... SKIPPED
[INFO] Phoenix Server ..................................... SKIPPED
[INFO] Phoenix - Tracing Web Application .................. SKIPPED
[INFO] Phoenix Assembly ................................... SKIPPED
[INFO] ------------------------------------------------------------------------
[INFO] BUILD FAILURE
[INFO] ------------------------------------------------------------------------
[INFO] Total time: 01:16 min
[INFO] Finished at: 2020-06-09T16:31:31Z
[INFO] ------------------------------------------------------------------------
[ERROR] Failed to execute goal org.apache.maven.plugins:maven-compiler-plugin:3.7.0:testCompile (default-testCompile) on project phoenix-core: Compilation failure: Compilation failure:
[ERROR] <https://builds.apache.org/job/Phoenix-master-matrix/HBASE_PROFILE=2.0/ws/phoenix-core/src/it/java/org/apache/phoenix/end2end/BasePermissionsIT.java>:[39,47] cannot find symbol
[ERROR] symbol: class GetUserPermissionsRequest
[ERROR] location: package org.apache.hadoop.hbase.security.access
[ERROR] <https://builds.apache.org/job/Phoenix-master-matrix/HBASE_PROFILE=2.0/ws/phoenix-core/src/it/java/org/apache/phoenix/end2end/BasePermissionsIT.java>:[1452,48] cannot find symbol
[ERROR] symbol: method hasUserName()
[ERROR] location: variable request of type org.apache.hadoop.hbase.protobuf.generated.AccessControlProtos.GetUserPermissionsRequest
[ERROR] <https://builds.apache.org/job/Phoenix-master-matrix/HBASE_PROFILE=2.0/ws/phoenix-core/src/it/java/org/apache/phoenix/end2end/BasePermissionsIT.java>:[1452,72] cannot find symbol
[ERROR] symbol: method getUserName()
[ERROR] location: variable request of type org.apache.hadoop.hbase.protobuf.generated.AccessControlProtos.GetUserPermissionsRequest
[ERROR] <https://builds.apache.org/job/Phoenix-master-matrix/HBASE_PROFILE=2.0/ws/phoenix-core/src/it/java/org/apache/phoenix/end2end/BasePermissionsIT.java>:[1458,32] cannot find symbol
[ERROR] symbol: method hasColumnFamily()
[ERROR] location: variable request of type org.apache.hadoop.hbase.protobuf.generated.AccessControlProtos.GetUserPermissionsRequest
[ERROR] <https://builds.apache.org/job/Phoenix-master-matrix/HBASE_PROFILE=2.0/ws/phoenix-core/src/it/java/org/apache/phoenix/end2end/BasePermissionsIT.java>:[1458,60] cannot find symbol
[ERROR] symbol: method getColumnFamily()
[ERROR] location: variable request of type org.apache.hadoop.hbase.protobuf.generated.AccessControlProtos.GetUserPermissionsRequest
[ERROR] <https://builds.apache.org/job/Phoenix-master-matrix/HBASE_PROFILE=2.0/ws/phoenix-core/src/it/java/org/apache/phoenix/end2end/BasePermissionsIT.java>:[1460,32] cannot find symbol
[ERROR] symbol: method hasColumnQualifier()
[ERROR] location: variable request of type org.apache.hadoop.hbase.protobuf.generated.AccessControlProtos.GetUserPermissionsRequest
[ERROR] <https://builds.apache.org/job/Phoenix-master-matrix/HBASE_PROFILE=2.0/ws/phoenix-core/src/it/java/org/apache/phoenix/end2end/BasePermissionsIT.java>:[1460,63] cannot find symbol
[ERROR] symbol: method getColumnQualifier()
[ERROR] location: variable request of type org.apache.hadoop.hbase.protobuf.generated.AccessControlProtos.GetUserPermissionsRequest
[ERROR] <https://builds.apache.org/job/Phoenix-master-matrix/HBASE_PROFILE=2.0/ws/phoenix-core/src/it/java/org/apache/phoenix/end2end/BasePermissionsIT.java>:[1461,17] cannot find symbol
[ERROR] symbol: class GetUserPermissionsRequest
[ERROR] location: class org.apache.phoenix.end2end.BasePermissionsIT.CustomAccessController
[ERROR] <https://builds.apache.org/job/Phoenix-master-matrix/HBASE_PROFILE=2.0/ws/phoenix-core/src/it/java/org/apache/phoenix/end2end/BasePermissionsIT.java>:[1463,49] cannot find symbol
[ERROR] symbol: variable GetUserPermissionsRequest
[ERROR] location: class org.apache.phoenix.end2end.BasePermissionsIT.CustomAccessController
[ERROR] <https://builds.apache.org/job/Phoenix-master-matrix/HBASE_PROFILE=2.0/ws/phoenix-core/src/it/java/org/apache/phoenix/end2end/BasePermissionsIT.java>:[1467,29] cannot find symbol
[ERROR] symbol: variable GetUserPermissionsRequest
[ERROR] location: class org.apache.phoenix.end2end.BasePermissionsIT.CustomAccessController
[ERROR] <https://builds.apache.org/job/Phoenix-master-matrix/HBASE_PROFILE=2.0/ws/phoenix-core/src/it/java/org/apache/phoenix/end2end/BasePermissionsIT.java>:[1470,29] cannot find symbol
[ERROR] symbol: variable GetUserPermissionsRequest
[ERROR] location: class org.apache.phoenix.end2end.BasePermissionsIT.CustomAccessController
[ERROR] -> [Help 1]
[ERROR]
[ERROR] To see the full stack trace of the errors, re-run Maven with the -e switch.
[ERROR] Re-run Maven using the -X switch to enable full debug logging.
[ERROR]
[ERROR] For more information about the errors and possible solutions, please read the following articles:
[ERROR] [Help 1] http://cwiki.apache.org/confluence/display/MAVEN/MojoFailureException
[ERROR]
[ERROR] After correcting the problems, you can resume the build with the command
[ERROR] mvn <args> -rf :phoenix-core
Build step 'Invoke top-level Maven targets' marked build as failure
Archiving artifacts
Recording test results
ERROR: Step ?Publish JUnit test result report? failed: No test report files were found. Configuration error?
Not sending mail to unregistered user giskender@salesforce.com
Not sending mail to unregistered user Rajeshbabu Chintaguntla
Not sending mail to unregistered user noreply@github.com
Not sending mail to unregistered user abhishek.chouhan@salesforce.com
Not sending mail to unregistered user s.kadam@salesforce.com
Build failed in Jenkins: Phoenix | Master | HBase Profile » 2.0 #88
Posted by Apache Jenkins Server <je...@builds.apache.org>.
See <https://builds.apache.org/job/Phoenix-master-matrix/HBASE_PROFILE=2.0/88/display/redirect?page=changes>
Changes:
[s.kadam] PHOENIX-5876 Let indexTool running with ONLY option not change index
------------------------------------------
[...truncated 25.75 KB...]
[INFO] --- maven-compiler-plugin:3.7.0:compile (default-compile) @ phoenix-hbase-compat-2.0.1 ---
[INFO] Changes detected - recompiling the module!
[INFO] Compiling 5 source files to <https://builds.apache.org/job/Phoenix-master-matrix/HBASE_PROFILE=2.0/ws/phoenix-hbase-compat-2.0.1/target/classes>
[INFO] <https://builds.apache.org/job/Phoenix-master-matrix/HBASE_PROFILE=2.0/ws/phoenix-hbase-compat-2.0.1/src/main/java/org/apache/phoenix/compat/hbase/OffsetCell.java>: Some input files use or override a deprecated API.
[INFO] <https://builds.apache.org/job/Phoenix-master-matrix/HBASE_PROFILE=2.0/ws/phoenix-hbase-compat-2.0.1/src/main/java/org/apache/phoenix/compat/hbase/OffsetCell.java>: Recompile with -Xlint:deprecation for details.
[INFO]
[INFO] --- maven-resources-plugin:3.1.0:testResources (default-testResources) @ phoenix-hbase-compat-2.0.1 ---
[INFO] Using 'UTF-8' encoding to copy filtered resources.
[INFO] skip non existing resourceDirectory <https://builds.apache.org/job/Phoenix-master-matrix/HBASE_PROFILE=2.0/ws/phoenix-hbase-compat-2.0.1/src/test/resources>
[INFO] Copying 3 resources
[INFO]
[INFO] --- maven-compiler-plugin:3.7.0:testCompile (default-testCompile) @ phoenix-hbase-compat-2.0.1 ---
[INFO] No sources to compile
[INFO]
[INFO] --- maven-surefire-plugin:2.22.0:test (default-test) @ phoenix-hbase-compat-2.0.1 ---
[INFO]
[INFO] --- maven-jar-plugin:3.1.0:jar (default-jar) @ phoenix-hbase-compat-2.0.1 ---
[INFO] Building jar: <https://builds.apache.org/job/Phoenix-master-matrix/HBASE_PROFILE=2.0/ws/phoenix-hbase-compat-2.0.1/target/phoenix-hbase-compat-2.0.1-5.1.0-SNAPSHOT.jar>
[INFO]
[INFO] --- maven-site-plugin:3.7.1:attach-descriptor (attach-descriptor) @ phoenix-hbase-compat-2.0.1 ---
[INFO] Skipping because packaging 'jar' is not pom.
[INFO]
[INFO] --- maven-install-plugin:2.5.2:install (default-install) @ phoenix-hbase-compat-2.0.1 ---
[INFO] Installing <https://builds.apache.org/job/Phoenix-master-matrix/HBASE_PROFILE=2.0/ws/phoenix-hbase-compat-2.0.1/target/phoenix-hbase-compat-2.0.1-5.1.0-SNAPSHOT.jar> to /home/jenkins/.m2/repository/org/apache/phoenix/phoenix-hbase-compat-2.0.1/5.1.0-SNAPSHOT/phoenix-hbase-compat-2.0.1-5.1.0-SNAPSHOT.jar
[INFO] Installing <https://builds.apache.org/job/Phoenix-master-matrix/HBASE_PROFILE=2.0/ws/phoenix-hbase-compat-2.0.1/pom.xml> to /home/jenkins/.m2/repository/org/apache/phoenix/phoenix-hbase-compat-2.0.1/5.1.0-SNAPSHOT/phoenix-hbase-compat-2.0.1-5.1.0-SNAPSHOT.pom
[INFO]
[INFO] ---------------------< org.apache.phoenix:phoenix >---------------------
[INFO] Building Apache Phoenix 5.1.0-SNAPSHOT [4/10]
[INFO] --------------------------------[ pom ]---------------------------------
[INFO]
[INFO] --- maven-clean-plugin:3.1.0:clean (default-clean) @ phoenix ---
[INFO] Deleting <https://builds.apache.org/job/Phoenix-master-matrix/HBASE_PROFILE=2.0/ws/target>
[INFO]
[INFO] --- maven-enforcer-plugin:3.0.0-M3:enforce (enforce-maven-version) @ phoenix ---
[INFO]
[INFO] --- maven-enforcer-plugin:3.0.0-M3:enforce (check-hbase-compatibility) @ phoenix ---
[INFO]
[INFO] --- maven-checkstyle-plugin:3.1.0:check (validate) @ phoenix ---
[INFO]
[INFO] --- jacoco-maven-plugin:0.7.9:prepare-agent (prepare-agent) @ phoenix ---
[INFO] jacocoArgLine set to -javaagent:/home/jenkins/.m2/repository/org/jacoco/org.jacoco.agent/0.7.9/org.jacoco.agent-0.7.9-runtime.jar=destfile=<https://builds.apache.org/job/Phoenix-master-matrix/HBASE_PROFILE=2.0/ws/target/jacoco.exec>
[INFO]
[INFO] --- maven-remote-resources-plugin:1.5:process (process-resource-bundles) @ phoenix ---
[INFO]
[INFO] --- maven-source-plugin:3.0.1:jar-no-fork (attach-sources) @ phoenix ---
[INFO]
[INFO] --- maven-jar-plugin:3.1.0:test-jar (default) @ phoenix ---
[WARNING] JAR will be empty - no content was marked for inclusion!
[INFO] Building jar: <https://builds.apache.org/job/Phoenix-master-matrix/HBASE_PROFILE=2.0/ws/target/phoenix-5.1.0-SNAPSHOT-tests.jar>
[INFO]
[INFO] --- maven-site-plugin:3.7.1:attach-descriptor (attach-descriptor) @ phoenix ---
[INFO] No site descriptor found: nothing to attach.
[INFO]
[INFO] --- jacoco-maven-plugin:0.7.9:report (report) @ phoenix ---
[INFO] Skipping JaCoCo execution due to missing execution data file.
[INFO]
[INFO] --- jacoco-maven-plugin:0.7.9:check (check) @ phoenix ---
[INFO] Skipping JaCoCo execution due to missing execution data <https://builds.apache.org/job/Phoenix-master-matrix/HBASE_PROFILE=2.0/ws/target/jacoco.exec>
[INFO]
[INFO] --- maven-install-plugin:2.5.2:install (default-install) @ phoenix ---
[INFO] Installing <https://builds.apache.org/job/Phoenix-master-matrix/HBASE_PROFILE=2.0/ws/pom.xml> to /home/jenkins/.m2/repository/org/apache/phoenix/phoenix/5.1.0-SNAPSHOT/phoenix-5.1.0-SNAPSHOT.pom
[INFO] Installing <https://builds.apache.org/job/Phoenix-master-matrix/HBASE_PROFILE=2.0/ws/target/phoenix-5.1.0-SNAPSHOT-tests.jar> to /home/jenkins/.m2/repository/org/apache/phoenix/phoenix/5.1.0-SNAPSHOT/phoenix-5.1.0-SNAPSHOT-tests.jar
[INFO]
[INFO] ------------------< org.apache.phoenix:phoenix-core >-------------------
[INFO] Building Phoenix Core 5.1.0-SNAPSHOT [5/10]
[INFO] --------------------------------[ jar ]---------------------------------
Downloading from apache release: https://repository.apache.org/content/repositories/releases/org/glassfish/javax.el/maven-metadata.xml
[INFO]
[INFO] --- maven-clean-plugin:3.1.0:clean (default-clean) @ phoenix-core ---
[INFO] Deleting <https://builds.apache.org/job/Phoenix-master-matrix/HBASE_PROFILE=2.0/ws/phoenix-core/target>
[INFO]
[INFO] --- maven-enforcer-plugin:3.0.0-M3:enforce (enforce-maven-version) @ phoenix-core ---
[INFO]
[INFO] --- maven-enforcer-plugin:3.0.0-M3:enforce (check-hbase-compatibility) @ phoenix-core ---
[INFO]
[INFO] --- maven-checkstyle-plugin:3.1.0:check (validate) @ phoenix-core ---
[INFO]
[INFO] --- build-helper-maven-plugin:1.9.1:add-test-source (add-test-source) @ phoenix-core ---
[INFO] Test Source directory: <https://builds.apache.org/job/Phoenix-master-matrix/HBASE_PROFILE=2.0/ws/phoenix-core/src/it/java> added.
[INFO]
[INFO] --- build-helper-maven-plugin:1.9.1:add-test-resource (add-test-resource) @ phoenix-core ---
[INFO]
[INFO] --- jacoco-maven-plugin:0.7.9:prepare-agent (prepare-agent) @ phoenix-core ---
[INFO] jacocoArgLine set to -javaagent:/home/jenkins/.m2/repository/org/jacoco/org.jacoco.agent/0.7.9/org.jacoco.agent-0.7.9-runtime.jar=destfile=<https://builds.apache.org/job/Phoenix-master-matrix/HBASE_PROFILE=2.0/ws/phoenix-core/target/jacoco.exec>
[INFO]
[INFO] --- build-helper-maven-plugin:1.9.1:add-source (add-source) @ phoenix-core ---
[INFO] Source directory: <https://builds.apache.org/job/Phoenix-master-matrix/HBASE_PROFILE=2.0/ws/phoenix-core/target/generated-sources/antlr3> added.
[INFO] Source directory: <https://builds.apache.org/job/Phoenix-master-matrix/HBASE_PROFILE=2.0/ws/phoenix-core/src/main/antlr3> added.
[INFO]
[INFO] --- antlr3-maven-plugin:3.5.2:antlr (default) @ phoenix-core ---
[INFO] ANTLR: Processing source directory <https://builds.apache.org/job/Phoenix-master-matrix/HBASE_PROFILE=2.0/ws/phoenix-core/src/main/antlr3>
ANTLR Parser Generator Version 3.5.2
Output file <https://builds.apache.org/job/Phoenix-master-matrix/HBASE_PROFILE=2.0/ws/phoenix-core/target/generated-sources/antlr3/org/apache/phoenix/parse/PhoenixSQLParser.java> does not exist: must build <https://builds.apache.org/job/Phoenix-master-matrix/HBASE_PROFILE=2.0/ws/phoenix-core/src/main/antlr3/PhoenixSQL.g>
PhoenixSQL.g
[INFO]
[INFO] --- maven-dependency-plugin:3.1.1:build-classpath (create-phoenix-generated-classpath) @ phoenix-core ---
[INFO] Wrote classpath file '<https://builds.apache.org/job/Phoenix-master-matrix/HBASE_PROFILE=2.0/ws/phoenix-core/target/cached_classpath.txt'.>
[INFO]
[INFO] --- maven-remote-resources-plugin:1.5:process (process-resource-bundles) @ phoenix-core ---
[INFO] artifact org.glassfish:javax.el: checking for updates from apache release
[INFO] artifact org.glassfish:javax.el: checking for updates from central
[INFO] artifact org.glassfish:javax.el: checking for updates from java.net.Releases
[INFO] artifact org.glassfish:javax.el: checking for updates from apache release
[INFO] artifact org.glassfish:javax.el: checking for updates from central
[INFO] artifact org.glassfish:javax.el: checking for updates from java.net.Releases
[INFO]
[INFO] --- maven-resources-plugin:3.1.0:resources (default-resources) @ phoenix-core ---
[INFO] Using 'UTF-8' encoding to copy filtered resources.
[INFO] Copying 3 resources
[INFO] Copying 3 resources
[INFO]
[INFO] --- maven-compiler-plugin:3.7.0:compile (default-compile) @ phoenix-core ---
[INFO] Changes detected - recompiling the module!
[INFO] Compiling 1167 source files to <https://builds.apache.org/job/Phoenix-master-matrix/HBASE_PROFILE=2.0/ws/phoenix-core/target/classes>
[WARNING] <https://builds.apache.org/job/Phoenix-master-matrix/HBASE_PROFILE=2.0/ws/phoenix-core/src/main/java/org/apache/phoenix/execute/DescVarLengthFastByteComparisons.java>:[25,16] sun.misc.Unsafe is internal proprietary API and may be removed in a future release
[WARNING] <https://builds.apache.org/job/Phoenix-master-matrix/HBASE_PROFILE=2.0/ws/phoenix-core/src/main/java/org/apache/phoenix/execute/DescVarLengthFastByteComparisons.java>:[116,26] sun.misc.Unsafe is internal proprietary API and may be removed in a future release
[WARNING] <https://builds.apache.org/job/Phoenix-master-matrix/HBASE_PROFILE=2.0/ws/phoenix-core/src/main/java/org/apache/phoenix/execute/DescVarLengthFastByteComparisons.java>:[122,30] sun.misc.Unsafe is internal proprietary API and may be removed in a future release
[WARNING] <https://builds.apache.org/job/Phoenix-master-matrix/HBASE_PROFILE=2.0/ws/phoenix-core/src/main/java/org/apache/phoenix/execute/DescVarLengthFastByteComparisons.java>:[126,39] sun.misc.Unsafe is internal proprietary API and may be removed in a future release
[INFO] <https://builds.apache.org/job/Phoenix-master-matrix/HBASE_PROFILE=2.0/ws/phoenix-core/src/main/java/org/apache/phoenix/expression/BaseExpression.java>: Some input files use or override a deprecated API.
[INFO] <https://builds.apache.org/job/Phoenix-master-matrix/HBASE_PROFILE=2.0/ws/phoenix-core/src/main/java/org/apache/phoenix/expression/BaseExpression.java>: Recompile with -Xlint:deprecation for details.
[INFO] <https://builds.apache.org/job/Phoenix-master-matrix/HBASE_PROFILE=2.0/ws/phoenix-core/src/main/java/org/apache/phoenix/jdbc/PhoenixStatement.java>: Some input files use unchecked or unsafe operations.
[INFO] <https://builds.apache.org/job/Phoenix-master-matrix/HBASE_PROFILE=2.0/ws/phoenix-core/src/main/java/org/apache/phoenix/jdbc/PhoenixStatement.java>: Recompile with -Xlint:unchecked for details.
[INFO]
[INFO] --- maven-dependency-plugin:3.1.1:build-classpath (create-mrapp-generated-classpath) @ phoenix-core ---
[INFO] Wrote classpath file '<https://builds.apache.org/job/Phoenix-master-matrix/HBASE_PROFILE=2.0/ws/phoenix-core/target/classes/mrapp-generated-classpath'.>
[INFO]
[INFO] --- maven-resources-plugin:3.1.0:testResources (default-testResources) @ phoenix-core ---
[INFO] Using 'UTF-8' encoding to copy filtered resources.
[INFO] Copying 5 resources
[INFO] Copying 12 resources
[INFO] Copying 3 resources
[INFO]
[INFO] --- maven-compiler-plugin:3.7.0:testCompile (default-testCompile) @ phoenix-core ---
[INFO] Changes detected - recompiling the module!
[INFO] Compiling 612 source files to <https://builds.apache.org/job/Phoenix-master-matrix/HBASE_PROFILE=2.0/ws/phoenix-core/target/test-classes>
[INFO] <https://builds.apache.org/job/Phoenix-master-matrix/HBASE_PROFILE=2.0/ws/phoenix-core/src/test/java/org/apache/phoenix/query/BaseTest.java>: Some input files use or override a deprecated API.
[INFO] <https://builds.apache.org/job/Phoenix-master-matrix/HBASE_PROFILE=2.0/ws/phoenix-core/src/test/java/org/apache/phoenix/query/BaseTest.java>: Recompile with -Xlint:deprecation for details.
[INFO] <https://builds.apache.org/job/Phoenix-master-matrix/HBASE_PROFILE=2.0/ws/phoenix-core/src/test/java/org/apache/phoenix/query/BaseTest.java>: Some input files use unchecked or unsafe operations.
[INFO] <https://builds.apache.org/job/Phoenix-master-matrix/HBASE_PROFILE=2.0/ws/phoenix-core/src/test/java/org/apache/phoenix/query/BaseTest.java>: Recompile with -Xlint:unchecked for details.
[INFO] -------------------------------------------------------------
[ERROR] COMPILATION ERROR :
[INFO] -------------------------------------------------------------
[ERROR] <https://builds.apache.org/job/Phoenix-master-matrix/HBASE_PROFILE=2.0/ws/phoenix-core/src/it/java/org/apache/phoenix/end2end/BasePermissionsIT.java>:[39,47] cannot find symbol
symbol: class GetUserPermissionsRequest
location: package org.apache.hadoop.hbase.security.access
[ERROR] <https://builds.apache.org/job/Phoenix-master-matrix/HBASE_PROFILE=2.0/ws/phoenix-core/src/it/java/org/apache/phoenix/end2end/BasePermissionsIT.java>:[1452,48] cannot find symbol
symbol: method hasUserName()
location: variable request of type org.apache.hadoop.hbase.protobuf.generated.AccessControlProtos.GetUserPermissionsRequest
[ERROR] <https://builds.apache.org/job/Phoenix-master-matrix/HBASE_PROFILE=2.0/ws/phoenix-core/src/it/java/org/apache/phoenix/end2end/BasePermissionsIT.java>:[1452,72] cannot find symbol
symbol: method getUserName()
location: variable request of type org.apache.hadoop.hbase.protobuf.generated.AccessControlProtos.GetUserPermissionsRequest
[ERROR] <https://builds.apache.org/job/Phoenix-master-matrix/HBASE_PROFILE=2.0/ws/phoenix-core/src/it/java/org/apache/phoenix/end2end/BasePermissionsIT.java>:[1458,32] cannot find symbol
symbol: method hasColumnFamily()
location: variable request of type org.apache.hadoop.hbase.protobuf.generated.AccessControlProtos.GetUserPermissionsRequest
[ERROR] <https://builds.apache.org/job/Phoenix-master-matrix/HBASE_PROFILE=2.0/ws/phoenix-core/src/it/java/org/apache/phoenix/end2end/BasePermissionsIT.java>:[1458,60] cannot find symbol
symbol: method getColumnFamily()
location: variable request of type org.apache.hadoop.hbase.protobuf.generated.AccessControlProtos.GetUserPermissionsRequest
[ERROR] <https://builds.apache.org/job/Phoenix-master-matrix/HBASE_PROFILE=2.0/ws/phoenix-core/src/it/java/org/apache/phoenix/end2end/BasePermissionsIT.java>:[1460,32] cannot find symbol
symbol: method hasColumnQualifier()
location: variable request of type org.apache.hadoop.hbase.protobuf.generated.AccessControlProtos.GetUserPermissionsRequest
[ERROR] <https://builds.apache.org/job/Phoenix-master-matrix/HBASE_PROFILE=2.0/ws/phoenix-core/src/it/java/org/apache/phoenix/end2end/BasePermissionsIT.java>:[1460,63] cannot find symbol
symbol: method getColumnQualifier()
location: variable request of type org.apache.hadoop.hbase.protobuf.generated.AccessControlProtos.GetUserPermissionsRequest
[ERROR] <https://builds.apache.org/job/Phoenix-master-matrix/HBASE_PROFILE=2.0/ws/phoenix-core/src/it/java/org/apache/phoenix/end2end/BasePermissionsIT.java>:[1461,17] cannot find symbol
symbol: class GetUserPermissionsRequest
location: class org.apache.phoenix.end2end.BasePermissionsIT.CustomAccessController
[ERROR] <https://builds.apache.org/job/Phoenix-master-matrix/HBASE_PROFILE=2.0/ws/phoenix-core/src/it/java/org/apache/phoenix/end2end/BasePermissionsIT.java>:[1463,49] cannot find symbol
symbol: variable GetUserPermissionsRequest
location: class org.apache.phoenix.end2end.BasePermissionsIT.CustomAccessController
[ERROR] <https://builds.apache.org/job/Phoenix-master-matrix/HBASE_PROFILE=2.0/ws/phoenix-core/src/it/java/org/apache/phoenix/end2end/BasePermissionsIT.java>:[1467,29] cannot find symbol
symbol: variable GetUserPermissionsRequest
location: class org.apache.phoenix.end2end.BasePermissionsIT.CustomAccessController
[ERROR] <https://builds.apache.org/job/Phoenix-master-matrix/HBASE_PROFILE=2.0/ws/phoenix-core/src/it/java/org/apache/phoenix/end2end/BasePermissionsIT.java>:[1470,29] cannot find symbol
symbol: variable GetUserPermissionsRequest
location: class org.apache.phoenix.end2end.BasePermissionsIT.CustomAccessController
[INFO] 11 errors
[INFO] -------------------------------------------------------------
[INFO] ------------------------------------------------------------------------
[INFO] Reactor Summary for Apache Phoenix 5.1.0-SNAPSHOT:
[INFO]
[INFO] Phoenix Hbase 2.2.1 compatibility .................. SUCCESS [ 14.614 s]
[INFO] Phoenix Hbase 2.1.6 compatibility .................. SUCCESS [ 2.853 s]
[INFO] Phoenix Hbase 2.0.1 compatibility .................. SUCCESS [ 4.349 s]
[INFO] Apache Phoenix ..................................... SUCCESS [ 2.771 s]
[INFO] Phoenix Core ....................................... FAILURE [ 51.772 s]
[INFO] Phoenix - Pherf .................................... SKIPPED
[INFO] Phoenix Client ..................................... SKIPPED
[INFO] Phoenix Server ..................................... SKIPPED
[INFO] Phoenix - Tracing Web Application .................. SKIPPED
[INFO] Phoenix Assembly ................................... SKIPPED
[INFO] ------------------------------------------------------------------------
[INFO] BUILD FAILURE
[INFO] ------------------------------------------------------------------------
[INFO] Total time: 01:17 min
[INFO] Finished at: 2020-06-08T19:42:27Z
[INFO] ------------------------------------------------------------------------
[ERROR] Failed to execute goal org.apache.maven.plugins:maven-compiler-plugin:3.7.0:testCompile (default-testCompile) on project phoenix-core: Compilation failure: Compilation failure:
[ERROR] <https://builds.apache.org/job/Phoenix-master-matrix/HBASE_PROFILE=2.0/ws/phoenix-core/src/it/java/org/apache/phoenix/end2end/BasePermissionsIT.java>:[39,47] cannot find symbol
[ERROR] symbol: class GetUserPermissionsRequest
[ERROR] location: package org.apache.hadoop.hbase.security.access
[ERROR] <https://builds.apache.org/job/Phoenix-master-matrix/HBASE_PROFILE=2.0/ws/phoenix-core/src/it/java/org/apache/phoenix/end2end/BasePermissionsIT.java>:[1452,48] cannot find symbol
[ERROR] symbol: method hasUserName()
[ERROR] location: variable request of type org.apache.hadoop.hbase.protobuf.generated.AccessControlProtos.GetUserPermissionsRequest
[ERROR] <https://builds.apache.org/job/Phoenix-master-matrix/HBASE_PROFILE=2.0/ws/phoenix-core/src/it/java/org/apache/phoenix/end2end/BasePermissionsIT.java>:[1452,72] cannot find symbol
[ERROR] symbol: method getUserName()
[ERROR] location: variable request of type org.apache.hadoop.hbase.protobuf.generated.AccessControlProtos.GetUserPermissionsRequest
[ERROR] <https://builds.apache.org/job/Phoenix-master-matrix/HBASE_PROFILE=2.0/ws/phoenix-core/src/it/java/org/apache/phoenix/end2end/BasePermissionsIT.java>:[1458,32] cannot find symbol
[ERROR] symbol: method hasColumnFamily()
[ERROR] location: variable request of type org.apache.hadoop.hbase.protobuf.generated.AccessControlProtos.GetUserPermissionsRequest
[ERROR] <https://builds.apache.org/job/Phoenix-master-matrix/HBASE_PROFILE=2.0/ws/phoenix-core/src/it/java/org/apache/phoenix/end2end/BasePermissionsIT.java>:[1458,60] cannot find symbol
[ERROR] symbol: method getColumnFamily()
[ERROR] location: variable request of type org.apache.hadoop.hbase.protobuf.generated.AccessControlProtos.GetUserPermissionsRequest
[ERROR] <https://builds.apache.org/job/Phoenix-master-matrix/HBASE_PROFILE=2.0/ws/phoenix-core/src/it/java/org/apache/phoenix/end2end/BasePermissionsIT.java>:[1460,32] cannot find symbol
[ERROR] symbol: method hasColumnQualifier()
[ERROR] location: variable request of type org.apache.hadoop.hbase.protobuf.generated.AccessControlProtos.GetUserPermissionsRequest
[ERROR] <https://builds.apache.org/job/Phoenix-master-matrix/HBASE_PROFILE=2.0/ws/phoenix-core/src/it/java/org/apache/phoenix/end2end/BasePermissionsIT.java>:[1460,63] cannot find symbol
[ERROR] symbol: method getColumnQualifier()
[ERROR] location: variable request of type org.apache.hadoop.hbase.protobuf.generated.AccessControlProtos.GetUserPermissionsRequest
[ERROR] <https://builds.apache.org/job/Phoenix-master-matrix/HBASE_PROFILE=2.0/ws/phoenix-core/src/it/java/org/apache/phoenix/end2end/BasePermissionsIT.java>:[1461,17] cannot find symbol
[ERROR] symbol: class GetUserPermissionsRequest
[ERROR] location: class org.apache.phoenix.end2end.BasePermissionsIT.CustomAccessController
[ERROR] <https://builds.apache.org/job/Phoenix-master-matrix/HBASE_PROFILE=2.0/ws/phoenix-core/src/it/java/org/apache/phoenix/end2end/BasePermissionsIT.java>:[1463,49] cannot find symbol
[ERROR] symbol: variable GetUserPermissionsRequest
[ERROR] location: class org.apache.phoenix.end2end.BasePermissionsIT.CustomAccessController
[ERROR] <https://builds.apache.org/job/Phoenix-master-matrix/HBASE_PROFILE=2.0/ws/phoenix-core/src/it/java/org/apache/phoenix/end2end/BasePermissionsIT.java>:[1467,29] cannot find symbol
[ERROR] symbol: variable GetUserPermissionsRequest
[ERROR] location: class org.apache.phoenix.end2end.BasePermissionsIT.CustomAccessController
[ERROR] <https://builds.apache.org/job/Phoenix-master-matrix/HBASE_PROFILE=2.0/ws/phoenix-core/src/it/java/org/apache/phoenix/end2end/BasePermissionsIT.java>:[1470,29] cannot find symbol
[ERROR] symbol: variable GetUserPermissionsRequest
[ERROR] location: class org.apache.phoenix.end2end.BasePermissionsIT.CustomAccessController
[ERROR] -> [Help 1]
[ERROR]
[ERROR] To see the full stack trace of the errors, re-run Maven with the -e switch.
[ERROR] Re-run Maven using the -X switch to enable full debug logging.
[ERROR]
[ERROR] For more information about the errors and possible solutions, please read the following articles:
[ERROR] [Help 1] http://cwiki.apache.org/confluence/display/MAVEN/MojoFailureException
[ERROR]
[ERROR] After correcting the problems, you can resume the build with the command
[ERROR] mvn <args> -rf :phoenix-core
Build step 'Invoke top-level Maven targets' marked build as failure
Archiving artifacts
Recording test results
ERROR: Step ?Publish JUnit test result report? failed: No test report files were found. Configuration error?
Not sending mail to unregistered user giskender@salesforce.com
Not sending mail to unregistered user Rajeshbabu Chintaguntla
Not sending mail to unregistered user noreply@github.com
Not sending mail to unregistered user abhishek.chouhan@salesforce.com
Not sending mail to unregistered user s.kadam@salesforce.com