You are viewing a plain text version of this content. The canonical link for it is here.
Posted to builds@solr.apache.org by Apache Jenkins Server <je...@builds.apache.org> on 2026/10/01 07:35:34 UTC

[JENKINS] Solr » Solr-Test-10.x - Build # 2651 - Unstable!

Build: https://ci-builds.apache.org/job/Solr/job/Solr-Test-10.x/2651/

1 tests failed.
FAILED:  org.apache.solr.cloud.RecoveryAfterSoftCommitTest.test

Error Message:
org.apache.solr.client.solrj.SolrServerException: IOException occurred when talking to server at: http://127.0.0.1:42935/solr/collection1_shard1_replica_n3/update

Stack Trace:
org.apache.solr.client.solrj.SolrServerException: IOException occurred when talking to server at: http://127.0.0.1:42935/solr/collection1_shard1_replica_n3/update
	at __randomizedtesting.SeedInfo.seed([4F0352C40482B2DA:C7576D1EAA7EDF22]:0)
	at org.apache.solr.client.solrj.jetty.HttpJettySolrClient.request(HttpJettySolrClient.java:515)
	at org.apache.solr.client.solrj.jetty.HttpJettySolrClient.lambda$requestWithBaseUrl$1(HttpJettySolrClient.java:543)
	at org.apache.solr.client.solrj.jetty.HttpJettySolrClient.requestWithBaseUrl(HttpJettySolrClient.java:562)
	at org.apache.solr.client.solrj.jetty.HttpJettySolrClient.requestWithBaseUrl(HttpJettySolrClient.java:543)
	at org.apache.solr.client.solrj.impl.LBSolrClient.doRequest(LBSolrClient.java:626)
	at org.apache.solr.client.solrj.impl.LBSolrClient.doRequest(LBSolrClient.java:614)
	at org.apache.solr.client.solrj.impl.LBSolrClient.doRequest(LBSolrClient.java:639)
	at org.apache.solr.client.solrj.impl.LBSolrClient.request(LBSolrClient.java:583)
	at org.apache.solr.client.solrj.impl.CloudSolrClient.sendRequest(CloudSolrClient.java:1052)
	at org.apache.solr.client.solrj.impl.CloudSolrClient.requestWithRetryOnStaleState(CloudSolrClient.java:683)
	at org.apache.solr.client.solrj.impl.CloudSolrClient.request(CloudSolrClient.java:605)
	at org.apache.solr.client.solrj.SolrRequest.process(SolrRequest.java:314)
	at org.apache.solr.client.solrj.SolrClient.add(SolrClient.java:167)
	at org.apache.solr.client.solrj.SolrClient.add(SolrClient.java:132)
	at org.apache.solr.client.solrj.SolrClient.add(SolrClient.java:148)
	at org.apache.solr.cloud.RecoveryAfterSoftCommitTest.test(RecoveryAfterSoftCommitTest.java:106)
	at java.base/jdk.internal.reflect.DirectMethodHandleAccessor.invoke(DirectMethodHandleAccessor.java:103)
	at java.base/java.lang.reflect.Method.invoke(Method.java:580)
	at com.carrotsearch.randomizedtesting.RandomizedRunner.invoke(RandomizedRunner.java:1780)
	at com.carrotsearch.randomizedtesting.RandomizedRunner$8.evaluate(RandomizedRunner.java:959)
	at com.carrotsearch.randomizedtesting.RandomizedRunner$9.evaluate(RandomizedRunner.java:995)
	at com.carrotsearch.randomizedtesting.RandomizedRunner$10.evaluate(RandomizedRunner.java:1009)
	at org.apache.solr.BaseDistributedSearchTestCase$ShardsRepeatRule$ShardsFixedStatement.callStatement(BaseDistributedSearchTestCase.java:1084)
	at org.apache.solr.BaseDistributedSearchTestCase$ShardsRepeatRule$ShardsStatement.evaluate(BaseDistributedSearchTestCase.java:1055)
	at com.carrotsearch.randomizedtesting.rules.SystemPropertiesRestoreRule$1.evaluate(SystemPropertiesRestoreRule.java:80)
	at org.junit.rules.RunRules.evaluate(RunRules.java:20)
	at org.apache.lucene.tests.util.TestRuleSetupTeardownChained$1.evaluate(TestRuleSetupTeardownChained.java:48)
	at org.apache.lucene.tests.util.AbstractBeforeAfterRule$1.evaluate(AbstractBeforeAfterRule.java:43)
	at org.apache.lucene.tests.util.TestRuleThreadAndTestName$1.evaluate(TestRuleThreadAndTestName.java:45)
	at org.apache.lucene.tests.util.TestRuleIgnoreAfterMaxFailures$1.evaluate(TestRuleIgnoreAfterMaxFailures.java:60)
	at org.apache.lucene.tests.util.TestRuleMarkFailure$1.evaluate(TestRuleMarkFailure.java:44)
	at org.junit.rules.RunRules.evaluate(RunRules.java:20)
	at com.carrotsearch.randomizedtesting.rules.StatementAdapter.evaluate(StatementAdapter.java:36)
	at com.carrotsearch.randomizedtesting.ThreadLeakControl$StatementRunner.run(ThreadLeakControl.java:390)
	at com.carrotsearch.randomizedtesting.ThreadLeakControl.forkTimeoutingTask(ThreadLeakControl.java:843)
	at com.carrotsearch.randomizedtesting.ThreadLeakControl$3.evaluate(ThreadLeakControl.java:490)
	at com.carrotsearch.randomizedtesting.RandomizedRunner.runSingleTest(RandomizedRunner.java:968)
	at com.carrotsearch.randomizedtesting.RandomizedRunner$5.evaluate(RandomizedRunner.java:853)
	at com.carrotsearch.randomizedtesting.RandomizedRunner$6.evaluate(RandomizedRunner.java:904)
	at com.carrotsearch.randomizedtesting.RandomizedRunner$7.evaluate(RandomizedRunner.java:915)
	at com.carrotsearch.randomizedtesting.rules.StatementAdapter.evaluate(StatementAdapter.java:36)
	at com.carrotsearch.randomizedtesting.rules.StatementAdapter.evaluate(StatementAdapter.java:36)
	at org.apache.lucene.tests.util.AbstractBeforeAfterRule$1.evaluate(AbstractBeforeAfterRule.java:43)
	at com.carrotsearch.randomizedtesting.rules.SystemPropertiesRestoreRule$1.evaluate(SystemPropertiesRestoreRule.java:80)
	at org.junit.rules.RunRules.evaluate(RunRules.java:20)
	at org.apache.lucene.tests.util.AbstractBeforeAfterRule$1.evaluate(AbstractBeforeAfterRule.java:43)
	at com.carrotsearch.randomizedtesting.rules.StatementAdapter.evaluate(StatementAdapter.java:36)
	at org.apache.lucene.tests.util.TestRuleStoreClassName$1.evaluate(TestRuleStoreClassName.java:38)
	at com.carrotsearch.randomizedtesting.rules.NoShadowingOrOverridesOnMethodsRule$1.evaluate(NoShadowingOrOverridesOnMethodsRule.java:40)
	at com.carrotsearch.randomizedtesting.rules.NoShadowingOrOverridesOnMethodsRule$1.evaluate(NoShadowingOrOverridesOnMethodsRule.java:40)
	at com.carrotsearch.randomizedtesting.rules.StatementAdapter.evaluate(StatementAdapter.java:36)
	at com.carrotsearch.randomizedtesting.rules.StatementAdapter.evaluate(StatementAdapter.java:36)
	at org.apache.lucene.tests.util.TestRuleAssertionsRequired$1.evaluate(TestRuleAssertionsRequired.java:53)
	at org.apache.lucene.tests.util.AbstractBeforeAfterRule$1.evaluate(AbstractBeforeAfterRule.java:43)
	at org.apache.lucene.tests.util.TestRuleMarkFailure$1.evaluate(TestRuleMarkFailure.java:44)
	at org.apache.lucene.tests.util.TestRuleIgnoreAfterMaxFailures$1.evaluate(TestRuleIgnoreAfterMaxFailures.java:60)
	at org.apache.lucene.tests.util.TestRuleIgnoreTestSuites$1.evaluate(TestRuleIgnoreTestSuites.java:47)
	at org.junit.rules.RunRules.evaluate(RunRules.java:20)
	at com.carrotsearch.randomizedtesting.rules.StatementAdapter.evaluate(StatementAdapter.java:36)
	at com.carrotsearch.randomizedtesting.ThreadLeakControl$StatementRunner.run(ThreadLeakControl.java:390)
	at com.carrotsearch.randomizedtesting.ThreadLeakControl.lambda$forkTimeoutingTask$0(ThreadLeakControl.java:850)
	at java.base/java.lang.Thread.run(Thread.java:1583)
Caused by: org.eclipse.jetty.io.EofException: Broken pipe
	at org.eclipse.jetty.io.SocketChannelEndPoint.flush(SocketChannelEndPoint.java:118)
	at org.eclipse.jetty.io.WriteFlusher.flush(WriteFlusher.java:419)
	at org.eclipse.jetty.io.WriteFlusher.write(WriteFlusher.java:272)
	at org.eclipse.jetty.io.WriteFlusher.write(WriteFlusher.java:251)
	at org.eclipse.jetty.io.AbstractEndPoint.write(AbstractEndPoint.java:368)
	at org.eclipse.jetty.http2.internal.HTTP2Flusher.process(HTTP2Flusher.java:331)
	at org.eclipse.jetty.util.IteratingCallback.processing(IteratingCallback.java:253)
	at org.eclipse.jetty.util.IteratingCallback.iterate(IteratingCallback.java:232)
	at org.eclipse.jetty.http2.HTTP2Session.frame(HTTP2Session.java:956)
	at org.eclipse.jetty.http2.HTTP2Session.data(HTTP2Session.java:943)
	at org.eclipse.jetty.http2.HTTP2Stream.data(HTTP2Stream.java:158)
	at org.eclipse.jetty.http2.client.transport.internal.HttpSenderOverHTTP2.sendContent(HttpSenderOverHTTP2.java:172)
	at org.eclipse.jetty.client.transport.HttpSender$ContentSender.process(HttpSender.java:572)
	at org.eclipse.jetty.util.IteratingCallback.processing(IteratingCallback.java:253)
	at org.eclipse.jetty.util.IteratingCallback.succeeded(IteratingCallback.java:398)
	at org.eclipse.jetty.io.content.AsyncContent.runDemandCallback(AsyncContent.java:238)
	at org.eclipse.jetty.io.content.AsyncContent.invokeDemandCallback(AsyncContent.java:231)
	at org.eclipse.jetty.util.thread.SerializedInvoker$Link.run(SerializedInvoker.java:268)
	at org.eclipse.jetty.util.thread.SerializedInvoker.run(SerializedInvoker.java:168)
	at org.eclipse.jetty.io.content.AsyncContent.offer(AsyncContent.java:117)
	at org.eclipse.jetty.io.content.AsyncContent.write(AsyncContent.java:74)
	at org.eclipse.jetty.io.content.OutputStreamContentSource$AsyncOutputStream.write(OutputStreamContentSource.java:89)
	at org.apache.solr.common.util.FastOutputStream.flush(FastOutputStream.java:207)
	at org.apache.solr.common.util.FastOutputStream.flushBuffer(FastOutputStream.java:200)
	at org.apache.solr.common.util.JavaBinCodec.marshal(JavaBinCodec.java:174)
	at org.apache.solr.client.solrj.request.JavaBinUpdateRequestCodec.marshal(JavaBinUpdateRequestCodec.java:88)
	at org.apache.solr.client.solrj.request.JavaBinRequestWriter$1.write(JavaBinRequestWriter.java:42)
	at org.apache.solr.client.solrj.jetty.HttpJettySolrClient.sendRequest(HttpJettySolrClient.java:758)
	at org.apache.solr.client.solrj.jetty.HttpJettySolrClient.request(HttpJettySolrClient.java:481)
	... 61 more
Caused by: java.io.IOException: Broken pipe
	at java.base/sun.nio.ch.SocketDispatcher.writev0(Native Method)
	at java.base/sun.nio.ch.SocketDispatcher.writev(SocketDispatcher.java:70)
	at java.base/sun.nio.ch.IOUtil.write(IOUtil.java:227)
	at java.base/sun.nio.ch.IOUtil.write(IOUtil.java:158)
	at java.base/sun.nio.ch.SocketChannelImpl.write(SocketChannelImpl.java:574)
	at java.base/java.nio.channels.SocketChannel.write(SocketChannel.java:660)
	at org.eclipse.jetty.io.SocketChannelEndPoint.flush(SocketChannelEndPoint.java:112)
	... 89 more




Build Log:
[...truncated 11 lines...]
ERROR: Workspace has a .git repository, but it appears to be corrupt.
hudson.plugins.git.GitException: Command "git rev-parse --resolve-git-dir /home/jenkins/jenkins-agent/workspace/Solr/Solr-Test-10.x/.git" returned status code 128:
stdout: 
stderr: fatal: not a gitdir '/home/jenkins/jenkins-agent/workspace/Solr/Solr-Test-10.x/.git'

	at PluginClassLoader for git-client//org.jenkinsci.plugins.gitclient.CliGitAPIImpl.launchCommandIn(CliGitAPIImpl.java:2848)
	at PluginClassLoader for git-client//org.jenkinsci.plugins.gitclient.CliGitAPIImpl.launchCommandIn(CliGitAPIImpl.java:2768)
	at PluginClassLoader for git-client//org.jenkinsci.plugins.gitclient.CliGitAPIImpl.launchCommandIn(CliGitAPIImpl.java:2763)
	at PluginClassLoader for git-client//org.jenkinsci.plugins.gitclient.CliGitAPIImpl.launchCommand(CliGitAPIImpl.java:2052)
	at PluginClassLoader for git-client//org.jenkinsci.plugins.gitclient.CliGitAPIImpl.launchCommand(CliGitAPIImpl.java:2064)
	at PluginClassLoader for git-client//org.jenkinsci.plugins.gitclient.CliGitAPIImpl.hasGitRepo(CliGitAPIImpl.java:404)
	at PluginClassLoader for git-client//hudson.plugins.git.GitAPI.hasGitRepo(GitAPI.java:281)
	at java.base/jdk.internal.reflect.NativeMethodAccessorImpl.invoke0(Native Method)
	at java.base/jdk.internal.reflect.NativeMethodAccessorImpl.invoke(NativeMethodAccessorImpl.java:77)
	at java.base/jdk.internal.reflect.DelegatingMethodAccessorImpl.invoke(DelegatingMethodAccessorImpl.java:43)
	at java.base/java.lang.reflect.Method.invoke(Method.java:569)
	at hudson.remoting.RemoteInvocationHandler$RPCRequest.perform(RemoteInvocationHandler.java:986)
	at hudson.remoting.RemoteInvocationHandler$RPCRequest.call(RemoteInvocationHandler.java:961)
	at hudson.remoting.RemoteInvocationHandler$RPCRequest.call(RemoteInvocationHandler.java:907)
	at hudson.remoting.UserRequest.perform(UserRequest.java:225)
	at hudson.remoting.UserRequest.perform(UserRequest.java:50)
	at hudson.remoting.Request$2.run(Request.java:391)
	at hudson.remoting.InterceptingExecutorService.lambda$wrap$0(InterceptingExecutorService.java:81)
	at java.base/java.util.concurrent.FutureTask.run(FutureTask.java:264)
	at java.base/java.util.concurrent.ThreadPoolExecutor.runWorker(ThreadPoolExecutor.java:1136)
	at java.base/java.util.concurrent.ThreadPoolExecutor$Worker.run(ThreadPoolExecutor.java:635)
	at java.base/java.lang.Thread.run(Thread.java:840)
Cloning the remote Git repository
Cloning repository https://gitbox.apache.org/repos/asf/solr.git
 > git init /home/jenkins/jenkins-agent/workspace/Solr/Solr-Test-10.x # timeout=10
Fetching upstream changes from https://gitbox.apache.org/repos/asf/solr.git
 > git --version # timeout=10
 > git --version # 'git version 2.43.0'
 > git fetch --tags --force --progress -- https://gitbox.apache.org/repos/asf/solr.git +refs/heads/*:refs/remotes/origin/* # timeout=10
 > git config remote.origin.url https://gitbox.apache.org/repos/asf/solr.git # timeout=10
 > git config --add remote.origin.fetch +refs/heads/*:refs/remotes/origin/* # timeout=10
Avoid second fetch
 > git rev-parse refs/remotes/origin/branch_10x^{commit} # timeout=10
Checking out Revision a6204cebabd01330c1f9744c40bf46dd21b8c414 (refs/remotes/origin/branch_10x)
 > git config core.sparsecheckout # timeout=10
 > git checkout -f a6204cebabd01330c1f9744c40bf46dd21b8c414 # timeout=10
 > git branch -a -v --no-abbrev # timeout=10
 > git checkout -b branch_10x a6204cebabd01330c1f9744c40bf46dd21b8c414 # timeout=10
Commit message: "SOLR-18197: NestPathField: tolerate legacy maxCharsForDocValues arg (#4964)"
 > git rev-list --no-walk a6204cebabd01330c1f9744c40bf46dd21b8c414 # timeout=10
No emails were triggered.
provisioning config files...
copy managed file [gradle.properties] to file:/home/jenkins/jenkins-agent/workspace/Solr/Solr-Test-10.x/gradle.properties
[Gradle] - Launching build.
[Solr-Test-10.x] $ /home/jenkins/jenkins-agent/workspace/Solr/Solr-Test-10.x/gradlew -Dtests.haltonfailure=false -Dtests.badapples=false --continue test
Downloading gradle-wrapper.jar from https://raw.githubusercontent.com/gradle/gradle/v8.10.2/gradle/wrapper/gradle-wrapper.jar
To honour the JVM settings for this build a single-use Daemon process will be forked. For more on this, please refer to https://docs.gradle.org/9.7.0/userguide/gradle_daemon.html#sec:disabling_the_daemon in the Gradle documentation.
Daemon will be stopped at the end of the build 

> Task :build-infra:compileJava
Note: /home/jenkins/jenkins-agent/workspace/Solr/Solr-Test-10.x/build-tools/build-infra/src/main/java/org/apache/lucene/gradle/Checksum.java uses or overrides a deprecated API.
Note: Recompile with -Xlint:deprecation for details.

> Task :build-infra:pluginDescriptors
> Task :build-infra:processResources
> Task :build-infra:classes
> Task :build-infra:jar

> Configure project :solr:webapp
WARNING: gradle.properties is missing solr.ui.commit and is not configured to build UI from source; falling back to build from source.

> Task :gitStatus
> Task :checkJdkInternalsExportedToGradle

> Task :solr:api:compileJava
Note: Some input files use or override a deprecated API.
Note: Recompile with -Xlint:deprecation for details.

> Task :solr:api:processResources NO-SOURCE
> Task :solr:api:classes
> Task :solr:api:jar

> Task :randomizationInfo
Running tests with randomization seed: tests.seed=4F0352C40482B2DA

> Task :solr:api:resolve
> Task :solr:api:processTestResources
> Task :solr:core:processResources
> Task :solr:solrj:processResources
> Task :solr:solrj-jetty:processResources NO-SOURCE
> Task :solr:solrj-streaming:processResources
> Task :solr:solrj-zookeeper:processResources NO-SOURCE
> Task :solr:test-framework:processResources
> Task :solr:benchmark:processResources
> Task :solr:benchmark:processTestResources
> Task :solr:core:processTestResources
> Task :solr:modules:analysis-extras:processResources NO-SOURCE
> Task :solr:cross-dc-manager:processResources NO-SOURCE
> Task :solr:cross-dc-manager:processTestResources
> Task :solr:modules:cross-dc:processResources NO-SOURCE
> Task :solr:modules:opentelemetry:processResources NO-SOURCE
> Task :solr:server:compileJava SKIPPED
> Task :solr:server:processResources NO-SOURCE
> Task :solr:server:classes UP-TO-DATE
> Task :solr:server:compileTestJava NO-SOURCE
> Task :solr:server:processTestResources NO-SOURCE
> Task :solr:server:testClasses UP-TO-DATE
> Task :solr:server:test NO-SOURCE
> Task :solr:server:wipeTaskTemp
> Task :solr:solr-ref-guide:compileJava NO-SOURCE
> Task :solr:solr-ref-guide:processResources NO-SOURCE
> Task :solr:solr-ref-guide:classes UP-TO-DATE
> Task :solr:solr-ref-guide:copySolrjTestResources
> Task :solr:solr-ref-guide:processTestResources NO-SOURCE
> Task :solr:modules:sql:processResources
> Task :solr:solrj:processTestResources
> Task :solr:solrj-jetty:processTestResources
> Task :solr:solrj-streaming:processTestResources
> Task :solr:solrj-zookeeper:processTestResources
> Task :solr:test-framework:processTestResources

> Task :solr:solrj:openApiGenerate
Cleaned up output directory /home/jenkins/jenkins-agent/workspace/Solr/Solr-Test-10.x/solr/solrj/build/generated before code generation.
[openApiGenerate] Worker isolation: classloader (fast startup, but generator classes accumulate in Gradle daemon Metaspace - consider workerIsolation = "process" if you hit metaspace pressure)
File (reserved word) cannot be used as model name. Renamed to ModelFile
############################################################################################
# Thanks for using OpenAPI Generator.                                                      #
# We appreciate your support! Please consider donating to help us maintain this project.   #
# https://opencollective.com/openapi_generator/donate                                      #
############################################################################################
Successfully generated code to /home/jenkins/jenkins-agent/workspace/Solr/Solr-Test-10.x/solr/solrj/build/generated
Type-safe project accessors is an incubating feature.
> Task :kotlinWasmKotlinNpmCachesSetup
> Task :kotlinWasmNodeJsSetup
> Task :kotlinWasmRestoreYarnLock
> Task :kotlinWasmYarnSetup
> Task :shared:wasmJsPackageJson
> Task :shared:wasmJsTestPackageJson
> Task :webApp:wasmJsPackageJson
> Task :webApp:wasmJsTestPackageJson
> Task :shared:wasmJsPublicPackageJson
> Task :shared:wasmJsTestPublicPackageJson
> Task :webApp:wasmJsPublicPackageJson
> Task :webApp:wasmJsTestPublicPackageJson
> Task :kotlinWasmPackageJsonUmbrella
> Task :wasmRootPackageJson
> Task :kotlinWasmNpmInstall

> Task :solr:webapp:buildUiFromSource

> Task :kotlinWasmToolingSetup
> Task :kotlinWasmStoreYarnLock
> Task :shared:convertXmlValueResourcesForCommonMain
> Task :shared:copyNonXmlValueResourcesForCommonMain
> Task :shared:prepareComposeResourcesTaskForCommonMain
> Task :shared:convertXmlValueResourcesForWasmJsMain NO-SOURCE
> Task :shared:copyNonXmlValueResourcesForWasmJsMain NO-SOURCE
> Task :shared:prepareComposeResourcesTaskForWasmJsMain NO-SOURCE
> Task :shared:convertXmlValueResourcesForWebMain NO-SOURCE
> Task :shared:copyNonXmlValueResourcesForWebMain NO-SOURCE
> Task :shared:prepareComposeResourcesTaskForWebMain NO-SOURCE
> Task :shared:assembleWasmJsMainResources
> Task :shared:wasmJsCopyHierarchicalMultiplatformResources
> Task :shared:wasmJsZipMultiplatformResourcesForPublication
> Task :webApp:wasmJsResolveResourcesFromDependencies
> Task :webApp:convertXmlValueResourcesForCommonMain NO-SOURCE
> Task :webApp:copyNonXmlValueResourcesForCommonMain NO-SOURCE
> Task :webApp:prepareComposeResourcesTaskForCommonMain NO-SOURCE
> Task :webApp:convertXmlValueResourcesForWasmJsMain NO-SOURCE
> Task :webApp:copyNonXmlValueResourcesForWasmJsMain NO-SOURCE
> Task :webApp:prepareComposeResourcesTaskForWasmJsMain NO-SOURCE
> Task :webApp:convertXmlValueResourcesForWebMain NO-SOURCE
> Task :webApp:copyNonXmlValueResourcesForWebMain NO-SOURCE
> Task :webApp:prepareComposeResourcesTaskForWebMain NO-SOURCE
> Task :webApp:assembleWasmJsMainResources
> Task :webApp:wasmJsResolveSelfResourcesCopyHierarchicalMultiplatformResources
> Task :webApp:wasmJsAggregateResources
> Task :webApp:wasmJsProcessResources
> Task :shared:kmpPartiallyResolvedDependenciesChecker
> Task :shared:checkKotlinGradlePluginConfigurationErrors SKIPPED
> Task :shared:checkWasmJsMainComposeLibrariesCompatibility
> Task :shared:generateResourceAccessorsForCommonMain
> Task :shared:generateResourceAccessorsForWasmJsMain NO-SOURCE
> Task :shared:generateResourceAccessorsForWebMain NO-SOURCE
> Task :shared:generateActualResourceCollectorsForWasmJsMain
> Task :shared:generateComposeResClass
> Task :shared:generateExpectResourceCollectorsForCommonMain
> Task :shared:compileKotlinWasmJs FROM-CACHE
> Task :webApp:kmpPartiallyResolvedDependenciesChecker
> Task :webApp:checkKotlinGradlePluginConfigurationErrors SKIPPED
> Task :webApp:checkWasmJsMainComposeLibrariesCompatibility
> Task :webApp:generateResourceAccessorsForCommonMain SKIPPED
> Task :webApp:generateResourceAccessorsForWasmJsMain SKIPPED
> Task :webApp:generateResourceAccessorsForWebMain SKIPPED
> Task :webApp:generateActualResourceCollectorsForWasmJsMain SKIPPED
> Task :webApp:generateComposeResClass SKIPPED
> Task :webApp:generateExpectResourceCollectorsForCommonMain SKIPPED
> Task :webApp:compileKotlinWasmJs FROM-CACHE
> Task :webApp:wasmJsMainClasses
> Task :webApp:compileProductionExecutableKotlinWasmJs FROM-CACHE
> Task :webApp:kotlinWasmBinaryenSetup
> Task :webApp:compileProductionExecutableKotlinWasmJsOptimize
> Task :webApp:unpackSkikoWasmRuntime
> Task :webApp:processSkikoRuntimeForKWasm
> Task :webApp:wasmJsProductionExecutableCompileSync
> Task :webApp:wasmJsBrowserProductionWebpack FROM-CACHE
> Task :webApp:wasmJsBrowserDistribution

BUILD SUCCESSFUL in 2m 22s
45 actionable tasks: 41 executed, 4 from cache

> Task :solr:solrj:generatedSpotlessHelper
> Task :solr:solrj:generatedSpotless

> Task :solr:solrj:compileJava
Note: Some input files use or override a deprecated API.
Note: Recompile with -Xlint:deprecation for details.

> Task :solr:solrj-jetty:compileJava
Note: /home/jenkins/jenkins-agent/workspace/Solr/Solr-Test-10.x/solr/solrj-jetty/src/java/org/apache/solr/client/solrj/jetty/HttpJettySolrClient.java uses or overrides a deprecated API.
Note: Recompile with -Xlint:deprecation for details.

> Task :solr:solrj-streaming:compileJava
Note: Some input files use or override a deprecated API.
Note: Recompile with -Xlint:deprecation for details.

> Task :solr:solrj-zookeeper:compileJava
> Task :solr:core:compileJava
Note: Some input files use or override a deprecated API.
Note: Recompile with -Xlint:deprecation for details.

> Task :solr:test-framework:compileJava
Note: Some input files use or override a deprecated API.
Note: Recompile with -Xlint:deprecation for details.

> Task :solr:api:compileTestJava
> Task :solr:api:testClasses
> Task :solr:core:classes
> Task :solr:core:jar
> Task :solr:solrj:classes
> Task :solr:solrj:jar
> Task :solr:solrj-jetty:classes
> Task :solr:solrj-jetty:jar
> Task :solr:solrj-streaming:classes
> Task :solr:solrj-streaming:jar
> Task :solr:solrj-zookeeper:classes
> Task :solr:solrj-zookeeper:jar
> Task :solr:test-framework:classes
> Task :solr:test-framework:jar

> Task :solr:api:test
WARNING: Using incubator modules: jdk.incubator.vector
WARNING: Using incubator modules: jdk.incubator.vector
WARNING: A command line option has enabled the Security Manager
WARNING: The Security Manager is deprecated and will be removed in a future release
WARNING: A command line option has enabled the Security Manager
WARNING: The Security Manager is deprecated and will be removed in a future release
java.security.policy: error adding Permission, java.net.URLPermission:
java.security.policy: error adding Permission, java.net.URLPermission:
	java.util.ServiceConfigurationError: Locale provider adapter "CLDR"cannot be instantiated.
	java.util.ServiceConfigurationError: Locale provider adapter "CLDR"cannot be instantiated.
java.security.policy: error adding Permission, java.net.URLPermission:
java.security.policy: error adding Permission, java.net.URLPermission:
	java.util.ServiceConfigurationError: Locale provider adapter "CLDR"cannot be instantiated.
java.security.policy: error adding Permission, java.net.URLPermission:
	java.util.ServiceConfigurationError: Locale provider adapter "CLDR"cannot be instantiated.
	java.util.ServiceConfigurationError: Locale provider adapter "CLDR"cannot be instantiated.
java.security.policy: error adding Permission, java.net.URLPermission:
	java.util.ServiceConfigurationError: Locale provider adapter "CLDR"cannot be instantiated.
java.security.policy: error adding Permission, java.net.URLPermission:
	java.util.ServiceConfigurationError: Locale provider adapter "CLDR"cannot be instantiated.
java.security.policy: error adding Permission, java.net.URLPermission:
	java.util.ServiceConfigurationError: Locale provider adapter "CLDR"cannot be instantiated.
java.security.policy: error adding Permission, java.net.URLPermission:
	java.util.ServiceConfigurationError: Locale provider adapter "CLDR"cannot be instantiated.
java.security.policy: error adding Permission, java.net.URLPermission:
	java.util.ServiceConfigurationError: Locale provider adapter "CLDR"cannot be instantiated.
:solr:api:test (SUCCESS): 19 test(s)

> Task :solr:api:wipeTaskTemp
> Task :solr:benchmark:compileJava
> Task :solr:benchmark:classes
> Task :solr:benchmark:compileTestJava
> Task :solr:benchmark:testClasses

> Task :solr:benchmark:test
WARNING: Using incubator modules: jdk.incubator.vector
WARNING: Using incubator modules: jdk.incubator.vector
WARNING: Using incubator modules: jdk.incubator.vector
WARNING: A command line option has enabled the Security Manager
WARNING: The Security Manager is deprecated and will be removed in a future release
WARNING: A command line option has enabled the Security Manager
WARNING: The Security Manager is deprecated and will be removed in a future release
WARNING: A command line option has enabled the Security Manager
WARNING: The Security Manager is deprecated and will be removed in a future release
java.security.policy: error adding Permission, java.net.URLPermission:
	java.util.ServiceConfigurationError: Locale provider adapter "CLDR"cannot be instantiated.
java.security.policy: error adding Permission, java.net.URLPermission:
	java.util.ServiceConfigurationError: Locale provider adapter "CLDR"cannot be instantiated.
java.security.policy: error adding Permission, java.net.URLPermission:
	java.util.ServiceConfigurationError: Locale provider adapter "CLDR"cannot be instantiated.
java.security.policy: error adding Permission, java.net.URLPermission:
	java.util.ServiceConfigurationError: Locale provider adapter "CLDR"cannot be instantiated.
java.security.policy: error adding Permission, java.net.URLPermission:
	java.util.ServiceConfigurationError: Locale provider adapter "CLDR"cannot be instantiated.
java.security.policy: error adding Permission, java.net.URLPermission:
	java.util.ServiceConfigurationError: Locale provider adapter "CLDR"cannot be instantiated.
java.security.policy: error adding Permission, java.net.URLPermission:
	java.util.ServiceConfigurationError: Locale provider adapter "CLDR"cannot be instantiated.
java.security.policy: error adding Permission, java.net.URLPermission:
	java.util.ServiceConfigurationError: Locale provider adapter "CLDR"cannot be instantiated.
java.security.policy: error adding Permission, java.net.URLPermission:
	java.util.ServiceConfigurationError: Locale provider adapter "CLDR"cannot be instantiated.
java.security.policy: error adding Permission, java.net.URLPermission:
	java.util.ServiceConfigurationError: Locale provider adapter "CLDR"cannot be instantiated.
java.security.policy: error adding Permission, java.net.URLPermission:
	java.util.ServiceConfigurationError: Locale provider adapter "CLDR"cannot be instantiated.
java.security.policy: error adding Permission, java.net.URLPermission:
	java.util.ServiceConfigurationError: Locale provider adapter "CLDR"cannot be instantiated.
java.security.policy: error adding Permission, java.net.URLPermission:
	java.util.ServiceConfigurationError: Locale provider adapter "CLDR"cannot be instantiated.
java.security.policy: error adding Permission, java.net.URLPermission:
	java.util.ServiceConfigurationError: Locale provider adapter "CLDR"cannot be instantiated.
java.security.policy: error adding Permission, java.net.URLPermission:
	java.util.ServiceConfigurationError: Locale provider adapter "CLDR"cannot be instantiated.
:solr:benchmark:test (SUCCESS): 10 test(s)

> Task :solr:benchmark:wipeTaskTemp
> Task :solr:core:compileTestJava
Note: Some input files use or override a deprecated API.
Note: Recompile with -Xlint:deprecation for details.

> Task :solr:core:testClasses

> Task :solr:modules:analysis-extras:compileJava
Note: /home/jenkins/jenkins-agent/workspace/Solr/Solr-Test-10.x/solr/modules/analysis-extras/src/java/org/apache/solr/schema/ICUCollationField.java uses or overrides a deprecated API.
Note: Recompile with -Xlint:deprecation for details.

> Task :solr:modules:analysis-extras:classes
> Task :solr:modules:analysis-extras:jar

> Task :solr:core:test
WARNING: Using incubator modules: jdk.incubator.vector
WARNING: Using incubator modules: jdk.incubator.vector
WARNING: Using incubator modules: jdk.incubator.vector
WARNING: A command line option has enabled the Security Manager
WARNING: The Security Manager is deprecated and will be removed in a future release
WARNING: A command line option has enabled the Security Manager
WARNING: The Security Manager is deprecated and will be removed in a future release
WARNING: A command line option has enabled the Security Manager
WARNING: The Security Manager is deprecated and will be removed in a future release
WARNING: Using incubator modules: jdk.incubator.vector
WARNING: A command line option has enabled the Security Manager
WARNING: The Security Manager is deprecated and will be removed in a future release
java.security.policy: error adding Permission, java.net.URLPermission:
	java.util.ServiceConfigurationError: Locale provider adapter "CLDR"cannot be instantiated.
java.security.policy: error adding Permission, java.net.URLPermission:
	java.util.ServiceConfigurationError: Locale provider adapter "CLDR"cannot be instantiated.
java.security.policy: error adding Permission, java.net.URLPermission:
	java.util.ServiceConfigurationError: Locale provider adapter "CLDR"cannot be instantiated.
java.security.policy: error adding Permission, java.net.URLPermission:
	java.util.ServiceConfigurationError: Locale provider adapter "CLDR"cannot be instantiated.
java.security.policy: error adding Permission, java.net.URLPermission:
	java.util.ServiceConfigurationError: Locale provider adapter "CLDR"cannot be instantiated.
java.security.policy: error adding Permission, java.net.URLPermission:
	java.util.ServiceConfigurationError: Locale provider adapter "CLDR"cannot be instantiated.
java.security.policy: error adding Permission, java.net.URLPermission:
	java.util.ServiceConfigurationError: Locale provider adapter "CLDR"cannot be instantiated.
java.security.policy: error adding Permission, java.net.URLPermission:
	java.util.ServiceConfigurationError: Locale provider adapter "CLDR"cannot be instantiated.
java.security.policy: error adding Permission, java.net.URLPermission:
	java.util.ServiceConfigurationError: Locale provider adapter "CLDR"cannot be instantiated.
java.security.policy: error adding Permission, java.net.URLPermission:
	java.util.ServiceConfigurationError: Locale provider adapter "CLDR"cannot be instantiated.
java.security.policy: error adding Permission, java.net.URLPermission:
	java.util.ServiceConfigurationError: Locale provider adapter "CLDR"cannot be instantiated.
java.security.policy: error adding Permission, java.net.URLPermission:
	java.util.ServiceConfigurationError: Locale provider adapter "CLDR"cannot be instantiated.
java.security.policy: error adding Permission, java.net.URLPermission:
	java.util.ServiceConfigurationError: Locale provider adapter "CLDR"cannot be instantiated.
java.security.policy: error adding Permission, java.net.URLPermission:
	java.util.ServiceConfigurationError: Locale provider adapter "CLDR"cannot be instantiated.
java.security.policy: error adding Permission, java.net.URLPermission:
	java.util.ServiceConfigurationError: Locale provider adapter "CLDR"cannot be instantiated.
java.security.policy: error adding Permission, java.net.URLPermission:
	java.util.ServiceConfigurationError: Locale provider adapter "CLDR"cannot be instantiated.
java.security.policy: error adding Permission, java.net.URLPermission:
	java.util.ServiceConfigurationError: Locale provider adapter "CLDR"cannot be instantiated.
java.security.policy: error adding Permission, java.net.URLPermission:
	java.util.ServiceConfigurationError: Locale provider adapter "CLDR"cannot be instantiated.
java.security.policy: error adding Permission, java.net.URLPermission:
	java.util.ServiceConfigurationError: Locale provider adapter "CLDR"cannot be instantiated.
java.security.policy: error adding Permission, java.net.URLPermission:
	java.util.ServiceConfigurationError: Locale provider adapter "CLDR"cannot be instantiated.

[68.292s][warning][jfr,system] Could not initialize JDK events. access denied ("java.lang.RuntimePermission" "accessClassInPackage.jdk.internal.event")

> Task :solr:core:test
WARNING: Test org.apache.solr.TestRandomFaceting wrote 21,066,150 bytes of output.

RecoveryAfterSoftCommitTest > test FAILED
    org.apache.solr.client.solrj.SolrServerException: IOException occurred when talking to server at: http://127.0.0.1:42935/solr/collection1_shard1_replica_n3/update
        at __randomizedtesting.SeedInfo.seed([4F0352C40482B2DA:C7576D1EAA7EDF22]:0)
        at app//org.apache.solr.client.solrj.jetty.HttpJettySolrClient.request(HttpJettySolrClient.java:515)
        at app//org.apache.solr.client.solrj.jetty.HttpJettySolrClient.lambda$requestWithBaseUrl$1(HttpJettySolrClient.java:543)
        at app//org.apache.solr.client.solrj.jetty.HttpJettySolrClient.requestWithBaseUrl(HttpJettySolrClient.java:562)
        at app//org.apache.solr.client.solrj.jetty.HttpJettySolrClient.requestWithBaseUrl(HttpJettySolrClient.java:543)
        at app//org.apache.solr.client.solrj.impl.LBSolrClient.doRequest(LBSolrClient.java:626)
        at app//org.apache.solr.client.solrj.impl.LBSolrClient.doRequest(LBSolrClient.java:614)
        at app//org.apache.solr.client.solrj.impl.LBSolrClient.doRequest(LBSolrClient.java:639)
        at app//org.apache.solr.client.solrj.impl.LBSolrClient.request(LBSolrClient.java:583)
        at app//org.apache.solr.client.solrj.impl.CloudSolrClient.sendRequest(CloudSolrClient.java:1052)
        at app//org.apache.solr.client.solrj.impl.CloudSolrClient.requestWithRetryOnStaleState(CloudSolrClient.java:683)
        at app//org.apache.solr.client.solrj.impl.CloudSolrClient.request(CloudSolrClient.java:605)
        at app//org.apache.solr.client.solrj.SolrRequest.process(SolrRequest.java:314)
        at app//org.apache.solr.client.solrj.SolrClient.add(SolrClient.java:167)
        at app//org.apache.solr.client.solrj.SolrClient.add(SolrClient.java:132)
        at app//org.apache.solr.client.solrj.SolrClient.add(SolrClient.java:148)
        at app//org.apache.solr.cloud.RecoveryAfterSoftCommitTest.test(RecoveryAfterSoftCommitTest.java:106)
        at java.base@21.0.12.1/jdk.internal.reflect.DirectMethodHandleAccessor.invoke(DirectMethodHandleAccessor.java:103)
        at java.base@21.0.12.1/java.lang.reflect.Method.invoke(Method.java:580)
        at app//com.carrotsearch.randomizedtesting.RandomizedRunner.invoke(RandomizedRunner.java:1780)
        at app//com.carrotsearch.randomizedtesting.RandomizedRunner$8.evaluate(RandomizedRunner.java:959)
        at app//com.carrotsearch.randomizedtesting.RandomizedRunner$9.evaluate(RandomizedRunner.java:995)
        at app//com.carrotsearch.randomizedtesting.RandomizedRunner$10.evaluate(RandomizedRunner.java:1009)
        at app//org.apache.solr.BaseDistributedSearchTestCase$ShardsRepeatRule$ShardsFixedStatement.callStatement(BaseDistributedSearchTestCase.java:1084)
        at app//org.apache.solr.BaseDistributedSearchTestCase$ShardsRepeatRule$ShardsStatement.evaluate(BaseDistributedSearchTestCase.java:1055)
        at app//com.carrotsearch.randomizedtesting.rules.SystemPropertiesRestoreRule$1.evaluate(SystemPropertiesRestoreRule.java:80)
        at app//org.junit.rules.RunRules.evaluate(RunRules.java:20)
        at app//org.apache.lucene.tests.util.TestRuleSetupTeardownChained$1.evaluate(TestRuleSetupTeardownChained.java:48)
        at app//org.apache.lucene.tests.util.AbstractBeforeAfterRule$1.evaluate(AbstractBeforeAfterRule.java:43)
        at app//org.apache.lucene.tests.util.TestRuleThreadAndTestName$1.evaluate(TestRuleThreadAndTestName.java:45)
        at app//org.apache.lucene.tests.util.TestRuleIgnoreAfterMaxFailures$1.evaluate(TestRuleIgnoreAfterMaxFailures.java:60)
        at app//org.apache.lucene.tests.util.TestRuleMarkFailure$1.evaluate(TestRuleMarkFailure.java:44)
        at app//org.junit.rules.RunRules.evaluate(RunRules.java:20)
        at app//com.carrotsearch.randomizedtesting.rules.StatementAdapter.evaluate(StatementAdapter.java:36)
        at app//com.carrotsearch.randomizedtesting.ThreadLeakControl$StatementRunner.run(ThreadLeakControl.java:390)
        at app//com.carrotsearch.randomizedtesting.ThreadLeakControl.forkTimeoutingTask(ThreadLeakControl.java:843)
        at app//com.carrotsearch.randomizedtesting.ThreadLeakControl$3.evaluate(ThreadLeakControl.java:490)
        at app//com.carrotsearch.randomizedtesting.RandomizedRunner.runSingleTest(RandomizedRunner.java:968)
        at app//com.carrotsearch.randomizedtesting.RandomizedRunner$5.evaluate(RandomizedRunner.java:853)
        at app//com.carrotsearch.randomizedtesting.RandomizedRunner$6.evaluate(RandomizedRunner.java:904)
        at app//com.carrotsearch.randomizedtesting.RandomizedRunner$7.evaluate(RandomizedRunner.java:915)
        at app//com.carrotsearch.randomizedtesting.rules.StatementAdapter.evaluate(StatementAdapter.java:36)
        at app//com.carrotsearch.randomizedtesting.rules.StatementAdapter.evaluate(StatementAdapter.java:36)
        at app//org.apache.lucene.tests.util.AbstractBeforeAfterRule$1.evaluate(AbstractBeforeAfterRule.java:43)
        at app//com.carrotsearch.randomizedtesting.rules.SystemPropertiesRestoreRule$1.evaluate(SystemPropertiesRestoreRule.java:80)
        at app//org.junit.rules.RunRules.evaluate(RunRules.java:20)
        at app//org.apache.lucene.tests.util.AbstractBeforeAfterRule$1.evaluate(AbstractBeforeAfterRule.java:43)
        at app//com.carrotsearch.randomizedtesting.rules.StatementAdapter.evaluate(StatementAdapter.java:36)
        at app//org.apache.lucene.tests.util.TestRuleStoreClassName$1.evaluate(TestRuleStoreClassName.java:38)
        at app//com.carrotsearch.randomizedtesting.rules.NoShadowingOrOverridesOnMethodsRule$1.evaluate(NoShadowingOrOverridesOnMethodsRule.java:40)
        at app//com.carrotsearch.randomizedtesting.rules.NoShadowingOrOverridesOnMethodsRule$1.evaluate(NoShadowingOrOverridesOnMethodsRule.java:40)
        at app//com.carrotsearch.randomizedtesting.rules.StatementAdapter.evaluate(StatementAdapter.java:36)
        at app//com.carrotsearch.randomizedtesting.rules.StatementAdapter.evaluate(StatementAdapter.java:36)
        at app//org.apache.lucene.tests.util.TestRuleAssertionsRequired$1.evaluate(TestRuleAssertionsRequired.java:53)
        at app//org.apache.lucene.tests.util.AbstractBeforeAfterRule$1.evaluate(AbstractBeforeAfterRule.java:43)
        at app//org.apache.lucene.tests.util.TestRuleMarkFailure$1.evaluate(TestRuleMarkFailure.java:44)
        at app//org.apache.lucene.tests.util.TestRuleIgnoreAfterMaxFailures$1.evaluate(TestRuleIgnoreAfterMaxFailures.java:60)
        at app//org.apache.lucene.tests.util.TestRuleIgnoreTestSuites$1.evaluate(TestRuleIgnoreTestSuites.java:47)
        at app//org.junit.rules.RunRules.evaluate(RunRules.java:20)
        at app//com.carrotsearch.randomizedtesting.rules.StatementAdapter.evaluate(StatementAdapter.java:36)
        at app//com.carrotsearch.randomizedtesting.ThreadLeakControl$StatementRunner.run(ThreadLeakControl.java:390)
        at app//com.carrotsearch.randomizedtesting.ThreadLeakControl.lambda$forkTimeoutingTask$0(ThreadLeakControl.java:850)
        at java.base@21.0.12.1/java.lang.Thread.run(Thread.java:1583)

        Caused by:
        org.eclipse.jetty.io.EofException: Broken pipe
            at app//org.eclipse.jetty.io.SocketChannelEndPoint.flush(SocketChannelEndPoint.java:118)
            at app//org.eclipse.jetty.io.WriteFlusher.flush(WriteFlusher.java:419)
            at app//org.eclipse.jetty.io.WriteFlusher.write(WriteFlusher.java:272)
            at app//org.eclipse.jetty.io.WriteFlusher.write(WriteFlusher.java:251)
            at app//org.eclipse.jetty.io.AbstractEndPoint.write(AbstractEndPoint.java:368)
            at app//org.eclipse.jetty.http2.internal.HTTP2Flusher.process(HTTP2Flusher.java:331)
            at app//org.eclipse.jetty.util.IteratingCallback.processing(IteratingCallback.java:253)
            at app//org.eclipse.jetty.util.IteratingCallback.iterate(IteratingCallback.java:232)
            at app//org.eclipse.jetty.http2.HTTP2Session.frame(HTTP2Session.java:956)
            at app//org.eclipse.jetty.http2.HTTP2Session.data(HTTP2Session.java:943)
            at app//org.eclipse.jetty.http2.HTTP2Stream.data(HTTP2Stream.java:158)
            at app//org.eclipse.jetty.http2.client.transport.internal.HttpSenderOverHTTP2.sendContent(HttpSenderOverHTTP2.java:172)
            at app//org.eclipse.jetty.client.transport.HttpSender$ContentSender.process(HttpSender.java:572)
            at app//org.eclipse.jetty.util.IteratingCallback.processing(IteratingCallback.java:253)
            at app//org.eclipse.jetty.util.IteratingCallback.succeeded(IteratingCallback.java:398)
            at app//org.eclipse.jetty.io.content.AsyncContent.runDemandCallback(AsyncContent.java:238)
            at app//org.eclipse.jetty.io.content.AsyncContent.invokeDemandCallback(AsyncContent.java:231)
            at app//org.eclipse.jetty.util.thread.SerializedInvoker$Link.run(SerializedInvoker.java:268)
            at app//org.eclipse.jetty.util.thread.SerializedInvoker.run(SerializedInvoker.java:168)
            at app//org.eclipse.jetty.io.content.AsyncContent.offer(AsyncContent.java:117)
            at app//org.eclipse.jetty.io.content.AsyncContent.write(AsyncContent.java:74)
            at app//org.eclipse.jetty.io.content.OutputStreamContentSource$AsyncOutputStream.write(OutputStreamContentSource.java:89)
            at app//org.apache.solr.common.util.FastOutputStream.flush(FastOutputStream.java:207)
            at app//org.apache.solr.common.util.FastOutputStream.flushBuffer(FastOutputStream.java:200)
            at app//org.apache.solr.common.util.JavaBinCodec.marshal(JavaBinCodec.java:174)
            at app//org.apache.solr.client.solrj.request.JavaBinUpdateRequestCodec.marshal(JavaBinUpdateRequestCodec.java:88)
            at app//org.apache.solr.client.solrj.request.JavaBinRequestWriter$1.write(JavaBinRequestWriter.java:42)
            at app//org.apache.solr.client.solrj.jetty.HttpJettySolrClient.sendRequest(HttpJettySolrClient.java:758)
            at app//org.apache.solr.client.solrj.jetty.HttpJettySolrClient.request(HttpJettySolrClient.java:481)
            ... 61 more

            Caused by:
            java.io.IOException: Broken pipe
                at java.base/sun.nio.ch.SocketDispatcher.writev0(Native Method)
                at java.base/sun.nio.ch.SocketDispatcher.writev(SocketDispatcher.java:70)
                at java.base/sun.nio.ch.IOUtil.write(IOUtil.java:227)
                at java.base/sun.nio.ch.IOUtil.write(IOUtil.java:158)
                at java.base/sun.nio.ch.SocketChannelImpl.write(SocketChannelImpl.java:574)
                at java.base/java.nio.channels.SocketChannel.write(SocketChannel.java:660)
                at org.eclipse.jetty.io.SocketChannelEndPoint.flush(SocketChannelEndPoint.java:112)
                ... 89 more

org.apache.solr.cloud.RecoveryAfterSoftCommitTest > test suite's output saved to /home/jenkins/jenkins-agent/workspace/Solr/Solr-Test-10.x/solr/core/build/test-results/test/outputs/OUTPUT-org.apache.solr.cloud.RecoveryAfterSoftCommitTest.txt, copied below:
  2> 171482 INFO  (SUITE-RecoveryAfterSoftCommitTest-seed#[4F0352C40482B2DA]-worker) [] o.a.s.SolrTestCase Setting 'solr.configset.default.confdir' system property to test-framework derived value of '/home/jenkins/jenkins-agent/workspace/Solr/Solr-Test-10.x/solr/server/solr/configsets/_default/conf'
  2> 171483 INFO  (SUITE-RecoveryAfterSoftCommitTest-seed#[4F0352C40482B2DA]-worker) [] o.a.s.SolrTestCaseJ4 Created dataDir: /home/jenkins/jenkins-agent/workspace/Solr/Solr-Test-10.x/solr/core/build/tmp/tests-tmp/org.apache.solr.cloud.RecoveryAfterSoftCommitTest_4F0352C40482B2DA-001/data-dir-28-001
  2> 171483 INFO  (SUITE-RecoveryAfterSoftCommitTest-seed#[4F0352C40482B2DA]-worker) [] o.a.s.u.ErrorLogMuter Creating ErrorLogMuter-regex-32 for ERROR logs matching regex: ignore_exception
  2> 171483 INFO  (SUITE-RecoveryAfterSoftCommitTest-seed#[4F0352C40482B2DA]-worker) [] o.a.s.SolrTestCaseJ4 Using PointFields (NUMERIC_POINTS_SYSPROP=true) w/NUMERIC_DOCVALUES_SYSPROP=false
  2> 171484 INFO  (SUITE-RecoveryAfterSoftCommitTest-seed#[4F0352C40482B2DA]-worker) [] o.a.s.SolrTestCaseJ4 Randomized ssl (false) and clientAuth (false) via: @org.apache.solr.SolrTestCaseJ4.SuppressSSL(bugUrl="None")
  2> 171484 INFO  (SUITE-RecoveryAfterSoftCommitTest-seed#[4F0352C40482B2DA]-worker) [] o.a.s.SolrTestCaseJ4 SecureRandom sanity checks: test.solr.allowed.securerandom=null & java.security.egd=file:/dev/./urandom
  2> 171489 INFO  (TEST-RecoveryAfterSoftCommitTest.test-seed#[4F0352C40482B2DA]) [] o.a.s.c.ZkTestServer STARTING ZK TEST SERVER
  2> 171490 INFO  (ZkTestServer Run Thread) [] o.a.s.c.ZkTestServer client port: /127.0.0.1:0
  2> 171490 INFO  (ZkTestServer Run Thread) [] o.a.s.c.ZkTestServer Starting server
  2> 171491 WARN  (ZkTestServer Run Thread) [] o.a.z.s.ServerCnxnFactory maxCnxns is not configured, using default value 0.
  2> 171590 INFO  (TEST-RecoveryAfterSoftCommitTest.test-seed#[4F0352C40482B2DA]) [] o.a.s.c.ZkTestServer start zk server on port: 33119
  2> 171591 WARN  (TEST-RecoveryAfterSoftCommitTest.test-seed#[4F0352C40482B2DA]) [] o.a.s.c.c.SolrZkClient Using default ZkCredentialsInjector. ZkCredentialsInjector is not secure, it creates an empty list of credentials which leads to 'OPEN_ACL_UNSAFE' ACLs to Zookeeper nodes
  2> 171591 WARN  (TEST-RecoveryAfterSoftCommitTest.test-seed#[4F0352C40482B2DA]) [] o.a.s.c.c.SolrZkClient Using default ZkACLProvider. DefaultZkACLProvider is not secure, it creates 'OPEN_ACL_UNSAFE' ACLs to Zookeeper nodes
  2> 171592 INFO  (TEST-RecoveryAfterSoftCommitTest.test-seed#[4F0352C40482B2DA]) [] o.a.c.f.i.CuratorFrameworkImpl Starting
  2> 171593 INFO  (TEST-RecoveryAfterSoftCommitTest.test-seed#[4F0352C40482B2DA]) [] o.a.c.f.i.CuratorFrameworkImpl Default schema
  2> 171594 INFO  (TEST-RecoveryAfterSoftCommitTest.test-seed#[4F0352C40482B2DA]-EventThread) [] o.a.c.f.s.ConnectionStateManager State change: CONNECTED
  2> 171595 INFO  (TEST-RecoveryAfterSoftCommitTest.test-seed#[4F0352C40482B2DA]-EventThread) [] o.a.c.f.i.EnsembleTracker New config event received: {}
  2> 171595 INFO  (TEST-RecoveryAfterSoftCommitTest.test-seed#[4F0352C40482B2DA]-EventThread) [] o.a.c.f.i.EnsembleTracker New config event received: {}
  2> 171596 WARN  (TEST-RecoveryAfterSoftCommitTest.test-seed#[4F0352C40482B2DA]) [] o.a.s.c.c.SolrZkClient Using default ZkCredentialsInjector. ZkCredentialsInjector is not secure, it creates an empty list of credentials which leads to 'OPEN_ACL_UNSAFE' ACLs to Zookeeper nodes
  2> 171596 WARN  (TEST-RecoveryAfterSoftCommitTest.test-seed#[4F0352C40482B2DA]) [] o.a.s.c.c.SolrZkClient Using default ZkACLProvider. DefaultZkACLProvider is not secure, it creates 'OPEN_ACL_UNSAFE' ACLs to Zookeeper nodes
  2> 171596 INFO  (TEST-RecoveryAfterSoftCommitTest.test-seed#[4F0352C40482B2DA]) [] o.a.c.f.i.CuratorFrameworkImpl Starting
  2> 171597 INFO  (TEST-RecoveryAfterSoftCommitTest.test-seed#[4F0352C40482B2DA]) [] o.a.c.f.i.CuratorFrameworkImpl Default schema
  2> 171598 INFO  (TEST-RecoveryAfterSoftCommitTest.test-seed#[4F0352C40482B2DA]-EventThread) [] o.a.c.f.s.ConnectionStateManager State change: CONNECTED
  2> 171599 INFO  (TEST-RecoveryAfterSoftCommitTest.test-seed#[4F0352C40482B2DA]-EventThread) [] o.a.c.f.i.EnsembleTracker New config event received: {}
  2> 171599 INFO  (TEST-RecoveryAfterSoftCommitTest.test-seed#[4F0352C40482B2DA]-EventThread) [] o.a.c.f.i.EnsembleTracker New config event received: {}
  2> 171601 INFO  (TEST-RecoveryAfterSoftCommitTest.test-seed#[4F0352C40482B2DA]) [] o.a.s.c.ZkTestServer put /home/jenkins/jenkins-agent/workspace/Solr/Solr-Test-10.x/solr/core/build/resources/test/solr/collection1/conf/solrconfig-tlog.xml to /configs/conf1/solrconfig.xml
  2> 171602 INFO  (TEST-RecoveryAfterSoftCommitTest.test-seed#[4F0352C40482B2DA]) [] o.a.s.c.ZkTestServer put /home/jenkins/jenkins-agent/workspace/Solr/Solr-Test-10.x/solr/core/build/resources/test/solr/collection1/conf/schema.xml to /configs/conf1/schema.xml
  2> 171603 INFO  (TEST-RecoveryAfterSoftCommitTest.test-seed#[4F0352C40482B2DA]) [] o.a.s.c.ZkTestServer put /home/jenkins/jenkins-agent/workspace/Solr/Solr-Test-10.x/solr/core/build/resources/test/solr/collection1/conf/solrconfig.snippet.randomindexconfig.xml to /configs/conf1/solrconfig.snippet.randomindexconfig.xml
  2> 171604 INFO  (TEST-RecoveryAfterSoftCommitTest.test-seed#[4F0352C40482B2DA]) [] o.a.s.c.ZkTestServer put /home/jenkins/jenkins-agent/workspace/Solr/Solr-Test-10.x/solr/core/build/resources/test/solr/collection1/conf/stopwords.txt to /configs/conf1/stopwords.txt
  2> 171605 INFO  (TEST-RecoveryAfterSoftCommitTest.test-seed#[4F0352C40482B2DA]) [] o.a.s.c.ZkTestServer put /home/jenkins/jenkins-agent/workspace/Solr/Solr-Test-10.x/solr/core/build/resources/test/solr/collection1/conf/protwords.txt to /configs/conf1/protwords.txt
  2> 171606 INFO  (TEST-RecoveryAfterSoftCommitTest.test-seed#[4F0352C40482B2DA]) [] o.a.s.c.ZkTestServer put /home/jenkins/jenkins-agent/workspace/Solr/Solr-Test-10.x/solr/core/build/resources/test/solr/collection1/conf/currency.xml to /configs/conf1/currency.xml
  2> 171607 INFO  (TEST-RecoveryAfterSoftCommitTest.test-seed#[4F0352C40482B2DA]) [] o.a.s.c.ZkTestServer put /home/jenkins/jenkins-agent/workspace/Solr/Solr-Test-10.x/solr/core/build/resources/test/solr/collection1/conf/enumsConfig.xml to /configs/conf1/enumsConfig.xml
  2> 171608 INFO  (TEST-RecoveryAfterSoftCommitTest.test-seed#[4F0352C40482B2DA]) [] o.a.s.c.ZkTestServer put /home/jenkins/jenkins-agent/workspace/Solr/Solr-Test-10.x/solr/core/build/resources/test/solr/collection1/conf/open-exchange-rates.json to /configs/conf1/open-exchange-rates.json
  2> 171609 INFO  (TEST-RecoveryAfterSoftCommitTest.test-seed#[4F0352C40482B2DA]) [] o.a.s.c.ZkTestServer put /home/jenkins/jenkins-agent/workspace/Solr/Solr-Test-10.x/solr/core/build/resources/test/solr/collection1/conf/mapping-ISOLatin1Accent.txt to /configs/conf1/mapping-ISOLatin1Accent.txt
  2> 171610 INFO  (TEST-RecoveryAfterSoftCommitTest.test-seed#[4F0352C40482B2DA]) [] o.a.s.c.ZkTestServer put /home/jenkins/jenkins-agent/workspace/Solr/Solr-Test-10.x/solr/core/build/resources/test/solr/collection1/conf/old_synonyms.txt to /configs/conf1/old_synonyms.txt
  2> 171611 INFO  (TEST-RecoveryAfterSoftCommitTest.test-seed#[4F0352C40482B2DA]) [] o.a.s.c.ZkTestServer put /home/jenkins/jenkins-agent/workspace/Solr/Solr-Test-10.x/solr/core/build/resources/test/solr/collection1/conf/synonyms.txt to /configs/conf1/synonyms.txt
  2> 171612 INFO  (TEST-RecoveryAfterSoftCommitTest.test-seed#[4F0352C40482B2DA]) [] o.a.s.c.AbstractFullDistribZkTestBase Will use NRT replicas unless explicitly asked otherwise
  2> 171774 INFO  (TEST-RecoveryAfterSoftCommitTest.test-seed#[4F0352C40482B2DA]) [] o.a.s.e.JettySolrRunner Start Jetty (configured port=0, binding port=0)
  2> 171774 INFO  (TEST-RecoveryAfterSoftCommitTest.test-seed#[4F0352C40482B2DA]) [] o.a.s.e.JettySolrRunner Trying to start Jetty on port 0 try number 2 ...
  2> 171774 INFO  (TEST-RecoveryAfterSoftCommitTest.test-seed#[4F0352C40482B2DA]) [] o.e.j.s.Server jetty-12.0.34; built: 2026-04-01T05:45:03.823Z; git: 57e7adb250592bd15f573e7820be9b64632c6637; jvm 21.0.12.1+1-LTS
  2> 171775 INFO  (TEST-RecoveryAfterSoftCommitTest.test-seed#[4F0352C40482B2DA]) [] o.e.j.s.DefaultSessionIdManager Session workerName=node0
  2> 171776 WARN  (TEST-RecoveryAfterSoftCommitTest.test-seed#[4F0352C40482B2DA]) [] o.e.j.e.s.ServletContextHandler BaseResource file:///home/jenkins/jenkins-agent/workspace/Solr/Solr-Test-10.x/solr/core/build/tmp/tests-cwd/./ is aliased to file:///home/jenkins/jenkins-agent/workspace/Solr/Solr-Test-10.x/solr/core/build/tmp/tests-cwd/ in oeje10s.ServletContextHandler@496bbd62{/solr,/solr,b=file:///home/jenkins/jenkins-agent/workspace/Solr/Solr-Test-10.x/solr/core/build/tmp/tests-cwd/./,a=STOPPED,h=oeje10s.ServletHandler@594383be{STOPPED}}. May not be supported in future releases.
  2> 171776 INFO  (TEST-RecoveryAfterSoftCommitTest.test-seed#[4F0352C40482B2DA]) [] o.e.j.s.h.ContextHandler /solr Base Resource is an alias: file:///home/jenkins/jenkins-agent/workspace/Solr/Solr-Test-10.x/solr/core/build/tmp/tests-cwd/./ -> file:///home/jenkins/jenkins-agent/workspace/Solr/Solr-Test-10.x/solr/core/build/tmp/tests-cwd/
  2> 171776 INFO  (TEST-RecoveryAfterSoftCommitTest.test-seed#[4F0352C40482B2DA]) [] o.e.j.s.h.ContextHandler Started oeje10s.ServletContextHandler@496bbd62{/solr,/solr,b=file:///home/jenkins/jenkins-agent/workspace/Solr/Solr-Test-10.x/solr/core/build/tmp/tests-cwd/,a=AVAILABLE,h=oeje10s.ServletHandler@594383be{STARTED}}
  2> 171777 INFO  (TEST-RecoveryAfterSoftCommitTest.test-seed#[4F0352C40482B2DA]) [] o.a.s.e.JettySolrRunner Jetty properties: {solr.data.dir=/home/jenkins/jenkins-agent/workspace/Solr/Solr-Test-10.x/solr/core/build/tmp/tests-tmp/org.apache.solr.cloud.RecoveryAfterSoftCommitTest_4F0352C40482B2DA-001/tempDir-001/control/data, hostPort=39175, coreRootDirectory=/home/jenkins/jenkins-agent/workspace/Solr/Solr-Test-10.x/solr/core/build/tmp/tests-tmp/org.apache.solr.cloud.RecoveryAfterSoftCommitTest_4F0352C40482B2DA-001/control-001/cores}
  2> 171777 ERROR (TEST-RecoveryAfterSoftCommitTest.test-seed#[4F0352C40482B2DA]) [] o.a.s.u.StartupLoggingUtils Missing Java Option solr.logs.dir. Logging may be missing or incomplete.
  2> 171777 INFO  (TEST-RecoveryAfterSoftCommitTest.test-seed#[4F0352C40482B2DA]) [] o.a.s.s.CoreContainerProvider Using logger factory org.apache.logging.slf4j.Log4jLoggerFactory
  2> 171777 INFO  (TEST-RecoveryAfterSoftCommitTest.test-seed#[4F0352C40482B2DA]) [] o.a.s.s.CoreContainerProvider  ___      _       Welcome to Apache Solr™ version 10.2.0
  2> 171777 INFO  (TEST-RecoveryAfterSoftCommitTest.test-seed#[4F0352C40482B2DA]) [] o.a.s.s.CoreContainerProvider / __| ___| |_ _   Starting in cloud mode on port null
  2> 171777 INFO  (TEST-RecoveryAfterSoftCommitTest.test-seed#[4F0352C40482B2DA]) [] o.a.s.s.CoreContainerProvider \__ \/ _ \ | '_|  Install dir: /home/jenkins/jenkins-agent/workspace/Solr/Solr-Test-10.x/solr
  2> 171777 INFO  (TEST-RecoveryAfterSoftCommitTest.test-seed#[4F0352C40482B2DA]) [] o.a.s.s.CoreContainerProvider |___/\___/_|_|    Start time: 2026-10-01T07:02:58.059283315Z
  2> 171777 INFO  (TEST-RecoveryAfterSoftCommitTest.test-seed#[4F0352C40482B2DA]) [] o.a.s.s.CoreContainerProvider Solr Home: /home/jenkins/jenkins-agent/workspace/Solr/Solr-Test-10.x/solr/core/build/tmp/tests-tmp/org.apache.solr.cloud.RecoveryAfterSoftCommitTest_4F0352C40482B2DA-001/control-001 (source: servlet config: solr.solr.home)
  2> 171777 WARN  (TEST-RecoveryAfterSoftCommitTest.test-seed#[4F0352C40482B2DA]) [] o.a.s.c.c.SolrZkClient Using default ZkCredentialsInjector. ZkCredentialsInjector is not secure, it creates an empty list of credentials which leads to 'OPEN_ACL_UNSAFE' ACLs to Zookeeper nodes
  2> 171777 WARN  (TEST-RecoveryAfterSoftCommitTest.test-seed#[4F0352C40482B2DA]) [] o.a.s.c.c.SolrZkClient Using default ZkACLProvider. DefaultZkACLProvider is not secure, it creates 'OPEN_ACL_UNSAFE' ACLs to Zookeeper nodes
  2> 171777 INFO  (TEST-RecoveryAfterSoftCommitTest.test-seed#[4F0352C40482B2DA]) [] o.a.c.f.i.CuratorFrameworkImpl Starting
  2> 171779 INFO  (TEST-RecoveryAfterSoftCommitTest.test-seed#[4F0352C40482B2DA]) [] o.a.c.f.i.CuratorFrameworkImpl Default schema
  2> 171780 INFO  (TEST-RecoveryAfterSoftCommitTest.test-seed#[4F0352C40482B2DA]-EventThread) [] o.a.c.f.s.ConnectionStateManager State change: CONNECTED
  2> 171780 INFO  (TEST-RecoveryAfterSoftCommitTest.test-seed#[4F0352C40482B2DA]-EventThread) [] o.a.c.f.i.EnsembleTracker New config event received: {}
  2> 171781 INFO  (TEST-RecoveryAfterSoftCommitTest.test-seed#[4F0352C40482B2DA]-EventThread) [] o.a.c.f.i.EnsembleTracker New config event received: {}
  2> 171781 INFO  (Curator-Framework-0) [] o.a.c.f.i.CuratorFrameworkImpl backgroundOperationsLoop exiting
  2> 171882 INFO  (TEST-RecoveryAfterSoftCommitTest.test-seed#[4F0352C40482B2DA]) [] o.a.s.c.SolrXmlConfig Loading solr.xml from /home/jenkins/jenkins-agent/workspace/Solr/Solr-Test-10.x/solr/core/build/tmp/tests-tmp/org.apache.solr.cloud.RecoveryAfterSoftCommitTest_4F0352C40482B2DA-001/control-001/solr.xml
  2> 172553 INFO  (TEST-RecoveryAfterSoftCommitTest.test-seed#[4F0352C40482B2DA]) [] o.a.s.c.OpenTelemetryConfigurator OpenTelemetry tracer enabled with simple propagation only.
  2> 172553 INFO  (TEST-RecoveryAfterSoftCommitTest.test-seed#[4F0352C40482B2DA]) [] o.a.s.m.OtelRuntimeJvmMetrics JVM metrics are disabled
  2> 172561 INFO  (TEST-RecoveryAfterSoftCommitTest.test-seed#[4F0352C40482B2DA]) [] o.a.s.c.ZkContainer Zookeeper client=127.0.0.1:33119/solr
  2> 172561 WARN  (TEST-RecoveryAfterSoftCommitTest.test-seed#[4F0352C40482B2DA]) [] o.a.s.c.c.SolrZkClient Using default ZkCredentialsInjector. ZkCredentialsInjector is not secure, it creates an empty list of credentials which leads to 'OPEN_ACL_UNSAFE' ACLs to Zookeeper nodes
  2> 172561 WARN  (TEST-RecoveryAfterSoftCommitTest.test-seed#[4F0352C40482B2DA]) [] o.a.s.c.c.SolrZkClient Using default ZkACLProvider. DefaultZkACLProvider is not secure, it creates 'OPEN_ACL_UNSAFE' ACLs to Zookeeper nodes
  2> 172561 INFO  (TEST-RecoveryAfterSoftCommitTest.test-seed#[4F0352C40482B2DA]) [] o.a.c.f.i.CuratorFrameworkImpl Starting
  2> 172562 INFO  (TEST-RecoveryAfterSoftCommitTest.test-seed#[4F0352C40482B2DA]) [] o.a.c.f.i.CuratorFrameworkImpl Default schema
  2> 172563 INFO  (TEST-RecoveryAfterSoftCommitTest.test-seed#[4F0352C40482B2DA]-EventThread) [] o.a.c.f.s.ConnectionStateManager State change: CONNECTED
  2> 172564 INFO  (TEST-RecoveryAfterSoftCommitTest.test-seed#[4F0352C40482B2DA]-EventThread) [] o.a.c.f.i.EnsembleTracker New config event received: {}
  2> 172564 INFO  (TEST-RecoveryAfterSoftCommitTest.test-seed#[4F0352C40482B2DA]-EventThread) [] o.a.c.f.i.EnsembleTracker New config event received: {}
  2> 172564 INFO  (Curator-Framework-0) [] o.a.c.f.i.CuratorFrameworkImpl backgroundOperationsLoop exiting
  2> 172665 INFO  (TEST-RecoveryAfterSoftCommitTest.test-seed#[4F0352C40482B2DA]) [n:127.0.0.1:39175_solr] o.a.c.f.i.CuratorFrameworkImpl Starting
  2> 172667 INFO  (TEST-RecoveryAfterSoftCommitTest.test-seed#[4F0352C40482B2DA]) [n:127.0.0.1:39175_solr] o.a.c.f.i.CuratorFrameworkImpl Default schema
  2> 172668 INFO  (TEST-RecoveryAfterSoftCommitTest.test-seed#[4F0352C40482B2DA]-EventThread) [] o.a.c.f.s.ConnectionStateManager State change: CONNECTED
  2> 172668 INFO  (TEST-RecoveryAfterSoftCommitTest.test-seed#[4F0352C40482B2DA]-EventThread) [] o.a.c.f.i.EnsembleTracker New config event received: {}
  2> 172669 INFO  (TEST-RecoveryAfterSoftCommitTest.test-seed#[4F0352C40482B2DA]-EventThread) [] o.a.c.f.i.EnsembleTracker New config event received: {}
  2> 172687 WARN  (TEST-RecoveryAfterSoftCommitTest.test-seed#[4F0352C40482B2DA]) [n:127.0.0.1:39175_solr] o.a.s.c.ZkController Contents of zookeeper /security.json are world-readable; consider setting up ACLs as described in https://solr.apache.org/guide/solr/latest/deployment-guide/zookeeper-access-control.html
  2> 172690 INFO  (TEST-RecoveryAfterSoftCommitTest.test-seed#[4F0352C40482B2DA]) [n:127.0.0.1:39175_solr] o.a.s.c.ZkController The Overseer is enabled.  It will process all cluster commands & state updates.
  2> 172693 INFO  (TEST-RecoveryAfterSoftCommitTest.test-seed#[4F0352C40482B2DA]) [n:127.0.0.1:39175_solr] o.a.s.c.OverseerElectionContext I am going to be the leader 127.0.0.1:39175_solr
  2> 172694 INFO  (TEST-RecoveryAfterSoftCommitTest.test-seed#[4F0352C40482B2DA]) [n:127.0.0.1:39175_solr] o.a.s.c.Overseer Overseer (id=72057755708293124-127.0.0.1:39175_solr-n_0000000000) starting
  2> 172698 INFO  (TEST-RecoveryAfterSoftCommitTest.test-seed#[4F0352C40482B2DA]) [n:127.0.0.1:39175_solr] o.a.s.c.ZkController Register node as live in ZooKeeper: /live_nodes/127.0.0.1:39175_solr
  2> 172698 INFO  (OverseerStateUpdate-72057755708293124-127.0.0.1:39175_solr-n_0000000000) [n:127.0.0.1:39175_solr] o.a.s.c.Overseer Starting to work on the main queue : 127.0.0.1:39175_solr
  2> 172700 INFO  (OverseerStateUpdate-72057755708293124-127.0.0.1:39175_solr-n_0000000000) [n:127.0.0.1:39175_solr] o.a.s.c.c.ZkStateReader Updated live nodes from ZooKeeper... (0) -> (1)
  2> 172702 WARN  (TEST-RecoveryAfterSoftCommitTest.test-seed#[4F0352C40482B2DA]) [n:127.0.0.1:39175_solr] o.a.s.c.CoreContainer Not all security plugins configured!  authentication=disabled authorization=disabled.  Solr is only as secure as you make it. Consider configuring authentication/authorization before exposing Solr to users internal or external.  See https://s.apache.org/solrsecurity for more info
  2> 172761 INFO  (TEST-RecoveryAfterSoftCommitTest.test-seed#[4F0352C40482B2DA]) [n:127.0.0.1:39175_solr] o.a.s.c.CorePropertiesLocator Found 0 core definitions underneath /home/jenkins/jenkins-agent/workspace/Solr/Solr-Test-10.x/solr/core/build/tmp/tests-tmp/org.apache.solr.cloud.RecoveryAfterSoftCommitTest_4F0352C40482B2DA-001/control-001/cores
  2> 172822 INFO  (TEST-RecoveryAfterSoftCommitTest.test-seed#[4F0352C40482B2DA]) [n:127.0.0.1:39175_solr] o.e.j.e.s.ServletContextHandler Started oeje10s.ServletContextHandler@496bbd62{/solr,/solr,b=file:///home/jenkins/jenkins-agent/workspace/Solr/Solr-Test-10.x/solr/core/build/tmp/tests-cwd/,a=AVAILABLE,h=oeje10s.ServletHandler@594383be{STARTED}}
  2> 172822 INFO  (TEST-RecoveryAfterSoftCommitTest.test-seed#[4F0352C40482B2DA]) [n:127.0.0.1:39175_solr] o.e.j.s.AbstractConnector Started ServerConnector@20db5832{HTTP/1.1, (http/1.1, h2c)}{127.0.0.1:35927}
  2> 172822 INFO  (TEST-RecoveryAfterSoftCommitTest.test-seed#[4F0352C40482B2DA]) [n:127.0.0.1:39175_solr] o.e.j.s.Server Started oejs.Server@20fda46b{STARTING}[12.0.34,sto=0] @172841ms
  2> 172825 WARN  (TEST-RecoveryAfterSoftCommitTest.test-seed#[4F0352C40482B2DA]) [] o.a.s.c.c.SolrZkClient Using default ZkCredentialsInjector. ZkCredentialsInjector is not secure, it creates an empty list of credentials which leads to 'OPEN_ACL_UNSAFE' ACLs to Zookeeper nodes
  2> 172825 WARN  (TEST-RecoveryAfterSoftCommitTest.test-seed#[4F0352C40482B2DA]) [] o.a.s.c.c.SolrZkClient Using default ZkACLProvider. DefaultZkACLProvider is not secure, it creates 'OPEN_ACL_UNSAFE' ACLs to Zookeeper nodes
  2> 172826 INFO  (TEST-RecoveryAfterSoftCommitTest.test-seed#[4F0352C40482B2DA]) [] o.a.c.f.i.CuratorFrameworkImpl Starting
  2> 172827 INFO  (TEST-RecoveryAfterSoftCommitTest.test-seed#[4F0352C40482B2DA]) [] o.a.c.f.i.CuratorFrameworkImpl Default schema
  2> 172828 INFO  (TEST-RecoveryAfterSoftCommitTest.test-seed#[4F0352C40482B2DA]-EventThread) [] o.a.c.f.s.ConnectionStateManager State change: CONNECTED
  2> 172829 INFO  (TEST-RecoveryAfterSoftCommitTest.test-seed#[4F0352C40482B2DA]-EventThread) [] o.a.c.f.i.EnsembleTracker New config event received: {}
  2> 172829 INFO  (TEST-RecoveryAfterSoftCommitTest.test-seed#[4F0352C40482B2DA]-EventThread) [] o.a.c.f.i.EnsembleTracker New config event received: {}
  2> 172830 INFO  (TEST-RecoveryAfterSoftCommitTest.test-seed#[4F0352C40482B2DA]) [] o.a.s.c.c.ZkStateReader Updated live nodes from ZooKeeper... (0) -> (1)
  2> 172831 INFO  (TEST-RecoveryAfterSoftCommitTest.test-seed#[4F0352C40482B2DA]) [] o.a.s.c.s.i.ZkClientClusterStateProvider Cluster at 127.0.0.1:33119/solr ready
  2> 172832 INFO  (SocketProxy-Acceptor-39175) [] o.a.s.u.SocketProxy accepted Socket[addr=/127.0.0.1,port=56276,localport=39175], receiveBufferSize: 65536
  2> 172834 INFO  (SocketProxy-Acceptor-39175) [] o.a.s.u.SocketProxy proxy connection Socket[addr=/127.0.0.1,port=35927,localport=58192], receiveBufferSize=65536
  2> 172840 INFO  (OverseerThreadFactory-2654-thread-1) [ c:control_collection t:null-2977] o.a.s.c.a.c.CreateCollectionCmd Create collection control_collection
  2> 172840 INFO  (OverseerThreadFactory-2654-thread-1) [ c:control_collection t:null-2977] o.a.s.c.a.c.CreateCollectionCmd solr.cloud.prs.enabled : false and collection prs : null, isPRS : false
  2> 172844 INFO  (OverseerThreadFactory-2654-thread-1) [ c:control_collection t:null-2977] o.a.s.c.c.ZkStateReader /collections/control_collection/state.json is deleted, stop watching children
  2> 172845 INFO  (zkCallback-2648-thread-1) [] o.a.s.c.c.ZkStateReader A cluster state change: [WatchedEvent state:SyncConnected type:NodeCreated path:/collections/control_collection/state.json zxid: -1] for collection [control_collection] has occurred - updating... (live nodes size: [1])
  2> 172851 INFO  (OverseerStateUpdate-72057755708293124-127.0.0.1:39175_solr-n_0000000000) [n:127.0.0.1:39175_solr] o.a.s.c.o.SliceMutator createReplica() {
  2>   "core":"control_collection_shard1_replica_n1",
  2>   "node_name":"127.0.0.1:39175_solr",
  2>   "base_url":"http://127.0.0.1:39175/solr",
  2>   "collection":"control_collection",
  2>   "shard":"shard1",
  2>   "state":"down",
  2>   "type":"NRT",
  2>   "operation":"ADDREPLICA",
  2>   "waitForFinalState":"false"} 
  2> 172954 INFO  (zkCallback-2648-thread-1) [] o.a.s.c.c.ZkStateReader A cluster state change: [WatchedEvent state:SyncConnected type:NodeDataChanged path:/collections/control_collection/state.json zxid: -1] for collection [control_collection] has occurred - updating... (live nodes size: [1])
  2> 172957 INFO  (SocketProxy-Acceptor-39175) [] o.a.s.u.SocketProxy accepted Socket[addr=/127.0.0.1,port=56286,localport=39175], receiveBufferSize: 65536
  2> 172957 INFO  (SocketProxy-Acceptor-39175) [] o.a.s.u.SocketProxy proxy connection Socket[addr=/127.0.0.1,port=35927,localport=58208], receiveBufferSize=65536
  2> 172959 INFO  (qtp2124952800-4221-null-2977) [n:127.0.0.1:39175_solr x:control_collection_shard1_replica_n1 t:null-2977] o.a.s.h.a.a.CreateCore core create command "org.apache.solr.client.api.model.CreateCoreParams@56637ede"
  2> 173006 INFO  (qtp2124952800-4221-null-2977) [n:127.0.0.1:39175_solr c:control_collection s:shard1 r:core_node2 x:control_collection_shard1_replica_n1 t:null-2977] o.a.s.s.IndexSchema Loaded schema test/1.0 with uniqueid field id
  2> 173025 INFO  (qtp2124952800-4221-null-2977) [n:127.0.0.1:39175_solr c:control_collection s:shard1 r:core_node2 x:control_collection_shard1_replica_n1 t:null-2977] o.a.s.c.CoreContainer Creating SolrCore 'control_collection_shard1_replica_n1' using configuration from configset conf1
  2> 173026 INFO  (qtp2124952800-4221-null-2977) [n:127.0.0.1:39175_solr c:control_collection s:shard1 r:core_node2 x:control_collection_shard1_replica_n1 t:null-2977] o.a.s.c.SolrCore Opening new SolrCore at [/home/jenkins/jenkins-agent/workspace/Solr/Solr-Test-10.x/solr/core/build/tmp/tests-tmp/org.apache.solr.cloud.RecoveryAfterSoftCommitTest_4F0352C40482B2DA-001/control-001/cores/control_collection_shard1_replica_n1], dataDir=[/home/jenkins/jenkins-agent/workspace/Solr/Solr-Test-10.x/solr/core/build/tmp/tests-tmp/org.apache.solr.cloud.RecoveryAfterSoftCommitTest_4F0352C40482B2DA-001/control-001/cores/control_collection_shard1_replica_n1/data/]
  2> 173027 INFO  (qtp2124952800-4221-null-2977) [n:127.0.0.1:39175_solr c:control_collection s:shard1 r:core_node2 x:control_collection_shard1_replica_n1 t:null-2977] o.a.s.u.RandomMergePolicy RandomMergePolicy wrapping class org.apache.lucene.index.LogByteSizeMergePolicy: [LogByteSizeMergePolicy: minMergeSize=16777216, mergeFactor=21, maxMergeSize=2147483648, maxMergeSizeForForcedMerge=9223372036854775807, calibrateSizeByDeletes=true, maxMergeDocs=2147483647, maxCFSSegmentSizeMB=8.796093022208E12, noCFSRatio=1.0]
  2> 173032 WARN  (qtp2124952800-4221-null-2977) [n:127.0.0.1:39175_solr c:control_collection s:shard1 r:core_node2 x:control_collection_shard1_replica_n1 t:null-2977] o.a.s.c.RequestHandlers INVALID paramSet a in requestHandler {type = requestHandler,name = /dump,class = DumpRequestHandler,attributes = {initParams=a, name=/dump, class=DumpRequestHandler},args = {defaults={a=A, b=B}}}
  2> 173064 INFO  (qtp2124952800-4221-null-2977) [n:127.0.0.1:39175_solr c:control_collection s:shard1 r:core_node2 x:control_collection_shard1_replica_n1 t:null-2977] o.a.s.u.UpdateLog Initializing UpdateLog: dataDir= defaultSyncLevel=FLUSH numRecordsToKeep=2 maxNumLogsToKeep=10
  2> 173064 INFO  (qtp2124952800-4221-null-2977) [n:127.0.0.1:39175_solr c:control_collection s:shard1 r:core_node2 x:control_collection_shard1_replica_n1 t:null-2977] o.a.s.u.CommitTracker Hard AutoCommit: disabled
  2> 173064 INFO  (qtp2124952800-4221-null-2977) [n:127.0.0.1:39175_solr c:control_collection s:shard1 r:core_node2 x:control_collection_shard1_replica_n1 t:null-2977] o.a.s.u.CommitTracker Soft AutoCommit: disabled
  2> 173065 INFO  (qtp2124952800-4221-null-2977) [n:127.0.0.1:39175_solr c:control_collection s:shard1 r:core_node2 x:control_collection_shard1_replica_n1 t:null-2977] o.a.s.u.RandomMergePolicy RandomMergePolicy wrapping class org.apache.lucene.index.LogByteSizeMergePolicy: [LogByteSizeMergePolicy: minMergeSize=16777216, mergeFactor=49, maxMergeSize=2147483648, maxMergeSizeForForcedMerge=9223372036854775807, calibrateSizeByDeletes=false, maxMergeDocs=2147483647, maxCFSSegmentSizeMB=8.796093022208E12, noCFSRatio=0.7875391179454757]
  2> 173067 INFO  (qtp2124952800-4221-null-2977) [n:127.0.0.1:39175_solr c:control_collection s:shard1 r:core_node2 x:control_collection_shard1_replica_n1 t:null-2977] o.a.s.r.ManagedResourceStorage Configured ZooKeeperStorageIO with znodeBase: /configs/conf1
  2> 173068 INFO  (qtp2124952800-4221-null-2977) [n:127.0.0.1:39175_solr c:control_collection s:shard1 r:core_node2 x:control_collection_shard1_replica_n1 t:null-2977] o.a.s.r.ManagedResourceStorage Loaded null at path _rest_managed.json using ZooKeeperStorageIO:path=/configs/conf1
  2> 173068 INFO  (qtp2124952800-4221-null-2977) [n:127.0.0.1:39175_solr c:control_collection s:shard1 r:core_node2 x:control_collection_shard1_replica_n1 t:null-2977] o.a.s.h.ReplicationHandler Commits will be reserved for 10000 ms
  2> 173069 INFO  (searcherExecutor-2665-thread-1-processing-127.0.0.1:39175_solr control_collection_shard1_replica_n1 null-2977 control_collection shard1 core_node2) [n:127.0.0.1:39175_solr c:control_collection s:shard1 r:core_node2 x:control_collection_shard1_replica_n1 t:null-2977] o.a.s.c.SolrCore Registered new searcher autowarm time: 0 ms
  2> 173072 INFO  (qtp2124952800-4221-null-2977) [n:127.0.0.1:39175_solr c:control_collection s:shard1 r:core_node2 x:control_collection_shard1_replica_n1 t:null-2977] o.a.s.c.ZkShardTerms Successful update of terms at /collections/control_collection/terms/shard1 to Terms{values={core_node2=0}, version=0} for registerTerm
  2> 173072 INFO  (qtp2124952800-4221-null-2977) [n:127.0.0.1:39175_solr c:control_collection s:shard1 r:core_node2 x:control_collection_shard1_replica_n1 t:null-2977] o.a.s.c.ShardLeaderElectionContextBase make sure parent is created /collections/control_collection/leaders/shard1
  2> 173078 INFO  (qtp2124952800-4221-null-2977) [n:127.0.0.1:39175_solr c:control_collection s:shard1 r:core_node2 x:control_collection_shard1_replica_n1 t:null-2977] o.a.s.c.ShardLeaderElectionContext Enough replicas found to continue.
  2> 173078 INFO  (qtp2124952800-4221-null-2977) [n:127.0.0.1:39175_solr c:control_collection s:shard1 r:core_node2 x:control_collection_shard1_replica_n1 t:null-2977] o.a.s.c.ShardLeaderElectionContext I may be the new leader - try and sync
  2> 173078 INFO  (qtp2124952800-4221-null-2977) [n:127.0.0.1:39175_solr c:control_collection s:shard1 r:core_node2 x:control_collection_shard1_replica_n1 t:null-2977] o.a.s.c.SyncStrategy Sync replicas to http://127.0.0.1:39175/solr/control_collection_shard1_replica_n1/
  2> 173079 INFO  (qtp2124952800-4221-null-2977) [n:127.0.0.1:39175_solr c:control_collection s:shard1 r:core_node2 x:control_collection_shard1_replica_n1 t:null-2977] o.a.s.c.SyncStrategy Sync Success - now sync replicas to me
  2> 173079 INFO  (qtp2124952800-4221-null-2977) [n:127.0.0.1:39175_solr c:control_collection s:shard1 r:core_node2 x:control_collection_shard1_replica_n1 t:null-2977] o.a.s.c.SyncStrategy http://127.0.0.1:39175/solr/control_collection_shard1_replica_n1/ has no replicas
  2> 173079 INFO  (qtp2124952800-4221-null-2977) [n:127.0.0.1:39175_solr c:control_collection s:shard1 r:core_node2 x:control_collection_shard1_replica_n1 t:null-2977] o.a.s.c.ShardLeaderElectionContextBase Creating leader registration node /collections/control_collection/leaders/shard1/leader after winning as /collections/control_collection/leader_elect/shard1/election/72057755708293124-core_node2-n_0000000000
  2> 173184 INFO  (zkCallback-2648-thread-1) [] o.a.s.c.c.ZkStateReader A cluster state change: [WatchedEvent state:SyncConnected type:NodeDataChanged path:/collections/control_collection/state.json zxid: -1] for collection [control_collection] has occurred - updating... (live nodes size: [1])
  2> 173185 INFO  (qtp2124952800-4221-null-2977) [n:127.0.0.1:39175_solr c:control_collection s:shard1 r:core_node2 x:control_collection_shard1_replica_n1 t:null-2977] o.a.s.c.ShardLeaderElectionContext I am the new leader: http://127.0.0.1:39175/solr/control_collection_shard1_replica_n1/ shard1
  2> 173186 INFO  (qtp2124952800-4221-null-2977) [n:127.0.0.1:39175_solr c:control_collection s:shard1 r:core_node2 x:control_collection_shard1_replica_n1 t:null-2977] o.a.s.c.ZkController I am the leader, no recovery necessary
  2> 173189 INFO  (qtp2124952800-4221-null-2977) [n:127.0.0.1:39175_solr t:null-2977] o.a.s.s.HttpSolrCall [admin] path=/admin/cores params={coreNodeName=core_node2&collection.configName=conf1&newCollection=true&name=control_collection_shard1_replica_n1&action=CREATE&numShards=1&collection=control_collection&shard=shard1&wt=javabin&replicaType=NRT} status=0 QTime=230
  2> 173192 INFO  (qtp2124952800-4218-null-2976) [n:127.0.0.1:39175_solr c:control_collection t:null-2976] o.a.s.h.a.CollectionsHandler Wait for new collection to be active for at most 45 seconds. Check all shard replicas
  2> 173290 INFO  (zkCallback-2648-thread-2) [] o.a.s.c.c.ZkStateReader A cluster state change: [WatchedEvent state:SyncConnected type:NodeDataChanged path:/collections/control_collection/state.json zxid: -1] for collection [control_collection] has occurred - updating... (live nodes size: [1])
  2> 173291 INFO  (qtp2124952800-4218-null-2976) [n:127.0.0.1:39175_solr c:control_collection t:null-2976] o.a.s.s.HttpSolrCall [admin] path=/admin/collections params={collection.configName=conf1&name=control_collection&nrtReplicas=1&action=CREATE&numShards=1&createNodeSet=127.0.0.1:39175_solr&wt=javabin} status=0 QTime=455
  2> 173292 INFO  (TEST-RecoveryAfterSoftCommitTest.test-seed#[4F0352C40482B2DA]) [] o.a.s.c.AbstractFullDistribZkTestBase Waiting to see 1 active replicas in collection: control_collection
  2> 173293 INFO  (Curator-Framework-0) [] o.a.c.f.i.CuratorFrameworkImpl backgroundOperationsLoop exiting
  2> 173398 WARN  (TEST-RecoveryAfterSoftCommitTest.test-seed#[4F0352C40482B2DA]) [] o.a.s.c.c.SolrZkClient Using default ZkCredentialsInjector. ZkCredentialsInjector is not secure, it creates an empty list of credentials which leads to 'OPEN_ACL_UNSAFE' ACLs to Zookeeper nodes
  2> 173398 WARN  (TEST-RecoveryAfterSoftCommitTest.test-seed#[4F0352C40482B2DA]) [] o.a.s.c.c.SolrZkClient Using default ZkACLProvider. DefaultZkACLProvider is not secure, it creates 'OPEN_ACL_UNSAFE' ACLs to Zookeeper nodes
  2> 173398 INFO  (TEST-RecoveryAfterSoftCommitTest.test-seed#[4F0352C40482B2DA]) [] o.a.c.f.i.CuratorFrameworkImpl Starting
  2> 173399 INFO  (TEST-RecoveryAfterSoftCommitTest.test-seed#[4F0352C40482B2DA]) [] o.a.c.f.i.CuratorFrameworkImpl Default schema
  2> 173400 INFO  (TEST-RecoveryAfterSoftCommitTest.test-seed#[4F0352C40482B2DA]-EventThread) [] o.a.c.f.s.ConnectionStateManager State change: CONNECTED
  2> 173401 INFO  (TEST-RecoveryAfterSoftCommitTest.test-seed#[4F0352C40482B2DA]-EventThread) [] o.a.c.f.i.EnsembleTracker New config event received: {}
  2> 173401 INFO  (TEST-RecoveryAfterSoftCommitTest.test-seed#[4F0352C40482B2DA]-EventThread) [] o.a.c.f.i.EnsembleTracker New config event received: {}
  2> 173402 INFO  (TEST-RecoveryAfterSoftCommitTest.test-seed#[4F0352C40482B2DA]) [] o.a.s.c.c.ZkStateReader Updated live nodes from ZooKeeper... (0) -> (1)
  2> 173403 INFO  (TEST-RecoveryAfterSoftCommitTest.test-seed#[4F0352C40482B2DA]) [] o.a.s.c.s.i.ZkClientClusterStateProvider Cluster at 127.0.0.1:33119/solr ready
  2> 173404 INFO  (TEST-RecoveryAfterSoftCommitTest.test-seed#[4F0352C40482B2DA]) [] o.a.s.c.ChaosMonkey monkey: init - expire sessions:false cause connection loss:false
  2> 173405 INFO  (SocketProxy-Acceptor-39175) [] o.a.s.u.SocketProxy accepted Socket[addr=/127.0.0.1,port=56296,localport=39175], receiveBufferSize: 65536
  2> 173406 INFO  (SocketProxy-Acceptor-39175) [] o.a.s.u.SocketProxy proxy connection Socket[addr=/127.0.0.1,port=35927,localport=58220], receiveBufferSize=65536
  2> 173411 INFO  (OverseerThreadFactory-2654-thread-2) [ c:collection1 t:null-2979] o.a.s.c.a.c.CreateCollectionCmd Create collection collection1
  2> 173411 INFO  (OverseerThreadFactory-2654-thread-2) [ c:collection1 t:null-2979] o.a.s.c.a.c.CreateCollectionCmd solr.cloud.prs.enabled : false and collection prs : null, isPRS : false
  2> 173414 INFO  (OverseerThreadFactory-2654-thread-2) [ c:collection1 t:null-2979] o.a.s.c.c.ZkStateReader /collections/collection1/state.json is deleted, stop watching children
  2> 173516 INFO  (zkCallback-2648-thread-2) [] o.a.s.c.c.ZkStateReader A cluster state change: [WatchedEvent state:SyncConnected type:NodeCreated path:/collections/collection1/state.json zxid: -1] for collection [collection1] has occurred - updating... (live nodes size: [1])
  2> 173517 WARN  (OverseerThreadFactory-2654-thread-2) [ c:collection1 t:null-2979] o.a.s.c.a.c.CreateCollectionCmd It is unusual to create a collection (collection1) without cores.
  2> 173519 INFO  (qtp2124952800-4220-null-2978) [n:127.0.0.1:39175_solr c:collection1 t:null-2978] o.a.s.h.a.CollectionsHandler Wait for new collection to be active for at most 45 seconds. Check all shard replicas
  2> 173520 INFO  (qtp2124952800-4220-null-2978) [n:127.0.0.1:39175_solr c:collection1 t:null-2978] o.a.s.s.HttpSolrCall [admin] path=/admin/collections params={collection.configName=conf1&name=collection1&nrtReplicas=1&action=CREATE&numShards=1&createNodeSet=&wt=javabin} status=0 QTime=112
  2> 173521 INFO  (TEST-RecoveryAfterSoftCommitTest.test-seed#[4F0352C40482B2DA]) [] o.a.s.c.AbstractFullDistribZkTestBase Creating jetty instances pullReplicaCount=0 numOtherReplicas=2
  2> 173700 INFO  (TEST-RecoveryAfterSoftCommitTest.test-seed#[4F0352C40482B2DA]) [] o.a.s.c.AbstractFullDistribZkTestBase create jetty 1 in directory /home/jenkins/jenkins-agent/workspace/Solr/Solr-Test-10.x/solr/core/build/tmp/tests-tmp/org.apache.solr.cloud.RecoveryAfterSoftCommitTest_4F0352C40482B2DA-001/shard-1-001 of type NRT for shard1
  2> 173703 INFO  (closeThreadPool-2678-thread-1) [] o.a.s.e.JettySolrRunner Start Jetty (configured port=0, binding port=0)
  2> 173703 INFO  (closeThreadPool-2678-thread-1) [] o.a.s.e.JettySolrRunner Trying to start Jetty on port 0 try number 2 ...
  2> 173703 INFO  (closeThreadPool-2678-thread-1) [] o.e.j.s.Server jetty-12.0.34; built: 2026-04-01T05:45:03.823Z; git: 57e7adb250592bd15f573e7820be9b64632c6637; jvm 21.0.12.1+1-LTS
  2> 173704 INFO  (closeThreadPool-2678-thread-1) [] o.e.j.s.DefaultSessionIdManager Session workerName=node0
  2> 173704 WARN  (closeThreadPool-2678-thread-1) [] o.e.j.e.s.ServletContextHandler BaseResource file:///home/jenkins/jenkins-agent/workspace/Solr/Solr-Test-10.x/solr/core/build/tmp/tests-cwd/./ is aliased to file:///home/jenkins/jenkins-agent/workspace/Solr/Solr-Test-10.x/solr/core/build/tmp/tests-cwd/ in oeje10s.ServletContextHandler@72f0e85a{/solr,/solr,b=file:///home/jenkins/jenkins-agent/workspace/Solr/Solr-Test-10.x/solr/core/build/tmp/tests-cwd/./,a=STOPPED,h=oeje10s.ServletHandler@18dc31d4{STOPPED}}. May not be supported in future releases.
  2> 173705 INFO  (closeThreadPool-2678-thread-1) [] o.e.j.s.h.ContextHandler /solr Base Resource is an alias: file:///home/jenkins/jenkins-agent/workspace/Solr/Solr-Test-10.x/solr/core/build/tmp/tests-cwd/./ -> file:///home/jenkins/jenkins-agent/workspace/Solr/Solr-Test-10.x/solr/core/build/tmp/tests-cwd/
  2> 173705 INFO  (closeThreadPool-2678-thread-1) [] o.e.j.s.h.ContextHandler Started oeje10s.ServletContextHandler@72f0e85a{/solr,/solr,b=file:///home/jenkins/jenkins-agent/workspace/Solr/Solr-Test-10.x/solr/core/build/tmp/tests-cwd/,a=AVAILABLE,h=oeje10s.ServletHandler@18dc31d4{STARTED}}
  2> 173705 INFO  (closeThreadPool-2678-thread-1) [] o.a.s.e.JettySolrRunner Jetty properties: {solrconfig=solrconfig.xml, solr.data.dir=/home/jenkins/jenkins-agent/workspace/Solr/Solr-Test-10.x/solr/core/build/tmp/tests-tmp/org.apache.solr.cloud.RecoveryAfterSoftCommitTest_4F0352C40482B2DA-001/tempDir-001/jetty1, hostPort=42935, coreRootDirectory=/home/jenkins/jenkins-agent/workspace/Solr/Solr-Test-10.x/solr/core/build/tmp/tests-tmp/org.apache.solr.cloud.RecoveryAfterSoftCommitTest_4F0352C40482B2DA-001/shard-1-001/cores}
  2> 173705 ERROR (closeThreadPool-2678-thread-1) [] o.a.s.u.StartupLoggingUtils Missing Java Option solr.logs.dir. Logging may be missing or incomplete.
  2> 173705 INFO  (closeThreadPool-2678-thread-1) [] o.a.s.s.CoreContainerProvider Using logger factory org.apache.logging.slf4j.Log4jLoggerFactory
  2> 173705 INFO  (closeThreadPool-2678-thread-1) [] o.a.s.s.CoreContainerProvider  ___      _       Welcome to Apache Solr™ version 10.2.0
  2> 173705 INFO  (closeThreadPool-2678-thread-1) [] o.a.s.s.CoreContainerProvider / __| ___| |_ _   Starting in cloud mode on port null
  2> 173705 INFO  (closeThreadPool-2678-thread-1) [] o.a.s.s.CoreContainerProvider \__ \/ _ \ | '_|  Install dir: /home/jenkins/jenkins-agent/workspace/Solr/Solr-Test-10.x/solr
  2> 173705 INFO  (closeThreadPool-2678-thread-1) [] o.a.s.s.CoreContainerProvider |___/\___/_|_|    Start time: 2026-10-01T07:02:59.987801909Z
  2> 173705 INFO  (closeThreadPool-2678-thread-1) [] o.a.s.s.CoreContainerProvider Solr Home: /home/jenkins/jenkins-agent/workspace/Solr/Solr-Test-10.x/solr/core/build/tmp/tests-tmp/org.apache.solr.cloud.RecoveryAfterSoftCommitTest_4F0352C40482B2DA-001/shard-1-001 (source: servlet config: solr.solr.home)
  2> 173706 WARN  (closeThreadPool-2678-thread-1) [] o.a.s.c.c.SolrZkClient Using default ZkCredentialsInjector. ZkCredentialsInjector is not secure, it creates an empty list of credentials which leads to 'OPEN_ACL_UNSAFE' ACLs to Zookeeper nodes
  2> 173706 WARN  (closeThreadPool-2678-thread-1) [] o.a.s.c.c.SolrZkClient Using default ZkACLProvider. DefaultZkACLProvider is not secure, it creates 'OPEN_ACL_UNSAFE' ACLs to Zookeeper nodes
  2> 173706 INFO  (closeThreadPool-2678-thread-1) [] o.a.c.f.i.CuratorFrameworkImpl Starting
  2> 173707 INFO  (closeThreadPool-2678-thread-1) [] o.a.c.f.i.CuratorFrameworkImpl Default schema
  2> 173710 INFO  (closeThreadPool-2678-thread-1-EventThread) [] o.a.c.f.s.ConnectionStateManager State change: CONNECTED
  2> 173710 INFO  (closeThreadPool-2678-thread-1-EventThread) [] o.a.c.f.i.EnsembleTracker New config event received: {}
  2> 173710 INFO  (closeThreadPool-2678-thread-1-EventThread) [] o.a.c.f.i.EnsembleTracker New config event received: {}
  2> 173711 INFO  (Curator-Framework-0) [] o.a.c.f.i.CuratorFrameworkImpl backgroundOperationsLoop exiting
  2> 173812 INFO  (closeThreadPool-2678-thread-1) [] o.a.s.c.SolrXmlConfig Loading solr.xml from /home/jenkins/jenkins-agent/workspace/Solr/Solr-Test-10.x/solr/core/build/tmp/tests-tmp/org.apache.solr.cloud.RecoveryAfterSoftCommitTest_4F0352C40482B2DA-001/shard-1-001/solr.xml
  2> 173886 INFO  (TEST-RecoveryAfterSoftCommitTest.test-seed#[4F0352C40482B2DA]) [] o.a.s.c.AbstractFullDistribZkTestBase create jetty 2 in directory /home/jenkins/jenkins-agent/workspace/Solr/Solr-Test-10.x/solr/core/build/tmp/tests-tmp/org.apache.solr.cloud.RecoveryAfterSoftCommitTest_4F0352C40482B2DA-001/shard-2-001 of type NRT for shard1
  2> 173888 INFO  (closeThreadPool-2678-thread-2) [] o.a.s.e.JettySolrRunner Start Jetty (configured port=0, binding port=0)
  2> 173888 INFO  (closeThreadPool-2678-thread-2) [] o.a.s.e.JettySolrRunner Trying to start Jetty on port 0 try number 2 ...
  2> 173888 INFO  (closeThreadPool-2678-thread-2) [] o.e.j.s.Server jetty-12.0.34; built: 2026-04-01T05:45:03.823Z; git: 57e7adb250592bd15f573e7820be9b64632c6637; jvm 21.0.12.1+1-LTS
  2> 173889 INFO  (closeThreadPool-2678-thread-2) [] o.e.j.s.DefaultSessionIdManager Session workerName=node0
  2> 173890 WARN  (closeThreadPool-2678-thread-2) [] o.e.j.e.s.ServletContextHandler BaseResource file:///home/jenkins/jenkins-agent/workspace/Solr/Solr-Test-10.x/solr/core/build/tmp/tests-cwd/./ is aliased to file:///home/jenkins/jenkins-agent/workspace/Solr/Solr-Test-10.x/solr/core/build/tmp/tests-cwd/ in oeje10s.ServletContextHandler@245983fc{/solr,/solr,b=file:///home/jenkins/jenkins-agent/workspace/Solr/Solr-Test-10.x/solr/core/build/tmp/tests-cwd/./,a=STOPPED,h=oeje10s.ServletHandler@3ffb19af{STOPPED}}. May not be supported in future releases.
  2> 173890 INFO  (closeThreadPool-2678-thread-2) [] o.e.j.s.h.ContextHandler /solr Base Resource is an alias: file:///home/jenkins/jenkins-agent/workspace/Solr/Solr-Test-10.x/solr/core/build/tmp/tests-cwd/./ -> file:///home/jenkins/jenkins-agent/workspace/Solr/Solr-Test-10.x/solr/core/build/tmp/tests-cwd/
  2> 173890 INFO  (closeThreadPool-2678-thread-2) [] o.e.j.s.h.ContextHandler Started oeje10s.ServletContextHandler@245983fc{/solr,/solr,b=file:///home/jenkins/jenkins-agent/workspace/Solr/Solr-Test-10.x/solr/core/build/tmp/tests-cwd/,a=AVAILABLE,h=oeje10s.ServletHandler@3ffb19af{STARTED}}
  2> 173891 INFO  (closeThreadPool-2678-thread-2) [] o.a.s.e.JettySolrRunner Jetty properties: {solrconfig=solrconfig.xml, solr.data.dir=/home/jenkins/jenkins-agent/workspace/Solr/Solr-Test-10.x/solr/core/build/tmp/tests-tmp/org.apache.solr.cloud.RecoveryAfterSoftCommitTest_4F0352C40482B2DA-001/tempDir-001/jetty2, hostPort=34669, coreRootDirectory=/home/jenkins/jenkins-agent/workspace/Solr/Solr-Test-10.x/solr/core/build/tmp/tests-tmp/org.apache.solr.cloud.RecoveryAfterSoftCommitTest_4F0352C40482B2DA-001/shard-2-001/cores}
  2> 173891 ERROR (closeThreadPool-2678-thread-2) [] o.a.s.u.StartupLoggingUtils Missing Java Option solr.logs.dir. Logging may be missing or incomplete.
  2> 173891 INFO  (closeThreadPool-2678-thread-2) [] o.a.s.s.CoreContainerProvider Using logger factory org.apache.logging.slf4j.Log4jLoggerFactory
  2> 173891 INFO  (closeThreadPool-2678-thread-2) [] o.a.s.s.CoreContainerProvider  ___      _       Welcome to Apache Solr™ version 10.2.0
  2> 173891 INFO  (closeThreadPool-2678-thread-2) [] o.a.s.s.CoreContainerProvider / __| ___| |_ _   Starting in cloud mode on port null
  2> 173891 INFO  (closeThreadPool-2678-thread-2) [] o.a.s.s.CoreContainerProvider \__ \/ _ \ | '_|  Install dir: /home/jenkins/jenkins-agent/workspace/Solr/Solr-Test-10.x/solr
  2> 173891 INFO  (closeThreadPool-2678-thread-2) [] o.a.s.s.CoreContainerProvider |___/\___/_|_|    Start time: 2026-10-01T07:03:00.173501552Z
  2> 173891 INFO  (closeThreadPool-2678-thread-2) [] o.a.s.s.CoreContainerProvider Solr Home: /home/jenkins/jenkins-agent/workspace/Solr/Solr-Test-10.x/solr/core/build/tmp/tests-tmp/org.apache.solr.cloud.RecoveryAfterSoftCommitTest_4F0352C40482B2DA-001/shard-2-001 (source: servlet config: solr.solr.home)
  2> 173892 WARN  (closeThreadPool-2678-thread-2) [] o.a.s.c.c.SolrZkClient Using default ZkCredentialsInjector. ZkCredentialsInjector is not secure, it creates an empty list of credentials which leads to 'OPEN_ACL_UNSAFE' ACLs to Zookeeper nodes
  2> 173892 WARN  (closeThreadPool-2678-thread-2) [] o.a.s.c.c.SolrZkClient Using default ZkACLProvider. DefaultZkACLProvider is not secure, it creates 'OPEN_ACL_UNSAFE' ACLs to Zookeeper nodes
  2> 173892 INFO  (closeThreadPool-2678-thread-2) [] o.a.c.f.i.CuratorFrameworkImpl Starting
  2> 173893 INFO  (closeThreadPool-2678-thread-2) [] o.a.c.f.i.CuratorFrameworkImpl Default schema
  2> 173894 INFO  (closeThreadPool-2678-thread-2-EventThread) [] o.a.c.f.s.ConnectionStateManager State change: CONNECTED
  2> 173895 INFO  (closeThreadPool-2678-thread-2-EventThread) [] o.a.c.f.i.EnsembleTracker New config event received: {}
  2> 173895 INFO  (closeThreadPool-2678-thread-2-EventThread) [] o.a.c.f.i.EnsembleTracker New config event received: {}
  2> 173895 INFO  (Curator-Framework-0) [] o.a.c.f.i.CuratorFrameworkImpl backgroundOperationsLoop exiting
  2> 173996 INFO  (closeThreadPool-2678-thread-2) [] o.a.s.c.SolrXmlConfig Loading solr.xml from /home/jenkins/jenkins-agent/workspace/Solr/So

[...truncated too long message...]

policy: error adding Permission, java.net.URLPermission:
	java.util.ServiceConfigurationError: Locale provider adapter "CLDR"cannot be instantiated.
java.security.policy: error adding Permission, java.net.URLPermission:
	java.util.ServiceConfigurationError: Locale provider adapter "CLDR"cannot be instantiated.
java.security.policy: error adding Permission, java.net.URLPermission:
	java.util.ServiceConfigurationError: Locale provider adapter "CLDR"cannot be instantiated.
java.security.policy: error adding Permission, java.net.URLPermission:
	java.util.ServiceConfigurationError: Locale provider adapter "CLDR"cannot be instantiated.
java.security.policy: error adding Permission, java.net.URLPermission:
	java.util.ServiceConfigurationError: Locale provider adapter "CLDR"cannot be instantiated.
java.security.policy: error adding Permission, java.net.URLPermission:
	java.util.ServiceConfigurationError: Locale provider adapter "CLDR"cannot be instantiated.
java.security.policy: error adding Permission, java.net.URLPermission:
	java.util.ServiceConfigurationError: Locale provider adapter "CLDR"cannot be instantiated.
java.security.policy: error adding Permission, java.net.URLPermission:
	java.util.ServiceConfigurationError: Locale provider adapter "CLDR"cannot be instantiated.
java.security.policy: error adding Permission, java.net.URLPermission:
	java.util.ServiceConfigurationError: Locale provider adapter "CLDR"cannot be instantiated.
java.security.policy: error adding Permission, java.net.URLPermission:
	java.util.ServiceConfigurationError: Locale provider adapter "CLDR"cannot be instantiated.
java.security.policy: error adding Permission, java.net.URLPermission:
	java.util.ServiceConfigurationError: Locale provider adapter "CLDR"cannot be instantiated.
java.security.policy: error adding Permission, java.net.URLPermission:
	java.util.ServiceConfigurationError: Locale provider adapter "CLDR"cannot be instantiated.
java.security.policy: error adding Permission, java.net.URLPermission:
	java.util.ServiceConfigurationError: Locale provider adapter "CLDR"cannot be instantiated.
java.security.policy: error adding Permission, java.net.URLPermission:
	java.util.ServiceConfigurationError: Locale provider adapter "CLDR"cannot be instantiated.
java.security.policy: error adding Permission, java.net.URLPermission:
	java.util.ServiceConfigurationError: Locale provider adapter "CLDR"cannot be instantiated.
java.security.policy: error adding Permission, java.net.URLPermission:
	java.util.ServiceConfigurationError: Locale provider adapter "CLDR"cannot be instantiated.
java.security.policy: error adding Permission, java.net.URLPermission:
	java.util.ServiceConfigurationError: Locale provider adapter "CLDR"cannot be instantiated.
java.security.policy: error adding Permission, java.net.URLPermission:
	java.util.ServiceConfigurationError: Locale provider adapter "CLDR"cannot be instantiated.
java.security.policy: error adding Permission, java.net.URLPermission:
	java.util.ServiceConfigurationError: Locale provider adapter "CLDR"cannot be instantiated.
:solr:modules:scripting:test (SUCCESS): 24 test(s), 19 skipped

> Task :solr:modules:scripting:wipeTaskTemp
> Task :solr:modules:sql:compileTestJava
> Task :solr:modules:sql:copySolrCoreTestResources
> Task :solr:modules:sql:processTestResources
> Task :solr:modules:sql:testClasses

> Task :solr:modules:sql:test
WARNING: Using incubator modules: jdk.incubator.vector
WARNING: Using incubator modules: jdk.incubator.vector
WARNING: Using incubator modules: jdk.incubator.vector
WARNING: A command line option has enabled the Security Manager
WARNING: The Security Manager is deprecated and will be removed in a future release
WARNING: A command line option has enabled the Security Manager
WARNING: The Security Manager is deprecated and will be removed in a future release
WARNING: A command line option has enabled the Security Manager
WARNING: The Security Manager is deprecated and will be removed in a future release
java.security.policy: error adding Permission, java.net.URLPermission:
	java.util.ServiceConfigurationError: Locale provider adapter "CLDR"cannot be instantiated.
java.security.policy: error adding Permission, java.net.URLPermission:
	java.util.ServiceConfigurationError: Locale provider adapter "CLDR"cannot be instantiated.
java.security.policy: error adding Permission, java.net.URLPermission:
	java.util.ServiceConfigurationError: Locale provider adapter "CLDR"cannot be instantiated.
java.security.policy: error adding Permission, java.net.URLPermission:
	java.util.ServiceConfigurationError: Locale provider adapter "CLDR"cannot be instantiated.
java.security.policy: error adding Permission, java.net.URLPermission:
	java.util.ServiceConfigurationError: Locale provider adapter "CLDR"cannot be instantiated.
java.security.policy: error adding Permission, java.net.URLPermission:
	java.util.ServiceConfigurationError: Locale provider adapter "CLDR"cannot be instantiated.
java.security.policy: error adding Permission, java.net.URLPermission:
	java.util.ServiceConfigurationError: Locale provider adapter "CLDR"cannot be instantiated.
java.security.policy: error adding Permission, java.net.URLPermission:
	java.util.ServiceConfigurationError: Locale provider adapter "CLDR"cannot be instantiated.
java.security.policy: error adding Permission, java.net.URLPermission:
	java.util.ServiceConfigurationError: Locale provider adapter "CLDR"cannot be instantiated.
java.security.policy: error adding Permission, java.net.URLPermission:
	java.util.ServiceConfigurationError: Locale provider adapter "CLDR"cannot be instantiated.
java.security.policy: error adding Permission, java.net.URLPermission:
	java.util.ServiceConfigurationError: Locale provider adapter "CLDR"cannot be instantiated.
java.security.policy: error adding Permission, java.net.URLPermission:
	java.util.ServiceConfigurationError: Locale provider adapter "CLDR"cannot be instantiated.
java.security.policy: error adding Permission, java.net.URLPermission:
	java.util.ServiceConfigurationError: Locale provider adapter "CLDR"cannot be instantiated.
java.security.policy: error adding Permission, java.net.URLPermission:
	java.util.ServiceConfigurationError: Locale provider adapter "CLDR"cannot be instantiated.
java.security.policy: error adding Permission, java.net.URLPermission:
	java.util.ServiceConfigurationError: Locale provider adapter "CLDR"cannot be instantiated.
:solr:modules:sql:test (SUCCESS): 36 test(s)

> Task :checkWorkingCopyClean
> Task :solr:modules:sql:wipeTaskTemp
The slowest tests (exceeding 500 ms) during this run:
  71.03s TestCpuAllowedLimit.testDistribLimit (:solr:core)
  62.69s TestCloudJSONFacetSKG.testRandom (:solr:core)
  60.19s TestCpuAllowedLimit.testDistribLimit2 (:solr:core)
  48.96s PeerSyncReplicationTest.test (:solr:core)
  47.37s TestRandomFaceting.testRandomFaceting (:solr:core)
  46.49s TestInPlaceUpdatesDistrib.test (:solr:core)
  45.81s TestRandomFlRTGCloud.testRandomizedUpdatesAndRTGs (:solr:core)
  40.94s BasicDistributedZkTest.test (:solr:core)
  40.15s HttpJettySolrClientTest.testIdleTimeoutWithHttpClient (:solr:solrj-jetty)
  36.12s TestCoordinatorRole.testNRTRestart (:solr:core)
The slowest suites (exceeding 1s) during this run:
  143.71s TestCpuAllowedLimit (:solr:core)
  80.38s TestRecovery (:solr:core)
  74.10s KnnQParserTest (:solr:core)
  73.93s TestCoordinatorRole (:solr:core)
  67.60s TestTlogReplica (:solr:core)
  67.41s MultiThreadedOCPTest (:solr:core)
  67.17s TestCloudJSONFacetSKG (:solr:core)
  56.66s CombinedQuerySolrCloudTest (:solr:core)
  54.98s TestRangeQuery (:solr:core)
  52.77s ReindexCollectionTest (:solr:core)
ERROR: The following test(s) have failed:
  - org.apache.solr.cloud.RecoveryAfterSoftCommitTest.test (:solr:core)
    Test history: https://develocity.apache.org/scans/tests?search.rootProjectNames=solr-root&tests.container=org.apache.solr.cloud.RecoveryAfterSoftCommitTest&tests.test=test http://fucit.org/solr-jenkins-reports/history-trend-of-recent-failures.html#series/org.apache.solr.cloud.RecoveryAfterSoftCommitTest.test
    Test output: /home/jenkins/jenkins-agent/workspace/Solr/Solr-Test-10.x/solr/core/build/test-results/test/outputs/OUTPUT-org.apache.solr.cloud.RecoveryAfterSoftCommitTest.txt
    Reproduce with: ./gradlew :solr:core:test --tests "org.apache.solr.cloud.RecoveryAfterSoftCommitTest.test" -Ptests.haltonfailure=false "-Ptests.jvmargs=-XX:TieredStopAtLevel=1 -XX:+UseParallelGC -XX:ActiveProcessorCount=1 -XX:ReservedCodeCacheSize=120m" -Ptests.seed=4F0352C40482B2DA -Ptests.multiplier=2 -Ptests.useSecurityManager=true -Ptests.badapples=false -Ptests.file.encoding=ISO-8859-1


[Incubating] Problems report is available at: file:///home/jenkins/jenkins-agent/workspace/Solr/Solr-Test-10.x/build/reports/problems/problems-report.html

Deprecated Gradle features were used in this build, making it incompatible with Gradle 10.

You can use '--warning-mode all' to show the individual deprecation warnings and determine if they come from your own scripts or plugins.

For more on this, please refer to https://docs.gradle.org/9.7.0/userguide/command_line_interface.html#sec:command_line_warnings in the Gradle documentation.

BUILD SUCCESSFUL in 41m 23s
159 actionable tasks: 159 executed

Publishing Build Scan to Develocity...

The Develocity server (develocity.apache.org) rejected the credential with prefix '7x3jzizm4zpygv7psbkg6byvm4'.
Your credential has expired.

Build step 'Invoke Gradle script' changed build result to SUCCESS
Archiving artifacts
‘**/*.events’ doesn’t match anything: ‘**’ exists but not ‘**/*.events’
No artifacts found that match the file pattern "**/*.events,heapdumps/**,**/hs_err_pid*". Configuration error?
Recording test results
[Checks API] No suitable checks publisher found.
Build step 'Publish JUnit test result report' changed build result to UNSTABLE
Email was triggered for: Unstable (Test Failures)
Sending email for trigger: Unstable (Test Failures)