You are viewing a plain text version of this content. The canonical link for it is here.
Posted to builds@solr.apache.org by Apache Jenkins Server <je...@builds.apache.org> on 2024/04/09 07:07:04 UTC
[JENKINS] Lucene » Lucene-Solr-Tests-8.11 - Build # 760 - Still Unstable!
Build: https://ci-builds.apache.org/job/Lucene/job/Lucene-Solr-Tests-8.11/760/
3 tests failed.
FAILED: org.apache.solr.cloud.TestPullReplicaErrorHandling.testCantConnectToPullReplica
Error Message:
Error from server at http://127.0.0.1:41439/solr: KeeperErrorCode = NoNode for /overseer/collection-queue-work/qnr-0000000008
Stack Trace:
org.apache.solr.client.solrj.impl.HttpSolrClient$RemoteSolrException: Error from server at http://127.0.0.1:41439/solr: KeeperErrorCode = NoNode for /overseer/collection-queue-work/qnr-0000000008
at org.apache.solr.client.solrj.impl.HttpSolrClient.executeMethod(HttpSolrClient.java:681)
at org.apache.solr.client.solrj.impl.HttpSolrClient.request(HttpSolrClient.java:266)
at org.apache.solr.client.solrj.impl.HttpSolrClient.request(HttpSolrClient.java:248)
at org.apache.solr.client.solrj.impl.LBSolrClient.doRequest(LBSolrClient.java:369)
at org.apache.solr.client.solrj.impl.LBSolrClient.request(LBSolrClient.java:297)
at org.apache.solr.client.solrj.impl.BaseCloudSolrClient.sendRequest(BaseCloudSolrClient.java:1188)
at org.apache.solr.client.solrj.impl.BaseCloudSolrClient.requestWithRetryOnStaleState(BaseCloudSolrClient.java:934)
at org.apache.solr.client.solrj.impl.BaseCloudSolrClient.request(BaseCloudSolrClient.java:866)
at org.apache.solr.client.solrj.SolrRequest.process(SolrRequest.java:225)
at org.apache.solr.client.solrj.SolrRequest.process(SolrRequest.java:242)
at org.apache.solr.cloud.TestPullReplicaErrorHandling.testCantConnectToPullReplica(TestPullReplicaErrorHandling.java:150)
at sun.reflect.NativeMethodAccessorImpl.invoke0(Native Method)
at sun.reflect.NativeMethodAccessorImpl.invoke(NativeMethodAccessorImpl.java:62)
at sun.reflect.DelegatingMethodAccessorImpl.invoke(DelegatingMethodAccessorImpl.java:43)
at java.lang.reflect.Method.invoke(Method.java:498)
at com.carrotsearch.randomizedtesting.RandomizedRunner.invoke(RandomizedRunner.java:1758)
at com.carrotsearch.randomizedtesting.RandomizedRunner$8.evaluate(RandomizedRunner.java:946)
at com.carrotsearch.randomizedtesting.RandomizedRunner$9.evaluate(RandomizedRunner.java:982)
at com.carrotsearch.randomizedtesting.RandomizedRunner$10.evaluate(RandomizedRunner.java:996)
at com.carrotsearch.randomizedtesting.rules.SystemPropertiesRestoreRule$1.evaluate(SystemPropertiesRestoreRule.java:80)
at org.junit.rules.RunRules.evaluate(RunRules.java:20)
at org.apache.lucene.util.TestRuleSetupTeardownChained$1.evaluate(TestRuleSetupTeardownChained.java:49)
at org.apache.lucene.util.AbstractBeforeAfterRule$1.evaluate(AbstractBeforeAfterRule.java:45)
at org.apache.lucene.util.TestRuleThreadAndTestName$1.evaluate(TestRuleThreadAndTestName.java:48)
at org.apache.lucene.util.TestRuleIgnoreAfterMaxFailures$1.evaluate(TestRuleIgnoreAfterMaxFailures.java:64)
at org.apache.lucene.util.TestRuleMarkFailure$1.evaluate(TestRuleMarkFailure.java:47)
at org.junit.rules.RunRules.evaluate(RunRules.java:20)
at com.carrotsearch.randomizedtesting.rules.StatementAdapter.evaluate(StatementAdapter.java:36)
at com.carrotsearch.randomizedtesting.ThreadLeakControl$StatementRunner.run(ThreadLeakControl.java:390)
at com.carrotsearch.randomizedtesting.ThreadLeakControl.forkTimeoutingTask(ThreadLeakControl.java:843)
at com.carrotsearch.randomizedtesting.ThreadLeakControl$3.evaluate(ThreadLeakControl.java:490)
at com.carrotsearch.randomizedtesting.RandomizedRunner.runSingleTest(RandomizedRunner.java:955)
at com.carrotsearch.randomizedtesting.RandomizedRunner$5.evaluate(RandomizedRunner.java:840)
at com.carrotsearch.randomizedtesting.RandomizedRunner$6.evaluate(RandomizedRunner.java:891)
at com.carrotsearch.randomizedtesting.RandomizedRunner$7.evaluate(RandomizedRunner.java:902)
at com.carrotsearch.randomizedtesting.rules.StatementAdapter.evaluate(StatementAdapter.java:36)
at com.carrotsearch.randomizedtesting.rules.SystemPropertiesRestoreRule$1.evaluate(SystemPropertiesRestoreRule.java:80)
at org.junit.rules.RunRules.evaluate(RunRules.java:20)
at org.apache.lucene.util.AbstractBeforeAfterRule$1.evaluate(AbstractBeforeAfterRule.java:45)
at com.carrotsearch.randomizedtesting.rules.StatementAdapter.evaluate(StatementAdapter.java:36)
at org.apache.lucene.util.TestRuleStoreClassName$1.evaluate(TestRuleStoreClassName.java:41)
at com.carrotsearch.randomizedtesting.rules.NoShadowingOrOverridesOnMethodsRule$1.evaluate(NoShadowingOrOverridesOnMethodsRule.java:40)
at com.carrotsearch.randomizedtesting.rules.NoShadowingOrOverridesOnMethodsRule$1.evaluate(NoShadowingOrOverridesOnMethodsRule.java:40)
at com.carrotsearch.randomizedtesting.rules.StatementAdapter.evaluate(StatementAdapter.java:36)
at com.carrotsearch.randomizedtesting.rules.StatementAdapter.evaluate(StatementAdapter.java:36)
at com.carrotsearch.randomizedtesting.rules.StatementAdapter.evaluate(StatementAdapter.java:36)
at org.apache.lucene.util.TestRuleAssertionsRequired$1.evaluate(TestRuleAssertionsRequired.java:53)
at org.apache.lucene.util.TestRuleMarkFailure$1.evaluate(TestRuleMarkFailure.java:47)
at org.apache.lucene.util.TestRuleIgnoreAfterMaxFailures$1.evaluate(TestRuleIgnoreAfterMaxFailures.java:64)
at org.apache.lucene.util.TestRuleIgnoreTestSuites$1.evaluate(TestRuleIgnoreTestSuites.java:54)
at org.junit.rules.RunRules.evaluate(RunRules.java:20)
at com.carrotsearch.randomizedtesting.rules.StatementAdapter.evaluate(StatementAdapter.java:36)
at com.carrotsearch.randomizedtesting.ThreadLeakControl$StatementRunner.run(ThreadLeakControl.java:390)
at com.carrotsearch.randomizedtesting.ThreadLeakControl.lambda$forkTimeoutingTask$0(ThreadLeakControl.java:850)
at java.lang.Thread.run(Thread.java:750)
FAILED: org.apache.solr.cloud.api.collections.ShardSplitTest.testSplitMixedReplicaTypes
Error Message:
Timeout occurred while waiting response from server at: http://127.0.0.1:35135/qr/qg
Stack Trace:
org.apache.solr.client.solrj.SolrServerException: Timeout occurred while waiting response from server at: http://127.0.0.1:35135/qr/qg
at __randomizedtesting.SeedInfo.seed([C4CD77A282861F5A:7C0E23027E5DCA2F]:0)
at org.apache.solr.client.solrj.impl.HttpSolrClient.executeMethod(HttpSolrClient.java:692)
at org.apache.solr.client.solrj.impl.HttpSolrClient.request(HttpSolrClient.java:266)
at org.apache.solr.client.solrj.impl.HttpSolrClient.request(HttpSolrClient.java:248)
at org.apache.solr.client.solrj.impl.LBSolrClient.doRequest(LBSolrClient.java:369)
at org.apache.solr.client.solrj.impl.LBSolrClient.request(LBSolrClient.java:297)
at org.apache.solr.client.solrj.impl.BaseCloudSolrClient.sendRequest(BaseCloudSolrClient.java:1188)
at org.apache.solr.client.solrj.impl.BaseCloudSolrClient.requestWithRetryOnStaleState(BaseCloudSolrClient.java:934)
at org.apache.solr.client.solrj.impl.BaseCloudSolrClient.request(BaseCloudSolrClient.java:866)
at org.apache.solr.client.solrj.SolrRequest.process(SolrRequest.java:225)
at org.apache.solr.client.solrj.SolrRequest.process(SolrRequest.java:242)
at org.apache.solr.cloud.api.collections.ShardSplitTest.doSplitMixedReplicaTypes(ShardSplitTest.java:365)
at org.apache.solr.cloud.api.collections.ShardSplitTest.testSplitMixedReplicaTypes(ShardSplitTest.java:350)
at sun.reflect.NativeMethodAccessorImpl.invoke0(Native Method)
at sun.reflect.NativeMethodAccessorImpl.invoke(NativeMethodAccessorImpl.java:62)
at sun.reflect.DelegatingMethodAccessorImpl.invoke(DelegatingMethodAccessorImpl.java:43)
at java.lang.reflect.Method.invoke(Method.java:498)
at com.carrotsearch.randomizedtesting.RandomizedRunner.invoke(RandomizedRunner.java:1758)
at com.carrotsearch.randomizedtesting.RandomizedRunner$8.evaluate(RandomizedRunner.java:946)
at com.carrotsearch.randomizedtesting.RandomizedRunner$9.evaluate(RandomizedRunner.java:982)
at com.carrotsearch.randomizedtesting.RandomizedRunner$10.evaluate(RandomizedRunner.java:996)
at org.apache.solr.BaseDistributedSearchTestCase$ShardsRepeatRule$ShardsFixedStatement.callStatement(BaseDistributedSearchTestCase.java:1084)
at org.apache.solr.BaseDistributedSearchTestCase$ShardsRepeatRule$ShardsStatement.evaluate(BaseDistributedSearchTestCase.java:1055)
at com.carrotsearch.randomizedtesting.rules.SystemPropertiesRestoreRule$1.evaluate(SystemPropertiesRestoreRule.java:80)
at org.junit.rules.RunRules.evaluate(RunRules.java:20)
at org.apache.lucene.util.TestRuleSetupTeardownChained$1.evaluate(TestRuleSetupTeardownChained.java:49)
at org.apache.lucene.util.AbstractBeforeAfterRule$1.evaluate(AbstractBeforeAfterRule.java:45)
at org.apache.lucene.util.TestRuleThreadAndTestName$1.evaluate(TestRuleThreadAndTestName.java:48)
at org.apache.lucene.util.TestRuleIgnoreAfterMaxFailures$1.evaluate(TestRuleIgnoreAfterMaxFailures.java:64)
at org.apache.lucene.util.TestRuleMarkFailure$1.evaluate(TestRuleMarkFailure.java:47)
at org.junit.rules.RunRules.evaluate(RunRules.java:20)
at com.carrotsearch.randomizedtesting.rules.StatementAdapter.evaluate(StatementAdapter.java:36)
at com.carrotsearch.randomizedtesting.ThreadLeakControl$StatementRunner.run(ThreadLeakControl.java:390)
at com.carrotsearch.randomizedtesting.ThreadLeakControl.forkTimeoutingTask(ThreadLeakControl.java:843)
at com.carrotsearch.randomizedtesting.ThreadLeakControl$3.evaluate(ThreadLeakControl.java:490)
at com.carrotsearch.randomizedtesting.RandomizedRunner.runSingleTest(RandomizedRunner.java:955)
at com.carrotsearch.randomizedtesting.RandomizedRunner$5.evaluate(RandomizedRunner.java:840)
at com.carrotsearch.randomizedtesting.RandomizedRunner$6.evaluate(RandomizedRunner.java:891)
at com.carrotsearch.randomizedtesting.RandomizedRunner$7.evaluate(RandomizedRunner.java:902)
at com.carrotsearch.randomizedtesting.rules.StatementAdapter.evaluate(StatementAdapter.java:36)
at com.carrotsearch.randomizedtesting.rules.SystemPropertiesRestoreRule$1.evaluate(SystemPropertiesRestoreRule.java:80)
at org.junit.rules.RunRules.evaluate(RunRules.java:20)
at org.apache.lucene.util.AbstractBeforeAfterRule$1.evaluate(AbstractBeforeAfterRule.java:45)
at com.carrotsearch.randomizedtesting.rules.StatementAdapter.evaluate(StatementAdapter.java:36)
at org.apache.lucene.util.TestRuleStoreClassName$1.evaluate(TestRuleStoreClassName.java:41)
at com.carrotsearch.randomizedtesting.rules.NoShadowingOrOverridesOnMethodsRule$1.evaluate(NoShadowingOrOverridesOnMethodsRule.java:40)
at com.carrotsearch.randomizedtesting.rules.NoShadowingOrOverridesOnMethodsRule$1.evaluate(NoShadowingOrOverridesOnMethodsRule.java:40)
at com.carrotsearch.randomizedtesting.rules.StatementAdapter.evaluate(StatementAdapter.java:36)
at com.carrotsearch.randomizedtesting.rules.StatementAdapter.evaluate(StatementAdapter.java:36)
at com.carrotsearch.randomizedtesting.rules.StatementAdapter.evaluate(StatementAdapter.java:36)
at org.apache.lucene.util.TestRuleAssertionsRequired$1.evaluate(TestRuleAssertionsRequired.java:53)
at org.apache.lucene.util.TestRuleMarkFailure$1.evaluate(TestRuleMarkFailure.java:47)
at org.apache.lucene.util.TestRuleIgnoreAfterMaxFailures$1.evaluate(TestRuleIgnoreAfterMaxFailures.java:64)
at org.apache.lucene.util.TestRuleIgnoreTestSuites$1.evaluate(TestRuleIgnoreTestSuites.java:54)
at org.junit.rules.RunRules.evaluate(RunRules.java:20)
at com.carrotsearch.randomizedtesting.rules.StatementAdapter.evaluate(StatementAdapter.java:36)
at com.carrotsearch.randomizedtesting.ThreadLeakControl$StatementRunner.run(ThreadLeakControl.java:390)
at com.carrotsearch.randomizedtesting.ThreadLeakControl.lambda$forkTimeoutingTask$0(ThreadLeakControl.java:850)
at java.lang.Thread.run(Thread.java:750)
Caused by: java.net.SocketTimeoutException: Read timed out
at java.net.SocketInputStream.socketRead0(Native Method)
at java.net.SocketInputStream.socketRead(SocketInputStream.java:116)
at java.net.SocketInputStream.read(SocketInputStream.java:171)
at java.net.SocketInputStream.read(SocketInputStream.java:141)
at org.apache.http.impl.io.SessionInputBufferImpl.streamRead(SessionInputBufferImpl.java:137)
at org.apache.http.impl.io.SessionInputBufferImpl.fillBuffer(SessionInputBufferImpl.java:153)
at org.apache.http.impl.io.SessionInputBufferImpl.readLine(SessionInputBufferImpl.java:280)
at org.apache.http.impl.conn.DefaultHttpResponseParser.parseHead(DefaultHttpResponseParser.java:138)
at org.apache.http.impl.conn.DefaultHttpResponseParser.parseHead(DefaultHttpResponseParser.java:56)
at org.apache.http.impl.io.AbstractMessageParser.parse(AbstractMessageParser.java:259)
at org.apache.http.impl.DefaultBHttpClientConnection.receiveResponseHeader(DefaultBHttpClientConnection.java:163)
at org.apache.http.impl.conn.CPoolProxy.receiveResponseHeader(CPoolProxy.java:157)
at org.apache.http.protocol.HttpRequestExecutor.doReceiveResponse(HttpRequestExecutor.java:273)
at org.apache.http.protocol.HttpRequestExecutor.execute(HttpRequestExecutor.java:125)
at org.apache.http.impl.execchain.MainClientExec.execute(MainClientExec.java:272)
at org.apache.http.impl.execchain.ProtocolExec.execute(ProtocolExec.java:186)
at org.apache.http.impl.execchain.RetryExec.execute(RetryExec.java:89)
at org.apache.http.impl.execchain.RedirectExec.execute(RedirectExec.java:110)
at org.apache.http.impl.client.InternalHttpClient.doExecute(InternalHttpClient.java:185)
at org.apache.http.impl.client.CloseableHttpClient.execute(CloseableHttpClient.java:83)
at org.apache.http.impl.client.CloseableHttpClient.execute(CloseableHttpClient.java:56)
at org.apache.solr.client.solrj.impl.HttpSolrClient.executeMethod(HttpSolrClient.java:571)
... 57 more
FAILED: org.apache.solr.cloud.api.collections.ShardSplitTest.testSplitMixedReplicaTypesLink
Error Message:
Timeout occurred while waiting response from server at: http://127.0.0.1:34877/qr/qg
Stack Trace:
org.apache.solr.client.solrj.SolrServerException: Timeout occurred while waiting response from server at: http://127.0.0.1:34877/qr/qg
at __randomizedtesting.SeedInfo.seed([C4CD77A282861F5A:F8A3BEFB275EB4C3]:0)
at org.apache.solr.client.solrj.impl.HttpSolrClient.executeMethod(HttpSolrClient.java:692)
at org.apache.solr.client.solrj.impl.HttpSolrClient.request(HttpSolrClient.java:266)
at org.apache.solr.client.solrj.impl.HttpSolrClient.request(HttpSolrClient.java:248)
at org.apache.solr.client.solrj.impl.LBSolrClient.doRequest(LBSolrClient.java:369)
at org.apache.solr.client.solrj.impl.LBSolrClient.request(LBSolrClient.java:297)
at org.apache.solr.client.solrj.impl.BaseCloudSolrClient.sendRequest(BaseCloudSolrClient.java:1188)
at org.apache.solr.client.solrj.impl.BaseCloudSolrClient.requestWithRetryOnStaleState(BaseCloudSolrClient.java:934)
at org.apache.solr.client.solrj.impl.BaseCloudSolrClient.request(BaseCloudSolrClient.java:866)
at org.apache.solr.client.solrj.SolrRequest.process(SolrRequest.java:225)
at org.apache.solr.client.solrj.SolrRequest.process(SolrRequest.java:242)
at org.apache.solr.cloud.api.collections.ShardSplitTest.doSplitMixedReplicaTypes(ShardSplitTest.java:365)
at org.apache.solr.cloud.api.collections.ShardSplitTest.testSplitMixedReplicaTypesLink(ShardSplitTest.java:356)
at sun.reflect.NativeMethodAccessorImpl.invoke0(Native Method)
at sun.reflect.NativeMethodAccessorImpl.invoke(NativeMethodAccessorImpl.java:62)
at sun.reflect.DelegatingMethodAccessorImpl.invoke(DelegatingMethodAccessorImpl.java:43)
at java.lang.reflect.Method.invoke(Method.java:498)
at com.carrotsearch.randomizedtesting.RandomizedRunner.invoke(RandomizedRunner.java:1758)
at com.carrotsearch.randomizedtesting.RandomizedRunner$8.evaluate(RandomizedRunner.java:946)
at com.carrotsearch.randomizedtesting.RandomizedRunner$9.evaluate(RandomizedRunner.java:982)
at com.carrotsearch.randomizedtesting.RandomizedRunner$10.evaluate(RandomizedRunner.java:996)
at org.apache.solr.BaseDistributedSearchTestCase$ShardsRepeatRule$ShardsFixedStatement.callStatement(BaseDistributedSearchTestCase.java:1084)
at org.apache.solr.BaseDistributedSearchTestCase$ShardsRepeatRule$ShardsStatement.evaluate(BaseDistributedSearchTestCase.java:1055)
at com.carrotsearch.randomizedtesting.rules.SystemPropertiesRestoreRule$1.evaluate(SystemPropertiesRestoreRule.java:80)
at org.junit.rules.RunRules.evaluate(RunRules.java:20)
at org.apache.lucene.util.TestRuleSetupTeardownChained$1.evaluate(TestRuleSetupTeardownChained.java:49)
at org.apache.lucene.util.AbstractBeforeAfterRule$1.evaluate(AbstractBeforeAfterRule.java:45)
at org.apache.lucene.util.TestRuleThreadAndTestName$1.evaluate(TestRuleThreadAndTestName.java:48)
at org.apache.lucene.util.TestRuleIgnoreAfterMaxFailures$1.evaluate(TestRuleIgnoreAfterMaxFailures.java:64)
at org.apache.lucene.util.TestRuleMarkFailure$1.evaluate(TestRuleMarkFailure.java:47)
at org.junit.rules.RunRules.evaluate(RunRules.java:20)
at com.carrotsearch.randomizedtesting.rules.StatementAdapter.evaluate(StatementAdapter.java:36)
at com.carrotsearch.randomizedtesting.ThreadLeakControl$StatementRunner.run(ThreadLeakControl.java:390)
at com.carrotsearch.randomizedtesting.ThreadLeakControl.forkTimeoutingTask(ThreadLeakControl.java:843)
at com.carrotsearch.randomizedtesting.ThreadLeakControl$3.evaluate(ThreadLeakControl.java:490)
at com.carrotsearch.randomizedtesting.RandomizedRunner.runSingleTest(RandomizedRunner.java:955)
at com.carrotsearch.randomizedtesting.RandomizedRunner$5.evaluate(RandomizedRunner.java:840)
at com.carrotsearch.randomizedtesting.RandomizedRunner$6.evaluate(RandomizedRunner.java:891)
at com.carrotsearch.randomizedtesting.RandomizedRunner$7.evaluate(RandomizedRunner.java:902)
at com.carrotsearch.randomizedtesting.rules.StatementAdapter.evaluate(StatementAdapter.java:36)
at com.carrotsearch.randomizedtesting.rules.SystemPropertiesRestoreRule$1.evaluate(SystemPropertiesRestoreRule.java:80)
at org.junit.rules.RunRules.evaluate(RunRules.java:20)
at org.apache.lucene.util.AbstractBeforeAfterRule$1.evaluate(AbstractBeforeAfterRule.java:45)
at com.carrotsearch.randomizedtesting.rules.StatementAdapter.evaluate(StatementAdapter.java:36)
at org.apache.lucene.util.TestRuleStoreClassName$1.evaluate(TestRuleStoreClassName.java:41)
at com.carrotsearch.randomizedtesting.rules.NoShadowingOrOverridesOnMethodsRule$1.evaluate(NoShadowingOrOverridesOnMethodsRule.java:40)
at com.carrotsearch.randomizedtesting.rules.NoShadowingOrOverridesOnMethodsRule$1.evaluate(NoShadowingOrOverridesOnMethodsRule.java:40)
at com.carrotsearch.randomizedtesting.rules.StatementAdapter.evaluate(StatementAdapter.java:36)
at com.carrotsearch.randomizedtesting.rules.StatementAdapter.evaluate(StatementAdapter.java:36)
at com.carrotsearch.randomizedtesting.rules.StatementAdapter.evaluate(StatementAdapter.java:36)
at org.apache.lucene.util.TestRuleAssertionsRequired$1.evaluate(TestRuleAssertionsRequired.java:53)
at org.apache.lucene.util.TestRuleMarkFailure$1.evaluate(TestRuleMarkFailure.java:47)
at org.apache.lucene.util.TestRuleIgnoreAfterMaxFailures$1.evaluate(TestRuleIgnoreAfterMaxFailures.java:64)
at org.apache.lucene.util.TestRuleIgnoreTestSuites$1.evaluate(TestRuleIgnoreTestSuites.java:54)
at org.junit.rules.RunRules.evaluate(RunRules.java:20)
at com.carrotsearch.randomizedtesting.rules.StatementAdapter.evaluate(StatementAdapter.java:36)
at com.carrotsearch.randomizedtesting.ThreadLeakControl$StatementRunner.run(ThreadLeakControl.java:390)
at com.carrotsearch.randomizedtesting.ThreadLeakControl.lambda$forkTimeoutingTask$0(ThreadLeakControl.java:850)
at java.lang.Thread.run(Thread.java:750)
Caused by: java.net.SocketTimeoutException: Read timed out
at java.net.SocketInputStream.socketRead0(Native Method)
at java.net.SocketInputStream.socketRead(SocketInputStream.java:116)
at java.net.SocketInputStream.read(SocketInputStream.java:171)
at java.net.SocketInputStream.read(SocketInputStream.java:141)
at org.apache.http.impl.io.SessionInputBufferImpl.streamRead(SessionInputBufferImpl.java:137)
at org.apache.http.impl.io.SessionInputBufferImpl.fillBuffer(SessionInputBufferImpl.java:153)
at org.apache.http.impl.io.SessionInputBufferImpl.readLine(SessionInputBufferImpl.java:280)
at org.apache.http.impl.conn.DefaultHttpResponseParser.parseHead(DefaultHttpResponseParser.java:138)
at org.apache.http.impl.conn.DefaultHttpResponseParser.parseHead(DefaultHttpResponseParser.java:56)
at org.apache.http.impl.io.AbstractMessageParser.parse(AbstractMessageParser.java:259)
at org.apache.http.impl.DefaultBHttpClientConnection.receiveResponseHeader(DefaultBHttpClientConnection.java:163)
at org.apache.http.impl.conn.CPoolProxy.receiveResponseHeader(CPoolProxy.java:157)
at org.apache.http.protocol.HttpRequestExecutor.doReceiveResponse(HttpRequestExecutor.java:273)
at org.apache.http.protocol.HttpRequestExecutor.execute(HttpRequestExecutor.java:125)
at org.apache.http.impl.execchain.MainClientExec.execute(MainClientExec.java:272)
at org.apache.http.impl.execchain.ProtocolExec.execute(ProtocolExec.java:186)
at org.apache.http.impl.execchain.RetryExec.execute(RetryExec.java:89)
at org.apache.http.impl.execchain.RedirectExec.execute(RedirectExec.java:110)
at org.apache.http.impl.client.InternalHttpClient.doExecute(InternalHttpClient.java:185)
at org.apache.http.impl.client.CloseableHttpClient.execute(CloseableHttpClient.java:83)
at org.apache.http.impl.client.CloseableHttpClient.execute(CloseableHttpClient.java:56)
at org.apache.solr.client.solrj.impl.HttpSolrClient.executeMethod(HttpSolrClient.java:571)
... 57 more
Build Log:
[...truncated 13879 lines...]
[junit4] Suite: org.apache.solr.cloud.TestPullReplicaErrorHandling
[junit4] 2> 304134 INFO (SUITE-TestPullReplicaErrorHandling-seed#[C4CD77A282861F5A]-worker) [ ] o.a.s.SolrTestCase Setting 'solr.default.confdir' system property to test-framework derived value of '/home/jenkins/jenkins-slave/workspace/Lucene/Lucene-Solr-Tests-8.11/solr/server/solr/configsets/_default/conf'
[junit4] 2> 304134 INFO (SUITE-TestPullReplicaErrorHandling-seed#[C4CD77A282861F5A]-worker) [ ] o.a.s.SolrTestCaseJ4 SecureRandom sanity checks: test.solr.allowed.securerandom=null & java.security.egd=file:/dev/./urandom
[junit4] 2> 304135 INFO (SUITE-TestPullReplicaErrorHandling-seed#[C4CD77A282861F5A]-worker) [ ] o.a.s.u.ErrorLogMuter Closing ErrorLogMuter-regex-44 after mutting 0 log messages
[junit4] 2> 304135 INFO (SUITE-TestPullReplicaErrorHandling-seed#[C4CD77A282861F5A]-worker) [ ] o.a.s.u.ErrorLogMuter Creating ErrorLogMuter-regex-45 for ERROR logs matching regex: ignore_exception
[junit4] 2> 304136 INFO (SUITE-TestPullReplicaErrorHandling-seed#[C4CD77A282861F5A]-worker) [ ] o.a.s.SolrTestCaseJ4 Created dataDir: /home/jenkins/jenkins-slave/workspace/Lucene/Lucene-Solr-Tests-8.11/solr/build/solr-core/test/J1/temp/solr.cloud.TestPullReplicaErrorHandling_C4CD77A282861F5A-001/data-dir-21-001
[junit4] 2> 304136 WARN (SUITE-TestPullReplicaErrorHandling-seed#[C4CD77A282861F5A]-worker) [ ] o.a.s.SolrTestCaseJ4 startTrackingSearchers: numOpens=21 numCloses=21
[junit4] 2> 304136 INFO (SUITE-TestPullReplicaErrorHandling-seed#[C4CD77A282861F5A]-worker) [ ] o.a.s.SolrTestCaseJ4 Using PointFields (NUMERIC_POINTS_SYSPROP=true) w/NUMERIC_DOCVALUES_SYSPROP=false
[junit4] 2> 304139 INFO (SUITE-TestPullReplicaErrorHandling-seed#[C4CD77A282861F5A]-worker) [ ] o.a.s.SolrTestCaseJ4 Randomized ssl (false) and clientAuth (false) via: @org.apache.solr.SolrTestCaseJ4$SuppressSSL(bugUrl=https://issues.apache.org/jira/browse/SOLR-5776)
[junit4] 2> 304139 INFO (SUITE-TestPullReplicaErrorHandling-seed#[C4CD77A282861F5A]-worker) [ ] o.a.s.c.MiniSolrCloudCluster Starting cluster of 4 servers in /home/jenkins/jenkins-slave/workspace/Lucene/Lucene-Solr-Tests-8.11/solr/build/solr-core/test/J1/temp/solr.cloud.TestPullReplicaErrorHandling_C4CD77A282861F5A-001/tempDir-001
[junit4] 2> 304139 INFO (SUITE-TestPullReplicaErrorHandling-seed#[C4CD77A282861F5A]-worker) [ ] o.a.s.c.ZkTestServer STARTING ZK TEST SERVER
[junit4] 2> 304140 INFO (ZkTestServer Run Thread) [ ] o.a.s.c.ZkTestServer client port: 0.0.0.0/0.0.0.0:0
[junit4] 2> 304140 INFO (ZkTestServer Run Thread) [ ] o.a.s.c.ZkTestServer Starting server
[junit4] 2> 304141 WARN (ZkTestServer Run Thread) [ ] o.a.z.s.ServerCnxnFactory maxCnxns is not configured, using default value 0.
[junit4] 2> 304240 INFO (SUITE-TestPullReplicaErrorHandling-seed#[C4CD77A282861F5A]-worker) [ ] o.a.s.c.ZkTestServer start zk server on port: 39993
[junit4] 2> 304240 INFO (SUITE-TestPullReplicaErrorHandling-seed#[C4CD77A282861F5A]-worker) [ ] o.a.s.c.ZkTestServer waitForServerUp: 127.0.0.1:39993
[junit4] 2> 304240 INFO (SUITE-TestPullReplicaErrorHandling-seed#[C4CD77A282861F5A]-worker) [ ] o.a.s.c.ZkTestServer parse host and port list: 127.0.0.1:39993
[junit4] 2> 304240 INFO (SUITE-TestPullReplicaErrorHandling-seed#[C4CD77A282861F5A]-worker) [ ] o.a.s.c.ZkTestServer connecting to 127.0.0.1 39993
[junit4] 2> 304242 INFO (SUITE-TestPullReplicaErrorHandling-seed#[C4CD77A282861F5A]-worker) [ ] o.a.s.c.c.ConnectionManager Waiting for client to connect to ZooKeeper
[junit4] 2> 304244 INFO (zkConnectionManagerCallback-4112-thread-1) [ ] o.a.s.c.c.ConnectionManager zkClient has connected
[junit4] 2> 304244 INFO (SUITE-TestPullReplicaErrorHandling-seed#[C4CD77A282861F5A]-worker) [ ] o.a.s.c.c.ConnectionManager Client is connected to ZooKeeper
[junit4] 2> 304248 INFO (SUITE-TestPullReplicaErrorHandling-seed#[C4CD77A282861F5A]-worker) [ ] o.a.s.c.c.ConnectionManager Waiting for client to connect to ZooKeeper
[junit4] 2> 304255 INFO (zkConnectionManagerCallback-4114-thread-1) [ ] o.a.s.c.c.ConnectionManager zkClient has connected
[junit4] 2> 304255 INFO (SUITE-TestPullReplicaErrorHandling-seed#[C4CD77A282861F5A]-worker) [ ] o.a.s.c.c.ConnectionManager Client is connected to ZooKeeper
[junit4] 2> 304256 INFO (SUITE-TestPullReplicaErrorHandling-seed#[C4CD77A282861F5A]-worker) [ ] o.a.s.c.c.ConnectionManager Waiting for client to connect to ZooKeeper
[junit4] 2> 304257 INFO (zkConnectionManagerCallback-4116-thread-1) [ ] o.a.s.c.c.ConnectionManager zkClient has connected
[junit4] 2> 304257 INFO (SUITE-TestPullReplicaErrorHandling-seed#[C4CD77A282861F5A]-worker) [ ] o.a.s.c.c.ConnectionManager Client is connected to ZooKeeper
[junit4] 2> 304361 INFO (jetty-launcher-4117-thread-1) [ ] o.a.s.c.s.e.JettySolrRunner Start Jetty (configured port=0, binding port=0)
[junit4] 2> 304361 INFO (jetty-launcher-4117-thread-1) [ ] o.a.s.c.s.e.JettySolrRunner Trying to start Jetty on port 0 try number 2 ...
[junit4] 2> 304361 INFO (jetty-launcher-4117-thread-1) [ ] o.e.j.s.Server jetty-9.4.53.v20231009; built: 2023-10-09T12:29:09.265Z; git: 27bde00a0b95a1d5bbee0eae7984f891d2d0f8c9; jvm 1.8.0_362-b09
[junit4] 2> 304362 INFO (jetty-launcher-4117-thread-2) [ ] o.a.s.c.s.e.JettySolrRunner Start Jetty (configured port=0, binding port=0)
[junit4] 2> 304362 INFO (jetty-launcher-4117-thread-2) [ ] o.a.s.c.s.e.JettySolrRunner Trying to start Jetty on port 0 try number 2 ...
[junit4] 2> 304362 INFO (jetty-launcher-4117-thread-2) [ ] o.e.j.s.Server jetty-9.4.53.v20231009; built: 2023-10-09T12:29:09.265Z; git: 27bde00a0b95a1d5bbee0eae7984f891d2d0f8c9; jvm 1.8.0_362-b09
[junit4] 2> 304363 INFO (jetty-launcher-4117-thread-3) [ ] o.a.s.c.s.e.JettySolrRunner Start Jetty (configured port=0, binding port=0)
[junit4] 2> 304363 INFO (jetty-launcher-4117-thread-3) [ ] o.a.s.c.s.e.JettySolrRunner Trying to start Jetty on port 0 try number 2 ...
[junit4] 2> 304363 INFO (jetty-launcher-4117-thread-3) [ ] o.e.j.s.Server jetty-9.4.53.v20231009; built: 2023-10-09T12:29:09.265Z; git: 27bde00a0b95a1d5bbee0eae7984f891d2d0f8c9; jvm 1.8.0_362-b09
[junit4] 2> 304365 INFO (jetty-launcher-4117-thread-4) [ ] o.a.s.c.s.e.JettySolrRunner Start Jetty (configured port=0, binding port=0)
[junit4] 2> 304365 INFO (jetty-launcher-4117-thread-4) [ ] o.a.s.c.s.e.JettySolrRunner Trying to start Jetty on port 0 try number 2 ...
[junit4] 2> 304365 INFO (jetty-launcher-4117-thread-4) [ ] o.e.j.s.Server jetty-9.4.53.v20231009; built: 2023-10-09T12:29:09.265Z; git: 27bde00a0b95a1d5bbee0eae7984f891d2d0f8c9; jvm 1.8.0_362-b09
[junit4] 2> 304378 INFO (jetty-launcher-4117-thread-1) [ ] o.e.j.s.session DefaultSessionIdManager workerName=node0
[junit4] 2> 304378 INFO (jetty-launcher-4117-thread-1) [ ] o.e.j.s.session No SessionScavenger set, using defaults
[junit4] 2> 304378 INFO (jetty-launcher-4117-thread-1) [ ] o.e.j.s.session node0 Scavenging every 600000ms
[junit4] 2> 304380 INFO (jetty-launcher-4117-thread-1) [ ] o.e.j.s.h.ContextHandler Started o.e.j.s.ServletContextHandler@5afa51b2{/solr,null,AVAILABLE}
[junit4] 2> 304408 INFO (jetty-launcher-4117-thread-2) [ ] o.e.j.s.session DefaultSessionIdManager workerName=node0
[junit4] 2> 304408 INFO (jetty-launcher-4117-thread-2) [ ] o.e.j.s.session No SessionScavenger set, using defaults
[junit4] 2> 304408 INFO (jetty-launcher-4117-thread-2) [ ] o.e.j.s.session node0 Scavenging every 600000ms
[junit4] 2> 304409 INFO (jetty-launcher-4117-thread-4) [ ] o.e.j.s.session DefaultSessionIdManager workerName=node0
[junit4] 2> 304409 INFO (jetty-launcher-4117-thread-4) [ ] o.e.j.s.session No SessionScavenger set, using defaults
[junit4] 2> 304409 INFO (jetty-launcher-4117-thread-4) [ ] o.e.j.s.session node0 Scavenging every 660000ms
[junit4] 2> 304409 INFO (jetty-launcher-4117-thread-4) [ ] o.e.j.s.h.ContextHandler Started o.e.j.s.ServletContextHandler@ea90b0e{/solr,null,AVAILABLE}
[junit4] 2> 304410 INFO (jetty-launcher-4117-thread-3) [ ] o.e.j.s.session DefaultSessionIdManager workerName=node0
[junit4] 2> 304410 INFO (jetty-launcher-4117-thread-3) [ ] o.e.j.s.session No SessionScavenger set, using defaults
[junit4] 2> 304410 INFO (jetty-launcher-4117-thread-3) [ ] o.e.j.s.session node0 Scavenging every 600000ms
[junit4] 2> 304410 INFO (jetty-launcher-4117-thread-3) [ ] o.e.j.s.h.ContextHandler Started o.e.j.s.ServletContextHandler@2c02aa32{/solr,null,AVAILABLE}
[junit4] 2> 304410 INFO (jetty-launcher-4117-thread-2) [ ] o.e.j.s.h.ContextHandler Started o.e.j.s.ServletContextHandler@75cc0dbe{/solr,null,AVAILABLE}
[junit4] 2> 304411 INFO (jetty-launcher-4117-thread-4) [ ] o.e.j.s.AbstractConnector Started ServerConnector@406d8d7f{HTTP/1.1, (http/1.1, h2c)}{127.0.0.1:33675}
[junit4] 2> 304411 INFO (jetty-launcher-4117-thread-4) [ ] o.e.j.s.Server Started @304442ms
[junit4] 2> 304411 INFO (jetty-launcher-4117-thread-4) [ ] o.a.s.c.s.e.JettySolrRunner Jetty properties: {hostContext=/solr, zkHost=127.0.0.1:39993/solr, hostPort=33675}
[junit4] 2> 304411 ERROR (jetty-launcher-4117-thread-4) [ ] o.a.s.u.StartupLoggingUtils Missing Java Option solr.log.dir. Logging may be missing or incomplete.
[junit4] 2> 304411 INFO (jetty-launcher-4117-thread-4) [ ] o.a.s.s.SolrDispatchFilter Using logger factory org.apache.logging.slf4j.Log4jLoggerFactory
[junit4] 2> 304411 INFO (jetty-launcher-4117-thread-4) [ ] o.a.s.s.SolrDispatchFilter ___ _ Welcome to Apache Solr™ version 8.11.4
[junit4] 2> 304411 INFO (jetty-launcher-4117-thread-4) [ ] o.a.s.s.SolrDispatchFilter / __| ___| |_ _ Starting in cloud mode on port null
[junit4] 2> 304411 INFO (jetty-launcher-4117-thread-4) [ ] o.a.s.s.SolrDispatchFilter \__ \/ _ \ | '_| Install dir: /home/jenkins/jenkins-slave/workspace/Lucene/Lucene-Solr-Tests-8.11/solr
[junit4] 2> 304411 INFO (jetty-launcher-4117-thread-4) [ ] o.a.s.s.SolrDispatchFilter |___/\___/_|_| Start time: 2024-04-09T06:03:23.794Z
[junit4] 2> 304415 INFO (jetty-launcher-4117-thread-4) [ ] o.a.s.c.c.ConnectionManager Waiting for client to connect to ZooKeeper
[junit4] 2> 304415 INFO (jetty-launcher-4117-thread-1) [ ] o.e.j.s.AbstractConnector Started ServerConnector@40250bca{HTTP/1.1, (http/1.1, h2c)}{127.0.0.1:42791}
[junit4] 2> 304415 INFO (jetty-launcher-4117-thread-1) [ ] o.e.j.s.Server Started @304446ms
[junit4] 2> 304415 INFO (jetty-launcher-4117-thread-1) [ ] o.a.s.c.s.e.JettySolrRunner Jetty properties: {hostContext=/solr, zkHost=127.0.0.1:39993/solr, hostPort=42791}
[junit4] 2> 304415 ERROR (jetty-launcher-4117-thread-1) [ ] o.a.s.u.StartupLoggingUtils Missing Java Option solr.log.dir. Logging may be missing or incomplete.
[junit4] 2> 304415 INFO (jetty-launcher-4117-thread-1) [ ] o.a.s.s.SolrDispatchFilter Using logger factory org.apache.logging.slf4j.Log4jLoggerFactory
[junit4] 2> 304415 INFO (jetty-launcher-4117-thread-1) [ ] o.a.s.s.SolrDispatchFilter ___ _ Welcome to Apache Solr™ version 8.11.4
[junit4] 2> 304415 INFO (jetty-launcher-4117-thread-1) [ ] o.a.s.s.SolrDispatchFilter / __| ___| |_ _ Starting in cloud mode on port null
[junit4] 2> 304415 INFO (jetty-launcher-4117-thread-1) [ ] o.a.s.s.SolrDispatchFilter \__ \/ _ \ | '_| Install dir: /home/jenkins/jenkins-slave/workspace/Lucene/Lucene-Solr-Tests-8.11/solr
[junit4] 2> 304415 INFO (jetty-launcher-4117-thread-1) [ ] o.a.s.s.SolrDispatchFilter |___/\___/_|_| Start time: 2024-04-09T06:03:23.798Z
[junit4] 2> 304419 INFO (jetty-launcher-4117-thread-1) [ ] o.a.s.c.c.ConnectionManager Waiting for client to connect to ZooKeeper
[junit4] 2> 304419 INFO (jetty-launcher-4117-thread-3) [ ] o.e.j.s.AbstractConnector Started ServerConnector@4d6b170a{HTTP/1.1, (http/1.1, h2c)}{127.0.0.1:46819}
[junit4] 2> 304419 INFO (jetty-launcher-4117-thread-3) [ ] o.e.j.s.Server Started @304450ms
[junit4] 2> 304419 INFO (jetty-launcher-4117-thread-3) [ ] o.a.s.c.s.e.JettySolrRunner Jetty properties: {hostContext=/solr, zkHost=127.0.0.1:39993/solr, hostPort=46819}
[junit4] 2> 304419 ERROR (jetty-launcher-4117-thread-3) [ ] o.a.s.u.StartupLoggingUtils Missing Java Option solr.log.dir. Logging may be missing or incomplete.
[junit4] 2> 304419 INFO (jetty-launcher-4117-thread-3) [ ] o.a.s.s.SolrDispatchFilter Using logger factory org.apache.logging.slf4j.Log4jLoggerFactory
[junit4] 2> 304419 INFO (jetty-launcher-4117-thread-3) [ ] o.a.s.s.SolrDispatchFilter ___ _ Welcome to Apache Solr™ version 8.11.4
[junit4] 2> 304419 INFO (jetty-launcher-4117-thread-3) [ ] o.a.s.s.SolrDispatchFilter / __| ___| |_ _ Starting in cloud mode on port null
[junit4] 2> 304419 INFO (jetty-launcher-4117-thread-3) [ ] o.a.s.s.SolrDispatchFilter \__ \/ _ \ | '_| Install dir: /home/jenkins/jenkins-slave/workspace/Lucene/Lucene-Solr-Tests-8.11/solr
[junit4] 2> 304419 INFO (jetty-launcher-4117-thread-3) [ ] o.a.s.s.SolrDispatchFilter |___/\___/_|_| Start time: 2024-04-09T06:03:23.802Z
[junit4] 2> 304422 INFO (jetty-launcher-4117-thread-3) [ ] o.a.s.c.c.ConnectionManager Waiting for client to connect to ZooKeeper
[junit4] 2> 304423 INFO (jetty-launcher-4117-thread-2) [ ] o.e.j.s.AbstractConnector Started ServerConnector@5f5a77e2{HTTP/1.1, (http/1.1, h2c)}{127.0.0.1:36915}
[junit4] 2> 304423 INFO (jetty-launcher-4117-thread-2) [ ] o.e.j.s.Server Started @304454ms
[junit4] 2> 304423 INFO (jetty-launcher-4117-thread-2) [ ] o.a.s.c.s.e.JettySolrRunner Jetty properties: {hostContext=/solr, zkHost=127.0.0.1:39993/solr, hostPort=36915}
[junit4] 2> 304423 ERROR (jetty-launcher-4117-thread-2) [ ] o.a.s.u.StartupLoggingUtils Missing Java Option solr.log.dir. Logging may be missing or incomplete.
[junit4] 2> 304423 INFO (jetty-launcher-4117-thread-2) [ ] o.a.s.s.SolrDispatchFilter Using logger factory org.apache.logging.slf4j.Log4jLoggerFactory
[junit4] 2> 304423 INFO (jetty-launcher-4117-thread-2) [ ] o.a.s.s.SolrDispatchFilter ___ _ Welcome to Apache Solr™ version 8.11.4
[junit4] 2> 304423 INFO (jetty-launcher-4117-thread-2) [ ] o.a.s.s.SolrDispatchFilter / __| ___| |_ _ Starting in cloud mode on port null
[junit4] 2> 304423 INFO (jetty-launcher-4117-thread-2) [ ] o.a.s.s.SolrDispatchFilter \__ \/ _ \ | '_| Install dir: /home/jenkins/jenkins-slave/workspace/Lucene/Lucene-Solr-Tests-8.11/solr
[junit4] 2> 304423 INFO (jetty-launcher-4117-thread-2) [ ] o.a.s.s.SolrDispatchFilter |___/\___/_|_| Start time: 2024-04-09T06:03:23.806Z
[junit4] 2> 304423 INFO (zkConnectionManagerCallback-4119-thread-1) [ ] o.a.s.c.c.ConnectionManager zkClient has connected
[junit4] 2> 304423 INFO (jetty-launcher-4117-thread-4) [ ] o.a.s.c.c.ConnectionManager Client is connected to ZooKeeper
[junit4] 2> 304424 INFO (jetty-launcher-4117-thread-4) [ ] o.a.s.s.SolrDispatchFilter solr.xml found in ZooKeeper. Loading...
[junit4] 2> 304428 INFO (jetty-launcher-4117-thread-4) [ ] o.a.s.c.SolrXmlConfig Metrics collection is disabled.
[junit4] 2> 304431 INFO (zkConnectionManagerCallback-4123-thread-1) [ ] o.a.s.c.c.ConnectionManager zkClient has connected
[junit4] 2> 304431 INFO (jetty-launcher-4117-thread-3) [ ] o.a.s.c.c.ConnectionManager Client is connected to ZooKeeper
[junit4] 2> 304432 INFO (jetty-launcher-4117-thread-3) [ ] o.a.s.s.SolrDispatchFilter solr.xml found in ZooKeeper. Loading...
[junit4] 2> 304435 INFO (jetty-launcher-4117-thread-3) [ ] o.a.s.c.SolrXmlConfig Metrics collection is disabled.
[junit4] 2> 304443 INFO (jetty-launcher-4117-thread-2) [ ] o.a.s.c.c.ConnectionManager Waiting for client to connect to ZooKeeper
[junit4] 2> 304444 WARN (jetty-launcher-4117-thread-4-SendThread(127.0.0.1:39993)) [ ] o.a.z.ClientCnxn An exception was thrown while closing send thread for session 0x10004fe7d7c0003.
[junit4] 2> => EndOfStreamException: Unable to read additional data from server sessionid 0x10004fe7d7c0003, likely server has closed socket
[junit4] 2> at org.apache.zookeeper.ClientCnxnSocketNIO.doIO(ClientCnxnSocketNIO.java:77)
[junit4] 2> org.apache.zookeeper.ClientCnxn$EndOfStreamException: Unable to read additional data from server sessionid 0x10004fe7d7c0003, likely server has closed socket
[junit4] 2> at org.apache.zookeeper.ClientCnxnSocketNIO.doIO(ClientCnxnSocketNIO.java:77) ~[zookeeper-3.6.2.jar:3.6.2]
[junit4] 2> at org.apache.zookeeper.ClientCnxnSocketNIO.doTransport(ClientCnxnSocketNIO.java:350) ~[zookeeper-3.6.2.jar:3.6.2]
[junit4] 2> at org.apache.zookeeper.ClientCnxn$SendThread.run(ClientCnxn.java:1275) [zookeeper-3.6.2.jar:3.6.2]
[junit4] 2> 304444 INFO (zkConnectionManagerCallback-4121-thread-1) [ ] o.a.s.c.c.ConnectionManager zkClient has connected
[junit4] 2> 304444 INFO (jetty-launcher-4117-thread-1) [ ] o.a.s.c.c.ConnectionManager Client is connected to ZooKeeper
[junit4] 2> 304444 WARN (jetty-launcher-4117-thread-3-SendThread(127.0.0.1:39993)) [ ] o.a.z.ClientCnxn An exception was thrown while closing send thread for session 0x10004fe7d7c0005.
[junit4] 2> => EndOfStreamException: Unable to read additional data from server sessionid 0x10004fe7d7c0005, likely server has closed socket
[junit4] 2> at org.apache.zookeeper.ClientCnxnSocketNIO.doIO(ClientCnxnSocketNIO.java:77)
[junit4] 2> org.apache.zookeeper.ClientCnxn$EndOfStreamException: Unable to read additional data from server sessionid 0x10004fe7d7c0005, likely server has closed socket
[junit4] 2> at org.apache.zookeeper.ClientCnxnSocketNIO.doIO(ClientCnxnSocketNIO.java:77) ~[zookeeper-3.6.2.jar:3.6.2]
[junit4] 2> at org.apache.zookeeper.ClientCnxnSocketNIO.doTransport(ClientCnxnSocketNIO.java:350) ~[zookeeper-3.6.2.jar:3.6.2]
[junit4] 2> at org.apache.zookeeper.ClientCnxn$SendThread.run(ClientCnxn.java:1275) [zookeeper-3.6.2.jar:3.6.2]
[junit4] 2> 304444 INFO (zkConnectionManagerCallback-4125-thread-1) [ ] o.a.s.c.c.ConnectionManager zkClient has connected
[junit4] 2> 304445 INFO (jetty-launcher-4117-thread-2) [ ] o.a.s.c.c.ConnectionManager Client is connected to ZooKeeper
[junit4] 2> 304551 INFO (jetty-launcher-4117-thread-2) [ ] o.a.s.s.SolrDispatchFilter solr.xml found in ZooKeeper. Loading...
[junit4] 2> 304552 INFO (jetty-launcher-4117-thread-1) [ ] o.a.s.s.SolrDispatchFilter solr.xml found in ZooKeeper. Loading...
[junit4] 2> 304555 INFO (jetty-launcher-4117-thread-2) [ ] o.a.s.c.SolrXmlConfig Metrics collection is disabled.
[junit4] 2> 304563 INFO (jetty-launcher-4117-thread-1) [ ] o.a.s.c.SolrXmlConfig Metrics collection is disabled.
[junit4] 2> 304564 WARN (jetty-launcher-4117-thread-2-SendThread(127.0.0.1:39993)) [ ] o.a.z.ClientCnxn An exception was thrown while closing send thread for session 0x10004fe7d7c0006.
[junit4] 2> => EndOfStreamException: Unable to read additional data from server sessionid 0x10004fe7d7c0006, likely server has closed socket
[junit4] 2> at org.apache.zookeeper.ClientCnxnSocketNIO.doIO(ClientCnxnSocketNIO.java:77)
[junit4] 2> org.apache.zookeeper.ClientCnxn$EndOfStreamException: Unable to read additional data from server sessionid 0x10004fe7d7c0006, likely server has closed socket
[junit4] 2> at org.apache.zookeeper.ClientCnxnSocketNIO.doIO(ClientCnxnSocketNIO.java:77) ~[zookeeper-3.6.2.jar:3.6.2]
[junit4] 2> at org.apache.zookeeper.ClientCnxnSocketNIO.doTransport(ClientCnxnSocketNIO.java:350) ~[zookeeper-3.6.2.jar:3.6.2]
[junit4] 2> at org.apache.zookeeper.ClientCnxn$SendThread.run(ClientCnxn.java:1275) [zookeeper-3.6.2.jar:3.6.2]
[junit4] 2> 304565 WARN (jetty-launcher-4117-thread-1-SendThread(127.0.0.1:39993)) [ ] o.a.z.ClientCnxn An exception was thrown while closing send thread for session 0x10004fe7d7c0004.
[junit4] 2> => EndOfStreamException: Unable to read additional data from server sessionid 0x10004fe7d7c0004, likely server has closed socket
[junit4] 2> at org.apache.zookeeper.ClientCnxnSocketNIO.doIO(ClientCnxnSocketNIO.java:77)
[junit4] 2> org.apache.zookeeper.ClientCnxn$EndOfStreamException: Unable to read additional data from server sessionid 0x10004fe7d7c0004, likely server has closed socket
[junit4] 2> at org.apache.zookeeper.ClientCnxnSocketNIO.doIO(ClientCnxnSocketNIO.java:77) ~[zookeeper-3.6.2.jar:3.6.2]
[junit4] 2> at org.apache.zookeeper.ClientCnxnSocketNIO.doTransport(ClientCnxnSocketNIO.java:350) ~[zookeeper-3.6.2.jar:3.6.2]
[junit4] 2> at org.apache.zookeeper.ClientCnxn$SendThread.run(ClientCnxn.java:1275) [zookeeper-3.6.2.jar:3.6.2]
[junit4] 2> 305020 INFO (jetty-launcher-4117-thread-4) [ ] o.a.s.h.c.HttpShardHandlerFactory Host whitelist initialized: WhitelistHostChecker [whitelistHosts=null, whitelistHostCheckingEnabled=true]
[junit4] 2> 305035 WARN (jetty-launcher-4117-thread-4) [ ] o.e.j.u.s.S.config Trusting all certificates configured for Client@51db3ccc[provider=null,keyStore=null,trustStore=null]
[junit4] 2> 305036 WARN (jetty-launcher-4117-thread-4) [ ] o.e.j.u.s.S.config No Client EndPointIdentificationAlgorithm configured for Client@51db3ccc[provider=null,keyStore=null,trustStore=null]
[junit4] 2> 305076 WARN (jetty-launcher-4117-thread-4) [ ] o.e.j.u.s.S.config Trusting all certificates configured for Client@205150b9[provider=null,keyStore=null,trustStore=null]
[junit4] 2> 305076 WARN (jetty-launcher-4117-thread-4) [ ] o.e.j.u.s.S.config No Client EndPointIdentificationAlgorithm configured for Client@205150b9[provider=null,keyStore=null,trustStore=null]
[junit4] 2> 305077 INFO (jetty-launcher-4117-thread-4) [ ] o.a.s.c.ZkContainer Zookeeper client=127.0.0.1:39993/solr
[junit4] 2> 305099 INFO (jetty-launcher-4117-thread-4) [ ] o.a.s.c.c.ConnectionManager Waiting for client to connect to ZooKeeper
[junit4] 2> 305111 INFO (zkConnectionManagerCallback-4145-thread-1) [ ] o.a.s.c.c.ConnectionManager zkClient has connected
[junit4] 2> 305111 INFO (jetty-launcher-4117-thread-4) [ ] o.a.s.c.c.ConnectionManager Client is connected to ZooKeeper
[junit4] 2> 305112 WARN (jetty-launcher-4117-thread-4-SendThread(127.0.0.1:39993)) [ ] o.a.z.ClientCnxn An exception was thrown while closing send thread for session 0x10004fe7d7c0007.
[junit4] 2> => EndOfStreamException: Unable to read additional data from server sessionid 0x10004fe7d7c0007, likely server has closed socket
[junit4] 2> at org.apache.zookeeper.ClientCnxnSocketNIO.doIO(ClientCnxnSocketNIO.java:77)
[junit4] 2> org.apache.zookeeper.ClientCnxn$EndOfStreamException: Unable to read additional data from server sessionid 0x10004fe7d7c0007, likely server has closed socket
[junit4] 2> at org.apache.zookeeper.ClientCnxnSocketNIO.doIO(ClientCnxnSocketNIO.java:77) ~[zookeeper-3.6.2.jar:3.6.2]
[junit4] 2> at org.apache.zookeeper.ClientCnxnSocketNIO.doTransport(ClientCnxnSocketNIO.java:350) ~[zookeeper-3.6.2.jar:3.6.2]
[junit4] 2> at org.apache.zookeeper.ClientCnxn$SendThread.run(ClientCnxn.java:1275) [zookeeper-3.6.2.jar:3.6.2]
[junit4] 2> 305443 INFO (jetty-launcher-4117-thread-4) [n:127.0.0.1:33675_solr ] o.a.s.c.c.ConnectionManager Waiting for client to connect to ZooKeeper
[junit4] 2> 305459 INFO (zkConnectionManagerCallback-4147-thread-1) [ ] o.a.s.c.c.ConnectionManager zkClient has connected
[junit4] 2> 305459 INFO (jetty-launcher-4117-thread-4) [n:127.0.0.1:33675_solr ] o.a.s.c.c.ConnectionManager Client is connected to ZooKeeper
[junit4] 2> 305538 WARN (jetty-launcher-4117-thread-4) [n:127.0.0.1:33675_solr ] o.a.s.c.ZkController Contents of zookeeper /security.json are world-readable; consider setting up ACLs as described in https://solr.apache.org/guide/zookeeper-access-control.html
[junit4] 2> 305544 INFO (jetty-launcher-4117-thread-4) [n:127.0.0.1:33675_solr ] o.a.s.c.OverseerElectionContext I am going to be the leader 127.0.0.1:33675_solr
[junit4] 2> 305544 INFO (jetty-launcher-4117-thread-4) [n:127.0.0.1:33675_solr ] o.a.s.c.Overseer Overseer (id=72063085111410696-127.0.0.1:33675_solr-n_0000000000) starting
[junit4] 2> 305557 INFO (OverseerStateUpdate-72063085111410696-127.0.0.1:33675_solr-n_0000000000) [n:127.0.0.1:33675_solr ] o.a.s.c.Overseer Starting to work on the main queue : 127.0.0.1:33675_solr
[junit4] 2> 305568 INFO (jetty-launcher-4117-thread-4) [n:127.0.0.1:33675_solr ] o.a.s.c.ZkController Register node as live in ZooKeeper:/live_nodes/127.0.0.1:33675_solr
[junit4] 2> 305570 INFO (jetty-launcher-4117-thread-4) [n:127.0.0.1:33675_solr ] o.a.s.c.ZkController non-data nodes now []
[junit4] 2> 305571 INFO (jetty-launcher-4117-thread-4) [n:127.0.0.1:33675_solr ] o.a.s.p.PackageLoader /packages.json updated to version -1
[junit4] 2> 305571 WARN (jetty-launcher-4117-thread-4) [n:127.0.0.1:33675_solr ] o.a.s.c.CoreContainer Not all security plugins configured! authentication=disabled authorization=disabled. Solr is only as secure as you make it. Consider configuring authentication/authorization before exposing Solr to users internal or external. See https://s.apache.org/solrsecurity for more info
[junit4] 2> 305579 INFO (zkCallback-4146-thread-1) [ ] o.a.s.c.c.ZkStateReader Updated live nodes from ZooKeeper... (0) -> (1)
[junit4] 2> 305628 INFO (jetty-launcher-4117-thread-4) [n:127.0.0.1:33675_solr ] o.a.s.c.CorePropertiesLocator Found 0 core definitions underneath /home/jenkins/jenkins-slave/workspace/Lucene/Lucene-Solr-Tests-8.11/solr/build/solr-core/test/J1/temp/solr.cloud.TestPullReplicaErrorHandling_C4CD77A282861F5A-001/tempDir-001/node4
[junit4] 2> 305732 INFO (jetty-launcher-4117-thread-3) [ ] o.a.s.h.c.HttpShardHandlerFactory Host whitelist initialized: WhitelistHostChecker [whitelistHosts=null, whitelistHostCheckingEnabled=true]
[junit4] 2> 305732 WARN (jetty-launcher-4117-thread-3) [ ] o.e.j.u.s.S.config Trusting all certificates configured for Client@8b15f2d[provider=null,keyStore=null,trustStore=null]
[junit4] 2> 305732 WARN (jetty-launcher-4117-thread-3) [ ] o.e.j.u.s.S.config No Client EndPointIdentificationAlgorithm configured for Client@8b15f2d[provider=null,keyStore=null,trustStore=null]
[junit4] 2> 305749 WARN (jetty-launcher-4117-thread-3) [ ] o.e.j.u.s.S.config Trusting all certificates configured for Client@3aee0d3d[provider=null,keyStore=null,trustStore=null]
[junit4] 2> 305749 WARN (jetty-launcher-4117-thread-3) [ ] o.e.j.u.s.S.config No Client EndPointIdentificationAlgorithm configured for Client@3aee0d3d[provider=null,keyStore=null,trustStore=null]
[junit4] 2> 305751 INFO (jetty-launcher-4117-thread-3) [ ] o.a.s.c.ZkContainer Zookeeper client=127.0.0.1:39993/solr
[junit4] 2> 305771 INFO (jetty-launcher-4117-thread-3) [ ] o.a.s.c.c.ConnectionManager Waiting for client to connect to ZooKeeper
[junit4] 2> 305791 INFO (zkConnectionManagerCallback-4165-thread-1) [ ] o.a.s.c.c.ConnectionManager zkClient has connected
[junit4] 2> 305791 INFO (jetty-launcher-4117-thread-3) [ ] o.a.s.c.c.ConnectionManager Client is connected to ZooKeeper
[junit4] 2> 305939 INFO (jetty-launcher-4117-thread-3) [n:127.0.0.1:46819_solr ] o.a.s.c.c.ConnectionManager Waiting for client to connect to ZooKeeper
[junit4] 2> 305955 INFO (zkConnectionManagerCallback-4167-thread-1) [ ] o.a.s.c.c.ConnectionManager zkClient has connected
[junit4] 2> 305955 INFO (jetty-launcher-4117-thread-3) [n:127.0.0.1:46819_solr ] o.a.s.c.c.ConnectionManager Client is connected to ZooKeeper
[junit4] 2> 305962 WARN (jetty-launcher-4117-thread-3) [n:127.0.0.1:46819_solr ] o.a.s.c.ZkController Contents of zookeeper /security.json are world-readable; consider setting up ACLs as described in https://solr.apache.org/guide/zookeeper-access-control.html
[junit4] 2> 305963 INFO (jetty-launcher-4117-thread-3) [n:127.0.0.1:46819_solr ] o.a.s.c.c.ZkStateReader Updated live nodes from ZooKeeper... (0) -> (1)
[junit4] 2> 305968 INFO (jetty-launcher-4117-thread-3) [n:127.0.0.1:46819_solr ] o.a.s.c.ZkController Publish node=127.0.0.1:46819_solr as DOWN
[junit4] 2> 305968 INFO (jetty-launcher-4117-thread-3) [n:127.0.0.1:46819_solr ] o.a.s.c.TransientSolrCoreCacheDefault Allocating transient core cache for max 2147483647 cores with initial capacity of 1024
[junit4] 2> 305968 INFO (jetty-launcher-4117-thread-3) [n:127.0.0.1:46819_solr ] o.a.s.c.ZkController Register node as live in ZooKeeper:/live_nodes/127.0.0.1:46819_solr
[junit4] 2> 305970 INFO (jetty-launcher-4117-thread-3) [n:127.0.0.1:46819_solr ] o.a.s.c.ZkController non-data nodes now []
[junit4] 2> 305971 INFO (jetty-launcher-4117-thread-3) [n:127.0.0.1:46819_solr ] o.a.s.p.PackageLoader /packages.json updated to version -1
[junit4] 2> 305972 WARN (jetty-launcher-4117-thread-3) [n:127.0.0.1:46819_solr ] o.a.s.c.CoreContainer Not all security plugins configured! authentication=disabled authorization=disabled. Solr is only as secure as you make it. Consider configuring authentication/authorization before exposing Solr to users internal or external. See https://s.apache.org/solrsecurity for more info
[junit4] 2> 305991 INFO (zkCallback-4146-thread-1) [ ] o.a.s.c.c.ZkStateReader Updated live nodes from ZooKeeper... (1) -> (2)
[junit4] 2> 305995 INFO (zkCallback-4166-thread-1) [ ] o.a.s.c.c.ZkStateReader Updated live nodes from ZooKeeper... (1) -> (2)
[junit4] 2> 306008 INFO (jetty-launcher-4117-thread-3) [n:127.0.0.1:46819_solr ] o.a.s.c.CorePropertiesLocator Found 0 core definitions underneath /home/jenkins/jenkins-slave/workspace/Lucene/Lucene-Solr-Tests-8.11/solr/build/solr-core/test/J1/temp/solr.cloud.TestPullReplicaErrorHandling_C4CD77A282861F5A-001/tempDir-001/node3
[junit4] 2> 306028 INFO (jetty-launcher-4117-thread-2) [ ] o.a.s.h.c.HttpShardHandlerFactory Host whitelist initialized: WhitelistHostChecker [whitelistHosts=null, whitelistHostCheckingEnabled=true]
[junit4] 2> 306035 WARN (jetty-launcher-4117-thread-2) [ ] o.e.j.u.s.S.config Trusting all certificates configured for Client@1e219c0d[provider=null,keyStore=null,trustStore=null]
[junit4] 2> 306041 WARN (jetty-launcher-4117-thread-2) [ ] o.e.j.u.s.S.config No Client EndPointIdentificationAlgorithm configured for Client@1e219c0d[provider=null,keyStore=null,trustStore=null]
[junit4] 2> 306063 WARN (jetty-launcher-4117-thread-2) [ ] o.e.j.u.s.S.config Trusting all certificates configured for Client@8d89772[provider=null,keyStore=null,trustStore=null]
[junit4] 2> 306063 WARN (jetty-launcher-4117-thread-2) [ ] o.e.j.u.s.S.config No Client EndPointIdentificationAlgorithm configured for Client@8d89772[provider=null,keyStore=null,trustStore=null]
[junit4] 2> 306064 INFO (jetty-launcher-4117-thread-2) [ ] o.a.s.c.ZkContainer Zookeeper client=127.0.0.1:39993/solr
[junit4] 2> 306282 INFO (jetty-launcher-4117-thread-2) [ ] o.a.s.c.c.ConnectionManager Waiting for client to connect to ZooKeeper
[junit4] 2> 306293 INFO (zkConnectionManagerCallback-4181-thread-1) [ ] o.a.s.c.c.ConnectionManager zkClient has connected
[junit4] 2> 306294 INFO (jetty-launcher-4117-thread-2) [ ] o.a.s.c.c.ConnectionManager Client is connected to ZooKeeper
[junit4] 2> 306295 WARN (jetty-launcher-4117-thread-2-SendThread(127.0.0.1:39993)) [ ] o.a.z.ClientCnxn An exception was thrown while closing send thread for session 0x10004fe7d7c000b.
[junit4] 2> => EndOfStreamException: Unable to read additional data from server sessionid 0x10004fe7d7c000b, likely server has closed socket
[junit4] 2> at org.apache.zookeeper.ClientCnxnSocketNIO.doIO(ClientCnxnSocketNIO.java:77)
[junit4] 2> org.apache.zookeeper.ClientCnxn$EndOfStreamException: Unable to read additional data from server sessionid 0x10004fe7d7c000b, likely server has closed socket
[junit4] 2> at org.apache.zookeeper.ClientCnxnSocketNIO.doIO(ClientCnxnSocketNIO.java:77) ~[zookeeper-3.6.2.jar:3.6.2]
[junit4] 2> at org.apache.zookeeper.ClientCnxnSocketNIO.doTransport(ClientCnxnSocketNIO.java:350) ~[zookeeper-3.6.2.jar:3.6.2]
[junit4] 2> at org.apache.zookeeper.ClientCnxn$SendThread.run(ClientCnxn.java:1275) [zookeeper-3.6.2.jar:3.6.2]
[junit4] 2> 306397 INFO (jetty-launcher-4117-thread-2) [n:127.0.0.1:36915_solr ] o.a.s.c.c.ConnectionManager Waiting for client to connect to ZooKeeper
[junit4] 2> 306408 INFO (zkConnectionManagerCallback-4183-thread-1) [ ] o.a.s.c.c.ConnectionManager zkClient has connected
[junit4] 2> 306409 INFO (jetty-launcher-4117-thread-2) [n:127.0.0.1:36915_solr ] o.a.s.c.c.ConnectionManager Client is connected to ZooKeeper
[junit4] 2> 306414 WARN (jetty-launcher-4117-thread-2) [n:127.0.0.1:36915_solr ] o.a.s.c.ZkController Contents of zookeeper /security.json are world-readable; consider setting up ACLs as described in https://solr.apache.org/guide/zookeeper-access-control.html
[junit4] 2> 306416 INFO (jetty-launcher-4117-thread-2) [n:127.0.0.1:36915_solr ] o.a.s.c.c.ZkStateReader Updated live nodes from ZooKeeper... (0) -> (2)
[junit4] 2> 306420 INFO (jetty-launcher-4117-thread-2) [n:127.0.0.1:36915_solr ] o.a.s.c.ZkController Publish node=127.0.0.1:36915_solr as DOWN
[junit4] 2> 306420 INFO (jetty-launcher-4117-thread-2) [n:127.0.0.1:36915_solr ] o.a.s.c.TransientSolrCoreCacheDefault Allocating transient core cache for max 2147483647 cores with initial capacity of 1024
[junit4] 2> 306420 INFO (jetty-launcher-4117-thread-2) [n:127.0.0.1:36915_solr ] o.a.s.c.ZkController Register node as live in ZooKeeper:/live_nodes/127.0.0.1:36915_solr
[junit4] 2> 306421 INFO (zkCallback-4146-thread-1) [ ] o.a.s.c.c.ZkStateReader Updated live nodes from ZooKeeper... (2) -> (3)
[junit4] 2> 306421 INFO (zkCallback-4166-thread-1) [ ] o.a.s.c.c.ZkStateReader Updated live nodes from ZooKeeper... (2) -> (3)
[junit4] 2> 306421 INFO (zkCallback-4182-thread-1) [ ] o.a.s.c.c.ZkStateReader Updated live nodes from ZooKeeper... (2) -> (3)
[junit4] 2> 306422 INFO (jetty-launcher-4117-thread-2) [n:127.0.0.1:36915_solr ] o.a.s.c.ZkController non-data nodes now []
[junit4] 2> 306427 INFO (jetty-launcher-4117-thread-2) [n:127.0.0.1:36915_solr ] o.a.s.p.PackageLoader /packages.json updated to version -1
[junit4] 2> 306427 WARN (jetty-launcher-4117-thread-2) [n:127.0.0.1:36915_solr ] o.a.s.c.CoreContainer Not all security plugins configured! authentication=disabled authorization=disabled. Solr is only as secure as you make it. Consider configuring authentication/authorization before exposing Solr to users internal or external. See https://s.apache.org/solrsecurity for more info
[junit4] 2> 306434 INFO (jetty-launcher-4117-thread-1) [ ] o.a.s.h.c.HttpShardHandlerFactory Host whitelist initialized: WhitelistHostChecker [whitelistHosts=null, whitelistHostCheckingEnabled=true]
[junit4] 2> 306435 WARN (jetty-launcher-4117-thread-1) [ ] o.e.j.u.s.S.config Trusting all certificates configured for Client@141abeef[provider=null,keyStore=null,trustStore=null]
[junit4] 2> 306436 WARN (jetty-launcher-4117-thread-1) [ ] o.e.j.u.s.S.config No Client EndPointIdentificationAlgorithm configured for Client@141abeef[provider=null,keyStore=null,trustStore=null]
[junit4] 2> 306451 WARN (jetty-launcher-4117-thread-1) [ ] o.e.j.u.s.S.config Trusting all certificates configured for Client@661c83d4[provider=null,keyStore=null,trustStore=null]
[junit4] 2> 306451 WARN (jetty-launcher-4117-thread-1) [ ] o.e.j.u.s.S.config No Client EndPointIdentificationAlgorithm configured for Client@661c83d4[provider=null,keyStore=null,trustStore=null]
[junit4] 2> 306452 INFO (jetty-launcher-4117-thread-1) [ ] o.a.s.c.ZkContainer Zookeeper client=127.0.0.1:39993/solr
[junit4] 2> 306458 INFO (jetty-launcher-4117-thread-1) [ ] o.a.s.c.c.ConnectionManager Waiting for client to connect to ZooKeeper
[junit4] 2> 306522 INFO (zkConnectionManagerCallback-4194-thread-1) [ ] o.a.s.c.c.ConnectionManager zkClient has connected
[junit4] 2> 306522 INFO (jetty-launcher-4117-thread-1) [ ] o.a.s.c.c.ConnectionManager Client is connected to ZooKeeper
[junit4] 2> 306529 INFO (jetty-launcher-4117-thread-2) [n:127.0.0.1:36915_solr ] o.a.s.c.CorePropertiesLocator Found 0 core definitions underneath /home/jenkins/jenkins-slave/workspace/Lucene/Lucene-Solr-Tests-8.11/solr/build/solr-core/test/J1/temp/solr.cloud.TestPullReplicaErrorHandling_C4CD77A282861F5A-001/tempDir-001/node2
[junit4] 2> 306529 WARN (jetty-launcher-4117-thread-1-SendThread(127.0.0.1:39993)) [ ] o.a.z.ClientCnxn An exception was thrown while closing send thread for session 0x10004fe7d7c000d.
[junit4] 2> => EndOfStreamException: Unable to read additional data from server sessionid 0x10004fe7d7c000d, likely server has closed socket
[junit4] 2> at org.apache.zookeeper.ClientCnxnSocketNIO.doIO(ClientCnxnSocketNIO.java:77)
[junit4] 2> org.apache.zookeeper.ClientCnxn$EndOfStreamException: Unable to read additional data from server sessionid 0x10004fe7d7c000d, likely server has closed socket
[junit4] 2> at org.apache.zookeeper.ClientCnxnSocketNIO.doIO(ClientCnxnSocketNIO.java:77) ~[zookeeper-3.6.2.jar:3.6.2]
[junit4] 2> at org.apache.zookeeper.ClientCnxnSocketNIO.doTransport(ClientCnxnSocketNIO.java:350) ~[zookeeper-3.6.2.jar:3.6.2]
[junit4] 2> at org.apache.zookeeper.ClientCnxn$SendThread.run(ClientCnxn.java:1275) [zookeeper-3.6.2.jar:3.6.2]
[junit4] 2> 306816 INFO (jetty-launcher-4117-thread-1) [n:127.0.0.1:42791_solr ] o.a.s.c.c.ConnectionManager Waiting for client to connect to ZooKeeper
[junit4] 2> 306827 INFO (zkConnectionManagerCallback-4199-thread-1) [ ] o.a.s.c.c.ConnectionManager zkClient has connected
[junit4] 2> 306827 INFO (jetty-launcher-4117-thread-1) [n:127.0.0.1:42791_solr ] o.a.s.c.c.ConnectionManager Client is connected to ZooKeeper
[junit4] 2> 306832 WARN (jetty-launcher-4117-thread-1) [n:127.0.0.1:42791_solr ] o.a.s.c.ZkController Contents of zookeeper /security.json are world-readable; consider setting up ACLs as described in https://solr.apache.org/guide/zookeeper-access-control.html
[junit4] 2> 306834 INFO (jetty-launcher-4117-thread-1) [n:127.0.0.1:42791_solr ] o.a.s.c.c.ZkStateReader Updated live nodes from ZooKeeper... (0) -> (3)
[junit4] 2> 306837 INFO (jetty-launcher-4117-thread-1) [n:127.0.0.1:42791_solr ] o.a.s.c.ZkController Publish node=127.0.0.1:42791_solr as DOWN
[junit4] 2> 306837 INFO (jetty-launcher-4117-thread-1) [n:127.0.0.1:42791_solr ] o.a.s.c.TransientSolrCoreCacheDefault Allocating transient core cache for max 2147483647 cores with initial capacity of 1024
[junit4] 2> 306837 INFO (jetty-launcher-4117-thread-1) [n:127.0.0.1:42791_solr ] o.a.s.c.ZkController Register node as live in ZooKeeper:/live_nodes/127.0.0.1:42791_solr
[junit4] 2> 306838 INFO (zkCallback-4182-thread-1) [ ] o.a.s.c.c.ZkStateReader Updated live nodes from ZooKeeper... (3) -> (4)
[junit4] 2> 306838 INFO (zkCallback-4166-thread-1) [ ] o.a.s.c.c.ZkStateReader Updated live nodes from ZooKeeper... (3) -> (4)
[junit4] 2> 306838 INFO (zkCallback-4146-thread-1) [ ] o.a.s.c.c.ZkStateReader Updated live nodes from ZooKeeper... (3) -> (4)
[junit4] 2> 306840 INFO (jetty-launcher-4117-thread-1) [n:127.0.0.1:42791_solr ] o.a.s.c.ZkController non-data nodes now []
[junit4] 2> 306840 INFO (zkCallback-4198-thread-1) [ ] o.a.s.c.c.ZkStateReader Updated live nodes from ZooKeeper... (3) -> (4)
[junit4] 2> 306841 INFO (jetty-launcher-4117-thread-1) [n:127.0.0.1:42791_solr ] o.a.s.p.PackageLoader /packages.json updated to version -1
[junit4] 2> 306841 WARN (jetty-launcher-4117-thread-1) [n:127.0.0.1:42791_solr ] o.a.s.c.CoreContainer Not all security plugins configured! authentication=disabled authorization=disabled. Solr is only as secure as you make it. Consider configuring authentication/authorization before exposing Solr to users internal or external. See https://s.apache.org/solrsecurity for more info
[junit4] 2> 306864 INFO (jetty-launcher-4117-thread-1) [n:127.0.0.1:42791_solr ] o.a.s.c.CorePropertiesLocator Found 0 core definitions underneath /home/jenkins/jenkins-slave/workspace/Lucene/Lucene-Solr-Tests-8.11/solr/build/solr-core/test/J1/temp/solr.cloud.TestPullReplicaErrorHandling_C4CD77A282861F5A-001/tempDir-001/node1
[junit4] 2> 306878 INFO (SUITE-TestPullReplicaErrorHandling-seed#[C4CD77A282861F5A]-worker) [ ] o.a.s.c.MiniSolrCloudCluster waitForAllNodes: numServers=4
[junit4] 2> 306879 INFO (SUITE-TestPullReplicaErrorHandling-seed#[C4CD77A282861F5A]-worker) [ ] o.a.s.c.c.ConnectionManager Waiting for client to connect to ZooKeeper
[junit4] 2> 306882 INFO (zkConnectionManagerCallback-4210-thread-1) [ ] o.a.s.c.c.ConnectionManager zkClient has connected
[junit4] 2> 306882 INFO (SUITE-TestPullReplicaErrorHandling-seed#[C4CD77A282861F5A]-worker) [ ] o.a.s.c.c.ConnectionManager Client is connected to ZooKeeper
[junit4] 2> 306883 INFO (SUITE-TestPullReplicaErrorHandling-seed#[C4CD77A282861F5A]-worker) [ ] o.a.s.c.c.ZkStateReader Updated live nodes from ZooKeeper... (0) -> (4)
[junit4] 2> 306884 INFO (SUITE-TestPullReplicaErrorHandling-seed#[C4CD77A282861F5A]-worker) [ ] o.a.s.c.s.i.ZkClientClusterStateProvider Cluster at 127.0.0.1:39993/solr ready
[junit4] 2> 306887 INFO (SUITE-TestPullReplicaErrorHandling-seed#[C4CD77A282861F5A]-worker) [ ] o.a.s.c.CoreContainer Shutting down CoreContainer instance=1288893596
[junit4] 2> 306887 INFO (SUITE-TestPullReplicaErrorHandling-seed#[C4CD77A282861F5A]-worker) [ ] o.a.s.c.ZkController Remove node as live in ZooKeeper:/live_nodes/127.0.0.1:33675_solr
[junit4] 2> 306887 INFO (SUITE-TestPullReplicaErrorHandling-seed#[C4CD77A282861F5A]-worker) [ ] o.a.s.c.ZkController Publish this node as DOWN...
[junit4] 2> 306887 INFO (SUITE-TestPullReplicaErrorHandling-seed#[C4CD77A282861F5A]-worker) [ ] o.a.s.c.ZkController Publish node=127.0.0.1:33675_solr as DOWN
[junit4] 2> 306887 INFO (SUITE-TestPullReplicaErrorHandling-seed#[C4CD77A282861F5A]-worker) [ ] o.a.s.c.TransientSolrCoreCacheDefault Allocating transient core cache for max 2147483647 cores with initial capacity of 1024
[junit4] 2> 306896 INFO (SUITE-TestPullReplicaErrorHandling-seed#[C4CD77A282861F5A]-worker) [ ] o.a.s.m.SolrMetricManager Closing metric reporters for registry=solr.node tag=null
[junit4] 2> 306896 INFO (SUITE-TestPullReplicaErrorHandling-seed#[C4CD77A282861F5A]-worker) [ ] o.a.s.m.SolrMetricManager Closing metric reporters for registry=solr.jvm tag=null
[junit4] 2> 306896 INFO (SUITE-TestPullReplicaErrorHandling-seed#[C4CD77A282861F5A]-worker) [ ] o.a.s.m.SolrMetricManager Closing metric reporters for registry=solr.jetty tag=null
[junit4] 2> 306896 INFO (SUITE-TestPullReplicaErrorHandling-seed#[C4CD77A282861F5A]-worker) [ ] o.a.s.m.SolrMetricManager Closing metric reporters for registry=solr.cluster tag=null
[junit4] 2> 306897 INFO (closeThreadPool-4215-thread-2) [ ] o.a.s.c.Overseer Overseer (id=72063085111410696-127.0.0.1:33675_solr-n_0000000000) closing
[junit4] 2> 306904 INFO (OverseerStateUpdate-72063085111410696-127.0.0.1:33675_solr-n_0000000000) [n:127.0.0.1:33675_solr ] o.a.s.c.Overseer Overseer Loop exiting : 127.0.0.1:33675_solr
[junit4] 2> 306904 INFO (OverseerAutoScalingTriggerThread-72063085111410696-127.0.0.1:33675_solr-n_0000000000) [ ] o.a.s.c.a.OverseerTriggerThread OverseerTriggerThread woken up but we are closed, exiting.
[junit4] 2> 306909 INFO (closeThreadPool-4215-thread-1) [ ] o.a.s.c.Overseer Overseer (id=72063085111410696-127.0.0.1:33675_solr-n_0000000000) closing
[junit4] 2> 306909 WARN (jetty-launcher-4117-thread-4-SendThread(127.0.0.1:39993)) [ ] o.a.z.ClientCnxn An exception was thrown while closing send thread for session 0x10004fe7d7c0008.
[junit4] 2> => EndOfStreamException: Unable to read additional data from server sessionid 0x10004fe7d7c0008, likely server has closed socket
[junit4] 2> at org.apache.zookeeper.ClientCnxnSocketNIO.doIO(ClientCnxnSocketNIO.java:77)
[junit4] 2> org.apache.zookeeper.ClientCnxn$EndOfStreamException: Unable to read additional data from server sessionid 0x10004fe7d7c0008, likely server has closed socket
[junit4] 2> at org.apache.zookeeper.ClientCnxnSocketNIO.doIO(ClientCnxnSocketNIO.java:77) ~[zookeeper-3.6.2.jar:3.6.2]
[junit4] 2> at org.apache.zookeeper.ClientCnxnSocketNIO.doTransport(ClientCnxnSocketNIO.java:350) ~[zookeeper-3.6.2.jar:3.6.2]
[junit4] 2> at org.apache.zookeeper.ClientCnxn$SendThread.run(ClientCnxn.java:1275) [zookeeper-3.6.2.jar:3.6.2]
[junit4] 2> 306910 INFO (zkCallback-4182-thread-1) [ ] o.a.s.c.c.ZkStateReader Updated live nodes from ZooKeeper... (4) -> (3)
[junit4] 2> 306910 INFO (zkCallback-4166-thread-1) [ ] o.a.s.c.OverseerElectionContext I am going to be the leader 127.0.0.1:46819_solr
[junit4] 2> 306911 INFO (zkCallback-4166-thread-1) [n:127.0.0.1:46819_solr ] o.a.s.c.Overseer Overseer (id=72063085111410698-127.0.0.1:46819_solr-n_0000000001) starting
[junit4] 2> 306915 INFO (zkCallback-4198-thread-1) [ ] o.a.s.c.c.ZkStateReader Updated live nodes from ZooKeeper... (4) -> (3)
[junit4] 2> 306916 INFO (zkCallback-4166-thread-2) [ ] o.a.s.c.c.ZkStateReader Updated live nodes from ZooKeeper... (4) -> (3)
[junit4] 2> 306916 INFO (zkCallback-4209-thread-1) [ ] o.a.s.c.c.ZkStateReader Updated live nodes from ZooKeeper... (4) -> (3)
[junit4] 2> 306919 INFO (OverseerStateUpdate-72063085111410698-127.0.0.1:46819_solr-n_0000000001) [n:127.0.0.1:46819_solr ] o.a.s.c.Overseer Starting to work on the main queue : 127.0.0.1:46819_solr
[junit4] 2> 307014 INFO (SUITE-TestPullReplicaErrorHandling-seed#[C4CD77A282861F5A]-worker) [ ] o.a.s.c.Overseer Overseer (id=72063085111410696-127.0.0.1:33675_solr-n_0000000000) closing
[junit4] 2> 307015 INFO (SUITE-TestPullReplicaErrorHandling-seed#[C4CD77A282861F5A]-worker) [ ] o.e.j.s.AbstractConnector Stopped ServerConnector@406d8d7f{HTTP/1.1, (http/1.1, h2c)}{127.0.0.1:0}
[junit4] 2> 307016 INFO (SUITE-TestPullReplicaErrorHandling-seed#[C4CD77A282861F5A]-worker) [ ] o.e.j.s.h.ContextHandler Stopped o.e.j.s.ServletContextHandler@ea90b0e{/solr,null,STOPPED}
[junit4] 2> 307016 INFO (SUITE-TestPullReplicaErrorHandling-seed#[C4CD77A282861F5A]-worker) [ ] o.e.j.s.session node0 Stopped scavenging
[junit4] 2> 307019 INFO (SUITE-TestPullReplicaErrorHandling-seed#[C4CD77A282861F5A]-worker) [ ] o.a.s.c.s.e.JettySolrRunner Start Jetty (configured port=0, binding port=0)
[junit4] 2> 307019 INFO (SUITE-TestPullReplicaErrorHandling-seed#[C4CD77A282861F5A]-worker) [ ] o.a.s.c.s.e.JettySolrRunner Trying to start Jetty on port 0 try number 2 ...
[junit4] 2> 307019 INFO (SUITE-TestPullReplicaErrorHandling-seed#[C4CD77A282861F5A]-worker) [ ] o.e.j.s.Server jetty-9.4.53.v20231009; built: 2023-10-09T12:29:09.265Z; git: 27bde00a0b95a1d5bbee0eae7984f891d2d0f8c9; jvm 1.8.0_362-b09
[junit4] 2> 307035 INFO (SUITE-TestPullReplicaErrorHandling-seed#[C4CD77A282861F5A]-worker) [ ] o.e.j.s.session DefaultSessionIdManager workerName=node0
[junit4] 2> 307035 INFO (SUITE-TestPullReplicaErrorHandling-seed#[C4CD77A282861F5A]-worker) [ ] o.e.j.s.session No SessionScavenger set, using defaults
[junit4] 2> 307035 INFO (SUITE-TestPullReplicaErrorHandling-seed#[C4CD77A282861F5A]-worker) [ ] o.e.j.s.session node0 Scavenging every 660000ms
[junit4] 2> 307039 INFO (SUITE-TestPullReplicaErrorHandling-seed#[C4CD77A282861F5A]-worker) [ ] o.e.j.s.h.ContextHandler Started o.e.j.s.ServletContextHandler@1695d51{/solr,null,AVAILABLE}
[junit4] 2> 307040 INFO (SUITE-TestPullReplicaErrorHandling-seed#[C4CD77A282861F5A]-worker) [ ] o.e.j.s.AbstractConnector Started ServerConnector@53df9c3e{HTTP/1.1, (http/1.1, h2c)}{127.0.0.1:46833}
[junit4] 2> 307040 INFO (SUITE-TestPullReplicaErrorHandling-seed#[C4CD77A282861F5A]-worker) [ ] o.e.j.s.Server Started @307071ms
[junit4] 2> 307040 INFO (SUITE-TestPullReplicaErrorHandling-seed#[C4CD77A282861F5A]-worker) [ ] o.a.s.c.s.e.JettySolrRunner Jetty properties: {hostContext=/solr, zkHost=127.0.0.1:39993/solr, hostPort=35067}
[junit4] 2> 307040 ERROR (SUITE-TestPullReplicaErrorHandling-seed#[C4CD77A282861F5A]-worker) [ ] o.a.s.u.StartupLoggingUtils Missing Java Option solr.log.dir. Logging may be missing or incomplete.
[junit4] 2> 307040 INFO (SUITE-TestPullReplicaErrorHandling-seed#[C4CD77A282861F5A]-worker) [ ] o.a.s.s.SolrDispatchFilter Using logger factory org.apache.logging.slf4j.Log4jLoggerFactory
[junit4] 2> 307040 INFO (SUITE-TestPullReplicaErrorHandling-seed#[C4CD77A282861F5A]-worker) [ ] o.a.s.s.SolrDispatchFilter ___ _ Welcome to Apache Solr™ version 8.11.4
[junit4] 2> 307040 INFO (SUITE-TestPullReplicaErrorHandling-seed#[C4CD77A282861F5A]-worker) [ ] o.a.s.s.SolrDispatchFilter / __| ___| |_ _ Starting in cloud mode on port null
[junit4] 2> 307040 INFO (SUITE-TestPullReplicaErrorHandling-seed#[C4CD77A282861F5A]-worker) [ ] o.a.s.s.SolrDispatchFilter \__ \/ _ \ | '_| Install dir: /home/jenkins/jenkins-slave/workspace/Lucene/Lucene-Solr-Tests-8.11/solr
[junit4] 2> 307040 INFO (SUITE-TestPullReplicaErrorHandling-seed#[C4CD77A282861F5A]-worker) [ ] o.a.s.s.SolrDispatchFilter |___/\___/_|_| Start time: 2024-04-09T06:03:26.423Z
[junit4] 2> 307044 INFO (SUITE-TestPullReplicaErrorHandling-seed#[C4CD77A282861F5A]-worker) [ ] o.a.s.c.c.ConnectionManager Waiting for client to connect to ZooKeeper
[junit4] 2> 307044 INFO (zkConnectionManagerCallback-4221-thread-1) [ ] o.a.s.c.c.ConnectionManager zkClient has connected
[junit4] 2> 307044 INFO (SUITE-TestPullReplicaErrorHandling-seed#[C4CD77A282861F5A]-worker) [ ] o.a.s.c.c.ConnectionManager Client is connected to ZooKeeper
[junit4] 2> 307045 INFO (SUITE-TestPullReplicaErrorHandling-seed#[C4CD77A282861F5A]-worker) [ ] o.a.s.s.SolrDispatchFilter solr.xml found in ZooKeeper. Loading...
[junit4] 2> 307049 INFO (SUITE-TestPullReplicaErrorHandling-seed#[C4CD77A282861F5A]-worker) [ ] o.a.s.c.SolrXmlConfig Metrics collection is disabled.
[junit4] 2> 308462 INFO (SUITE-TestPullReplicaErrorHandling-seed#[C4CD77A282861F5A]-worker) [ ] o.a.s.h.c.HttpShardHandlerFactory Host whitelist initialized: WhitelistHostChecker [whitelistHosts=null, whitelistHostCheckingEnabled=true]
[junit4] 2> 308463 WARN (SUITE-TestPullReplicaErrorHandling-seed#[C4CD77A282861F5A]-worker) [ ] o.e.j.u.s.S.config Trusting all certificates configured for Client@17f4e452[provider=null,keyStore=null,trustStore=null]
[junit4] 2> 308463 WARN (SUITE-TestPullReplicaErrorHandling-seed#[C4CD77A282861F5A]-worker) [ ] o.e.j.u.s.S.config No Client EndPointIdentificationAlgorithm configured for Client@17f4e452[provider=null,keyStore=null,trustStore=null]
[junit4] 2> 308466 WARN (SUITE-TestPullReplicaErrorHandling-seed#[C4CD77A282861F5A]-worker) [ ] o.e.j.u.s.S.config Trusting all certificates configured for Client@59845bf5[provider=null,keyStore=null,trustStore=null]
[junit4] 2> 308466 WARN (SUITE-TestPullReplicaErrorHandling-seed#[C4CD77A282861F5A]-worker) [ ] o.e.j.u.s.S.config No Client EndPointIdentificationAlgorithm configured for Client@59845bf5[provider=null,keyStore=null,trustStore=null]
[junit4] 2> 308467 INFO (SUITE-TestPullReplicaErrorHandling-seed#[C4CD77A282861F5A]-worker) [ ] o.a.s.c.ZkContainer Zookeeper client=127.0.0.1:39993/solr
[junit4] 2> 308475 INFO (SUITE-TestPullReplicaErrorHandling-seed#[C4CD77A282861F5A]-worker) [ ] o.a.s.c.c.ConnectionManager Waiting for client to connect to ZooKeeper
[junit4] 2> 308475 INFO (zkConnectionManagerCallback-4232-thread-1) [ ] o.a.s.c.c.ConnectionManager zkClient has connected
[junit4] 2> 308475 INFO (SUITE-TestPullReplicaErrorHandling-seed#[C4CD77A282861F5A]-worker) [ ] o.a.s.c.c.ConnectionManager Client is connected to ZooKeeper
[junit4] 2> 308578 INFO (SUITE-TestPullReplicaErrorHandling-seed#[C4CD77A282861F5A]-worker) [n:127.0.0.1:35067_solr ] o.a.s.c.c.ConnectionManager Waiting for client to connect to ZooKeeper
[junit4] 2> 308579 INFO (zkConnectionManagerCallback-4234-thread-1) [ ] o.a.s.c.c.ConnectionManager zkClient has connected
[junit4] 2> 308579 INFO (SUITE-TestPullReplicaErrorHandling-seed#[C4CD77A282861F5A]-worker) [n:127.0.0.1:35067_solr ] o.a.s.c.c.ConnectionManager Client is connected to ZooKeeper
[junit4] 2> 308585 WARN (SUITE-TestPullReplicaErrorHandling-seed#[C4CD77A282861F5A]-worker) [n:127.0.0.1:35067_solr ] o.a.s.c.ZkController Contents of zookeeper /security.json are world-readable; consider setting up ACLs as described in https://solr.apache.org/guide/zookeeper-access-control.html
[junit4] 2> 308586 INFO (SUITE-TestPullReplicaErrorHandling-seed#[C4CD77A282861F5A]-worker) [n:127.0.0.1:35067_solr ] o.a.s.c.c.ZkStateReader Updated live nodes from ZooKeeper... (0) -> (3)
[junit4] 2> 308590 INFO (SUITE-TestPullReplicaErrorHandling-seed#[C4CD77A282861F5A]-worker) [n:127.0.0.1:35067_solr ] o.a.s.c.ZkController Publish node=127.0.0.1:35067_solr as DOWN
[junit4] 2> 308590 INFO (SUITE-TestPullReplicaErrorHandling-seed#[C4CD77A282861F5A]-worker) [n:127.0.0.1:35067_solr ] o.a.s.c.TransientSolrCoreCacheDefault Allocating transient core cache for max 2147483647 cores with initial capacity of 1024
[junit4] 2> 308590 INFO (SUITE-TestPullReplicaErrorHandling-seed#[C4CD77A282861F5A]-worker) [n:127.0.0.1:35067_solr ] o.a.s.c.ZkController Register node as live in ZooKeeper:/live_nodes/127.0.0.1:35067_solr
[junit4] 2> 308592 INFO (zkCallback-4182-thread-1) [ ] o.a.s.c.c.ZkStateReader Updated live nodes from ZooKeeper... (3) -> (4)
[junit4] 2> 308592 INFO (zkCallback-4198-thread-1) [ ] o.a.s.c.c.ZkStateReader Updated live nodes from ZooKeeper... (3) -> (4)
[junit4] 2> 308592 INFO (zkCallback-4166-thread-1) [ ] o.a.s.c.c.ZkStateReader Updated live nodes from ZooKeeper... (3) -> (4)
[junit4] 2> 308592 INFO (zkCallback-4209-thread-1) [ ] o.a.s.c.c.ZkStateReader Updated live nodes from ZooKeeper... (3) -> (4)
[junit4] 2> 308596 INFO (zkCallback-4233-thread-1) [ ] o.a.s.c.c.ZkStateReader Updated live nodes from ZooKeeper... (3) -> (4)
[junit4] 2> 308596 INFO (SUITE-TestPullReplicaErrorHandling-seed#[C4CD77A282861F5A]-worker) [n:127.0.0.1:35067_solr ] o.a.s.c.ZkController non-data nodes now []
[junit4] 2> 308598 INFO (SUITE-TestPullReplicaErrorHandling-seed#[C4CD77A282861F5A]-worker) [n:127.0.0.1:35067_solr ] o.a.s.p.PackageLoader /packages.json updated to version -1
[junit4] 2> 308598 WARN (SUITE-TestPullReplicaErrorHandling-seed#[C4CD77A282861F5A]-worker) [n:127.0.0.1:35067_solr ] o.a.s.c.CoreContainer Not all security plugins configured! authentication=disabled authorization=disabled. Solr is only as secure as you make it. Consider configuring authentication/authorization before exposing Solr to users internal or external. See https://s.apache.org/solrsecurity for more info
[junit4] 2> 308635 INFO (SUITE-TestPullReplicaErrorHandling-seed#[C4CD77A282861F5A]-worker) [n:127.0.0.1:35067_solr ] o.a.s.c.CorePropertiesLocator Found 0 core definitions underneath /home/jenkins/jenkins-slave/workspace/Lucene/Lucene-Solr-Tests-8.11/solr/build/solr-core/test/J1/temp/solr.cloud.TestPullReplicaErrorHandling_C4CD77A282861F5A-001/tempDir-001/node4
[junit4] 2> 308647 INFO (SUITE-TestPullReplicaErrorHandling-seed#[C4CD77A282861F5A]-worker) [ ] o.a.s.c.MiniSolrCloudCluster waitForAllNodes: numServers=4
[junit4] 2> 308648 INFO (SUITE-TestPullReplicaErrorHandling-seed#[C4CD77A282861F5A]-worker) [ ] o.a.s.c.TestPullReplicaErrorHandling Adding proxy for URL: http://127.0.0.1:46833/solr. Proxy: http://127.0.0.1:35067/solr
[junit4] 2> 308649 INFO (SUITE-TestPullReplicaErrorHandling-seed#[C4CD77A282861F5A]-worker) [ ] o.a.s.c.CoreContainer Shutting down CoreContainer instance=743684315
[junit4] 2> 308649 INFO (SUITE-TestPullReplicaErrorHandling-seed#[C4CD77A282861F5A]-worker) [ ] o.a.s.c.ZkController Remove node as live in ZooKeeper:/live_nodes/127.0.0.1:46819_solr
[junit4] 2> 308649 INFO (SUITE-TestPullReplicaErrorHandling-seed#[C4CD77A282861F5A]-worker) [ ] o.a.s.c.ZkController Publish this node as DOWN...
[junit4] 2> 308649 INFO (SUITE-TestPullReplicaErrorHandling-seed#[C4CD77A282861F5A]-worker) [ ] o.a.s.c.ZkController Publish node=127.0.0.1:46819_solr as DOWN
[junit4] 2> 309008 INFO (SUITE-TestPullReplicaErrorHandling-seed#[C4CD77A282861F5A]-worker) [ ] o.a.s.m.SolrMetricManager Closing metric reporters for registry=solr.node tag=null
[junit4] 2> 309008 INFO (SUITE-TestPullReplicaErrorHandling-seed#[C4CD77A282861F5A]-worker) [ ] o.a.s.m.SolrMetricManager Closing metric reporters for registry=solr.jvm tag=null
[junit4] 2> 309008 INFO (SUITE-TestPullReplicaErrorHandling-seed#[C4CD77A282861F5A]-worker) [ ] o.a.s.m.SolrMetricManager Closing metric reporters for registry=solr.jetty tag=null
[junit4] 2> 309008 INFO (SUITE-TestPullReplicaErrorHandling-seed#[C4CD77A282861F5A]-worker) [ ] o.a.s.m.SolrMetricManager Closing metric reporters for registry=solr.cluster tag=null
[junit4] 2> 309009 INFO (closeThreadPool-4245-thread-2) [ ] o.a.s.c.Overseer Overseer (id=72063085111410698-127.0.0.1:46819_solr-n_0000000001) closing
[junit4] 2> 309012 INFO (OverseerStateUpdate-72063085111410698-127.0.0.1:46819_solr-n_0000000001) [n:127.0.0.1:46819_solr ] o.a.s.c.Overseer Overseer Loop exiting : 127.0.0.1:46819_solr
[junit4] 2> 309028 INFO (OverseerAutoScalingTriggerThread-72063085111410698-127.0.0.1:46819_solr-n_0000000001) [ ] o.a.s.c.a.OverseerTriggerThread OverseerTriggerThread woken up but we are closed, exiting.
[junit4] 2> 309045 INFO (closeThreadPool-4245-thread-1) [ ] o.a.s.c.Overseer Overseer (id=72063085111410698-127.0.0.1:46819_solr-n_0000000001) closing
[junit4] 2> 309046 INFO (zkCallback-4209-thread-1) [ ] o.a.s.c.c.ZkStateReader Updated live nodes from ZooKeeper... (4) -> (3)
[junit4] 2> 309046 INFO (zkCallback-4198-thread-1) [ ] o.a.s.c.c.ZkStateReader Updated live nodes from ZooKeeper... (4) -> (3)
[junit4] 2> 309046 INFO (zkCallback-4182-thread-1) [ ] o.a.s.c.OverseerElectionContext I am going to be the leader 127.0.0.1:36915_solr
[junit4] 2> 309046 INFO (zkCallback-4233-thread-1) [ ] o.a.s.c.c.ZkStateReader Updated live nodes from ZooKeeper... (4) -> (3)
[junit4] 2> 309047 INFO (zkCallback-4182-thread-2) [ ] o.a.s.c.c.ZkStateReader Updated live nodes from ZooKeeper... (4) -> (3)
[junit4] 2> 309048 INFO (zkCallback-4182-thread-1) [n:127.0.0.1:36915_solr ] o.a.s.c.Overseer Overseer (id=72063085111410700-127.0.0.1:36915_solr-n_0000000002) starting
[junit4] 2> 309051 INFO (OverseerStateUpdate-72063085111410700-127.0.0.1:36915_solr-n_0000000002) [n:127.0.0.1:36915_solr ] o.a.s.c.Overseer Starting to work on the main queue : 127.0.0.1:36915_solr
[junit4] 2> 309145 INFO (SUITE-TestPullReplicaErrorHandling-seed#[C4CD77A282861F5A]-worker) [ ] o.a.s.c.Overseer Overseer (id=72063085111410698-127.0.0.1:46819_solr-n_0000000001) closing
[junit4] 2> 309146 INFO (SUITE-TestPullReplicaErrorHandling-seed#[C4CD77A282861F5A]-worker) [ ] o.e.j.s.AbstractConnector Stopped ServerConnector@4d6b170a{HTTP/1.1, (http/1.1, h2c)}{127.0.0.1:0}
[junit4] 2> 309147 INFO (SUITE-TestPullReplicaErrorHandling-seed#[C4CD77A282861F5A]-worker) [ ] o.e.j.s.h.ContextHandler Stopped o.e.j.s.ServletContextHandler@2c02aa32{/solr,null,STOPPED}
[junit4] 2> 309147 INFO (SUITE-TestPullReplicaErrorHandling-seed#[C4CD77A282861F5A]-worker) [ ] o.e.j.s.session node0 Stopped scavenging
[junit4] 2> 309148 INFO (SUITE-TestPullReplicaErrorHandling-seed#[C4CD77A282861F5A]-worker) [ ] o.a.s.c.s.e.JettySolrRunner Start Jetty (configured port=0, binding port=0)
[junit4] 2> 309148 INFO (SUITE-TestPullReplicaErrorHandling-seed#[C4CD77A282861F5A]-worker) [ ] o.a.s.c.s.e.JettySolrRunner Trying to start Jetty on port 0 try number 2 ...
[junit4] 2> 309148 INFO (SUITE-TestPullReplicaErrorHandling-seed#[C4CD77A282861F5A]-worker) [ ] o.e.j.s.Server jetty-9.4.53.v20231009; built: 2023-10-09T12:29:09.265Z; git: 27bde00a0b95a1d5bbee0eae7984f891d2d0f8c9; jvm 1.8.0_362-b09
[junit4] 2> 309155 INFO (SUITE-TestPullReplicaErrorHandling-seed#[C4CD77A282861F5A]-worker) [ ] o.e.j.s.session DefaultSessionIdManager workerName=node0
[junit4] 2> 309155 INFO (SUITE-TestPullReplicaErrorHandling-seed#[C4CD77A282861F5A]-worker) [ ] o.e.j.s.session No SessionScavenger set, using defaults
[junit4] 2> 309155 INFO (SUITE-TestPullReplicaErrorHandling-seed#[C4CD77A282861F5A]-worker) [ ] o.e.j.s.session node0 Scavenging every 660000ms
[junit4] 2> 309156 INFO (SUITE-TestPullReplicaErrorHandling-seed#[C4CD77A282861F5A]-worker) [ ] o.e.j.s.h.ContextHandler Started o.e.j.s.ServletContextHandler@14a55f79{/solr,null,AVAILABLE}
[junit4] 2> 309156 INFO (SUITE-TestPullReplicaErrorHandling-seed#[C4CD77A282861F5A]-worker) [ ] o.e.j.s.AbstractConnector Started ServerConnector@667d98da{HTTP/1.1, (http/1.1, h2c)}{127.0.0.1:36991}
[junit4] 2> 309156 INFO (SUITE-TestPullReplicaErrorHandling-seed#[C4CD77A282861F5A]-worker) [ ] o.e.j.s.Server Started @309187ms
[junit4] 2> 309156 INFO (SUITE-TestPullReplicaErrorHandling-seed#[C4CD77A282861F5A]-worker) [ ] o.a.s.c.s.e.JettySolrRunner Jetty properties: {hostContext=/solr, zkHost=127.0.0.1:39993/solr, hostPort=41439}
[junit4] 2> 309156 ERROR (SUITE-TestPullReplicaErrorHandling-seed#[C4CD77A282861F5A]-worker) [ ] o.a.s.u.StartupLoggingUtils Missing Java Option solr.log.dir. Logging may be missing or incomplete.
[junit4] 2> 309156 INFO (SUITE-TestPullReplicaErrorHandling-seed#[C4CD77A282861F5A]-worker) [ ] o.a.s.s.SolrDispatchFilter Using logger factory org.apache.logging.slf4j.Log4jLoggerFactory
[junit4] 2> 309156 INFO (SUITE-TestPullReplicaErrorHandling-seed#[C4CD77A282861F5A]-worker) [ ] o.a.s.s.SolrDispatchFilter ___ _ Welcome to Apache Solr™ version 8.11.4
[junit4] 2> 309156 INFO (SUITE-TestPullReplicaErrorHandling-seed#[C4CD77A282861F5A]-worker) [ ] o.a.s.s.SolrDispatchFilter / __| ___| |_ _ Starting in cloud mode on port null
[junit4] 2> 309156 INFO (SUITE-TestPullReplicaErrorHandling-seed#[C4CD77A282861F5A]-worker) [ ] o.a.s.s.SolrDispatchFilter \__ \/ _ \ | '_| Install dir: /home/jenkins/jenkins-slave/workspace/Lucene/Lucene-Solr-Tests-8.11/solr
[junit4] 2> 309156 INFO (SUITE-TestPullReplicaErrorHandling-seed#[C4CD77A282861F5A]-worker) [ ] o.a.s.s.SolrDispatchFilter |___/\___/_|_| Start time: 2024-04-09T06:03:28.539Z
[junit4] 2> 309159 INFO (SUITE-TestPullReplicaErrorHandling-seed#[C4CD77A282861F5A]-worker) [ ] o.a.s.c.c.ConnectionManager Waiting for client to connect to ZooKeeper
[junit4] 2> 309159 INFO (zkConnectionManagerCallback-4251-thread-1) [ ] o.a.s.c.c.ConnectionManager zkClient has connected
[junit4] 2> 309159 INFO (SUITE-TestPullReplicaErrorHandling-seed#[C4CD77A282861F5A]-worker) [ ] o.a.s.c.c.ConnectionManager Client is connected to ZooKeeper
[junit4] 2> 309163 INFO (SUITE-TestPullReplicaErrorHandling-seed#[C4CD77A282861F5A]-worker) [ ] o.a.s.s.SolrDispatchFilter solr.xml found in ZooKeeper. Loading...
[junit4] 2> 309168 INFO (SUITE-TestPullReplicaErrorHandling-seed#[C4CD77A282861F5A]-worker) [ ] o.a.s.c.SolrXmlConfig Metrics collection is disabled.
[junit4] 2> 309169 WARN (SUITE-TestPullReplicaErrorHandling-seed#[C4CD77A282861F5A]-worker-SendThread(127.0.0.1:39993)) [ ] o.a.z.ClientCnxn An exception was thrown while closing send thread for session 0x10004fe7d7c0013.
[junit4] 2> => EndOfStreamException: Unable to read additional data from server sessionid 0x10004fe7d7c0013, likely server has closed socket
[junit4] 2> at org.apache.zookeeper.ClientCnxnSocketNIO.doIO(ClientCnxnSocketNIO.java:77)
[junit4] 2> org.apache.zookeeper.ClientCnxn$EndOfStreamException: Unable to read additional data from server sessionid 0x10004fe7d7c0013, likely server has closed socket
[junit4] 2> at org.apache.zookeeper.ClientCnxnSocketNIO.doIO(ClientCnxnSocketNIO.java:77) ~[zookeeper-3.6.2.jar:3.6.2]
[junit4] 2> at org.apache.zookeeper.ClientCnxnSocketNIO.doTransport(ClientCnxnSocketNIO.java:350) ~[zookeeper-3.6.2.jar:3.6.2]
[junit4] 2> at org.apache.zookeeper.ClientCnxn$SendThread.run(ClientCnxn.java:1275) [zookeeper-3.6.2.jar:3.6.2]
[junit4] 2> 309767 INFO (SUITE-TestPullReplicaErrorHandling-seed#[C4CD77A282861F5A]-worker) [ ] o.a.s.h.c.HttpShardHandlerFactory Host whitelist initialized: WhitelistHostChecker [whitelistHosts=null, whitelistHostCheckingEnabled=true]
[junit4] 2> 309768 WARN (SUITE-TestPullReplicaErrorHandling-seed#[C4CD77A282861F5A]-worker) [ ] o.e.j.u.s.S.config Trusting all certificates configured for Client@239f282[provider=null,keyStore=null,trustStore=null]
[junit4] 2> 309768 WARN (SUITE-TestPullReplicaErrorHandling-seed#[C4CD77A282861F5A]-worker) [ ] o.e.j.u.s.S.config No Client EndPointIdentificationAlgorithm configured for Client@239f282[provider=null,keyStore=null,trustStore=null]
[junit4] 2> 309771 WARN (SUITE-TestPullReplicaErrorHandling-seed#[C4CD77A282861F5A]-worker) [ ] o.e.j.u.s.S.config Trusting all certificates configured for Client@d2591b4[provider=null,keyStore=null,trustStore=null]
[junit4] 2> 309771 WARN (SUITE-TestPullReplicaErrorHandling-seed#[C4CD77A282861F5A]-worker) [ ] o.e.j.u.s.S.config No Client EndPointIdentificationAlgorithm configured for Client@d2591b4[provider=null,keyStore=null,trustStore=null]
[junit4] 2> 309772 INFO (SUITE-TestPullReplicaErrorHandling-seed#[C4CD77A282861F5A]-worker) [ ] o.a.s.c.ZkContainer Zookeeper client=127.0.0.1:39993/solr
[junit4] 2> 309773 INFO (SUITE-TestPullReplicaErrorHandling-seed#[C4CD77A282861F5A]-worker) [ ] o.a.s.c.c.ConnectionManager Waiting for client to connect to ZooKeeper
[junit4] 2> 309774 INFO (zkConnectionManagerCallback-4262-thread-1) [ ] o.a.s.c.c.ConnectionManager zkClient has connected
[junit4] 2> 309774 INFO (SUITE-TestPullReplicaErrorHandling-seed#[C4CD77A282861F5A]-worker) [ ] o.a.s.c.c.ConnectionManager Client is connected to ZooKeeper
[junit4] 2> 310011 INFO (SUITE-TestPullReplicaErrorHandling-seed#[C4CD77A282861F5A]-worker) [n:127.0.0.1:41439_solr ] o.a.s.c.c.ConnectionManager Waiting for client to connect to ZooKeeper
[junit4]
[...truncated too long message...]
litAfterFailedSplit-seed#[C4CD77A282861F5A]-EventThread) [ ] o.a.s.c.c.SolrZkClient Submitting job to respond to event WatchedEvent state:Closed type:None path:null
[junit4] 2> 1156214 DEBUG (TEST-ShardSplitTest.testSplitAfterFailedSplit-seed#[C4CD77A282861F5A]-EventThread) [ ] o.a.s.c.c.SolrZkClient Submitting job to respond to event WatchedEvent state:Closed type:None path:null
[junit4] 2> 1156214 DEBUG (TEST-ShardSplitTest.testSplitAfterFailedSplit-seed#[C4CD77A282861F5A]-EventThread) [ ] o.a.s.c.c.SolrZkClient Submitting job to respond to event WatchedEvent state:Closed type:None path:null
[junit4] 2> 1156214 DEBUG (TEST-ShardSplitTest.testSplitAfterFailedSplit-seed#[C4CD77A282861F5A]-EventThread) [ ] o.a.s.c.c.SolrZkClient Submitting job to respond to event WatchedEvent state:Closed type:None path:null
[junit4] 2> 1156214 DEBUG (TEST-ShardSplitTest.testSplitAfterFailedSplit-seed#[C4CD77A282861F5A]-EventThread) [ ] o.a.s.c.c.SolrZkClient Submitting job to respond to event WatchedEvent state:Closed type:None path:null
[junit4] 2> 1156214 DEBUG (TEST-ShardSplitTest.testSplitAfterFailedSplit-seed#[C4CD77A282861F5A]-EventThread) [ ] o.a.s.c.c.SolrZkClient Submitting job to respond to event WatchedEvent state:Closed type:None path:null
[junit4] 2> 1156214 DEBUG (TEST-ShardSplitTest.testSplitAfterFailedSplit-seed#[C4CD77A282861F5A]-EventThread) [ ] o.a.s.c.c.SolrZkClient Submitting job to respond to event WatchedEvent state:Closed type:None path:null
[junit4] 2> 1156214 DEBUG (TEST-ShardSplitTest.testSplitAfterFailedSplit-seed#[C4CD77A282861F5A]-EventThread) [ ] o.a.s.c.c.SolrZkClient Submitting job to respond to event WatchedEvent state:Closed type:None path:null
[junit4] 2> 1156214 DEBUG (TEST-ShardSplitTest.testSplitAfterFailedSplit-seed#[C4CD77A282861F5A]-EventThread) [ ] o.a.s.c.c.SolrZkClient Submitting job to respond to event WatchedEvent state:Closed type:None path:null
[junit4] 2> 1156215 DEBUG (TEST-ShardSplitTest.testSplitAfterFailedSplit-seed#[C4CD77A282861F5A]-EventThread) [ ] o.a.s.c.c.SolrZkClient Submitting job to respond to event WatchedEvent state:Closed type:None path:null
[junit4] 2> 1156215 DEBUG (TEST-ShardSplitTest.testSplitAfterFailedSplit-seed#[C4CD77A282861F5A]-EventThread) [ ] o.a.s.c.c.SolrZkClient Submitting job to respond to event WatchedEvent state:Closed type:None path:null
[junit4] 2> 1156218 INFO (closeThreadPool-7094-thread-2) [ ] o.e.j.s.AbstractConnector Stopped ServerConnector@7f637730{HTTP/1.1, (http/1.1, h2c)}{127.0.0.1:0}
[junit4] 2> 1156219 INFO (closeThreadPool-7094-thread-2) [ ] o.e.j.s.h.ContextHandler Stopped o.e.j.s.ServletContextHandler@16aae3cf{/qr/qg,null,STOPPED}
[junit4] 2> 1156219 INFO (closeThreadPool-7094-thread-2) [ ] o.e.j.s.session node0 Stopped scavenging
[junit4] 2> 1156221 INFO (TEST-ShardSplitTest.testSplitAfterFailedSplit-seed#[C4CD77A282861F5A]) [ ] o.a.s.u.ErrorLogMuter Closing ErrorLogMuter-regex-17409 after mutting 0 log messages
[junit4] 2> 1156221 INFO (TEST-ShardSplitTest.testSplitAfterFailedSplit-seed#[C4CD77A282861F5A]) [ ] o.a.s.u.ErrorLogMuter Creating ErrorLogMuter-regex-17410 for ERROR logs matching regex: ignore_exception
[junit4] 2> 1156222 INFO (TEST-ShardSplitTest.testSplitAfterFailedSplit-seed#[C4CD77A282861F5A]) [ ] o.a.s.c.ZkTestServer Shutting down ZkTestServer.
[junit4] 2> 1156324 DEBUG (TEST-ShardSplitTest.testSplitAfterFailedSplit-seed#[C4CD77A282861F5A]-EventThread) [ ] o.a.s.c.c.SolrZkClient Submitting job to respond to event WatchedEvent state:Closed type:None path:null
[junit4] 2> 1156325 WARN (TEST-ShardSplitTest.testSplitAfterFailedSplit-seed#[C4CD77A282861F5A]-SendThread(127.0.0.1:36153)) [ ] o.a.z.ClientCnxn An exception was thrown while closing send thread for session 0x100050b1cc20001.
[junit4] 2> => EndOfStreamException: Unable to read additional data from server sessionid 0x100050b1cc20001, likely server has closed socket
[junit4] 2> at org.apache.zookeeper.ClientCnxnSocketNIO.doIO(ClientCnxnSocketNIO.java:77)
[junit4] 2> org.apache.zookeeper.ClientCnxn$EndOfStreamException: Unable to read additional data from server sessionid 0x100050b1cc20001, likely server has closed socket
[junit4] 2> at org.apache.zookeeper.ClientCnxnSocketNIO.doIO(ClientCnxnSocketNIO.java:77) ~[zookeeper-3.6.2.jar:3.6.2]
[junit4] 2> at org.apache.zookeeper.ClientCnxnSocketNIO.doTransport(ClientCnxnSocketNIO.java:350) ~[zookeeper-3.6.2.jar:3.6.2]
[junit4] 2> at org.apache.zookeeper.ClientCnxn$SendThread.run(ClientCnxn.java:1275) [zookeeper-3.6.2.jar:3.6.2]
[junit4] 2> 1156426 DEBUG (TEST-ShardSplitTest.testSplitAfterFailedSplit-seed#[C4CD77A282861F5A]-EventThread) [ ] o.a.s.c.c.SolrZkClient Submitting job to respond to event WatchedEvent state:Closed type:None path:null
[junit4] 2> 1156427 WARN (ZkTestServer Run Thread) [ ] o.a.s.c.ZkTestServer Watch limit violations:
[junit4] 2> Maximum concurrent create/delete watches above limit:
[junit4] 2>
[junit4] 2> 12 /solr/collections/collection1/state.json
[junit4] 2> 11 /solr/collections/collection1/terms/shard1_0
[junit4] 2> 11 /solr/collections/collection1/terms/shard1_1
[junit4] 2> 7 /solr/aliases.json
[junit4] 2> 5 /solr/packages.json
[junit4] 2> 5 /solr/security.json
[junit4] 2> 5 /solr/configs/conf1
[junit4] 2> 5 /solr/collections/collection1/terms/shard1
[junit4] 2> 5 /solr/collections/collection1/terms/shard2
[junit4] 2> 4 /solr/collections/collection1/collectionprops.json
[junit4] 2> 2 /solr/collections/control_collection/terms/shard1
[junit4] 2>
[junit4] 2> Maximum concurrent data watches above limit:
[junit4] 2>
[junit4] 2> 182 /solr/clusterstate.json
[junit4] 2> 7 /solr/clusterprops.json
[junit4] 2> 7 /solr/collections/control_collection/state.json
[junit4] 2>
[junit4] 2> Maximum concurrent children watches above limit:
[junit4] 2>
[junit4] 2> 76 /solr/overseer/queue
[junit4] 2> 30 /solr/live_nodes
[junit4] 2> 23 /solr/overseer/collection-queue-work
[junit4] 2> 7 /solr/collections
[junit4] 2> 2 /solr/collections/control_collection/state.json
[junit4] 2>
[junit4] 2> 1156431 INFO (TEST-ShardSplitTest.testSplitAfterFailedSplit-seed#[C4CD77A282861F5A]) [ ] o.a.s.c.ZkTestServer waitForServerDown: 127.0.0.1:36153
[junit4] 2> 1156431 INFO (TEST-ShardSplitTest.testSplitAfterFailedSplit-seed#[C4CD77A282861F5A]) [ ] o.a.s.c.ZkTestServer parse host and port list: 127.0.0.1:36153
[junit4] 2> 1156431 INFO (TEST-ShardSplitTest.testSplitAfterFailedSplit-seed#[C4CD77A282861F5A]) [ ] o.a.s.c.ZkTestServer connecting to 127.0.0.1 36153
[junit4] 2> 1156433 INFO (SUITE-ShardSplitTest-seed#[C4CD77A282861F5A]-worker) [ ] o.a.s.u.ErrorLogMuter Closing ErrorLogMuter-regex-17410 after mutting 0 log messages
[junit4] 2> 1156433 INFO (SUITE-ShardSplitTest-seed#[C4CD77A282861F5A]-worker) [ ] o.a.s.u.ErrorLogMuter Creating ErrorLogMuter-regex-17411 for ERROR logs matching regex: ignore_exception
[junit4] 2> NOTE: leaving temporary files on disk at: /home/jenkins/jenkins-slave/workspace/Lucene/Lucene-Solr-Tests-8.11/solr/build/solr-core/test/J3/temp/solr.cloud.api.collections.ShardSplitTest_C4CD77A282861F5A-001
[junit4] 2> Apr 09, 2024 6:17:35 AM com.carrotsearch.randomizedtesting.ThreadLeakControl checkThreadLeaks
[junit4] 2> WARNING: Will linger awaiting termination of 1 leaked thread(s).
[junit4] 2> NOTE: test params are: codec=FastDecompressionCompressingStoredFieldsData(storedFieldsFormat=CompressingStoredFieldsFormat(compressionMode=FAST_DECOMPRESSION, chunkSize=21714, maxDocsPerChunk=957, blockShift=2), termVectorsFormat=CompressingTermVectorsFormat(compressionMode=FAST_DECOMPRESSION, chunkSize=21714, maxDocsPerChunk=957, blockSize=2)), sim=Asserting(RandomSimilarity(queryNorm=false): {}), locale=ko-KR, timezone=SystemV/PST8PDT
[junit4] 2> NOTE: Linux 5.4.0-176-generic amd64/Temurin 1.8.0_362 (64-bit)/cpus=4,threads=1,free=118275800,total=515899392
[junit4] 2> NOTE: All tests run in this JVM: [StatelessScriptUpdateProcessorFactoryTest, TokenizerChainTest, TestPseudoReturnFields, TestSchemaNameResource, TestLeaderElectionZkExpiry, TestRequestForwarding, DistributedQueryElevationComponentTest, TestUnifiedSolrHighlighterWithoutStoredId, TestTrie, TestBulkSchemaConcurrent, TestMaxTokenLenTokenizer, TestSolrConfigHandler, MultiSolrCloudTestCaseTest, QueryResultKeyTest, TestCSVLoader, TransactionLogTest, TestRandomCollapseQParserPlugin, TestCollectionAPIs, TestPrepRecovery, DefaultValueUpdateProcessorTest, TestInitQParser, ChangedSchemaMergeTest, SaslZkACLProviderTest, RollingRestartTest, TestHdfsUpdateLog, TestConfigOverlay, TestStandardQParsers, OrderedExecutorTest, TestSnapshotCloudManager, SecurityConfHandlerTest, TestFieldCollectionResource, TestInPlaceUpdatesStandalone, TestSubQueryTransformerDistrib, AnalyticsQueryTest, TestRandomFaceting, EnumFieldTest, TestUseDocValuesAsStored, DistributedFacetPivotWhiteBoxTest, TestSimPolicyCloud, ComputePlanActionTest, AddSchemaFieldsUpdateProcessorFactoryTest, MissingSegmentRecoveryTest, TestCustomSort, TestJsonRangeFacets, TestSolrXml, TestXmlQParserPlugin, ShardBackupIdTest, CloudExitableDirectoryReaderTest, ZkCLITest, LegacyCloudClusterPropTest, ForceLeaderWithTlogReplicasTest, TestSizeLimitedDistributedMap, TestLegacyFieldReuse, SignificantTermsQParserPluginTest, ConjunctionSolrSpellCheckerTest, HttpPartitionWithTlogReplicasTest, DateMathParserTest, TestClusterStateMutator, TestCloudJSONFacetJoinDomain, CollectionPropsTest, TestAuthorizationFramework, ShardSplitTest]
[junit4] Completed [390/959 (2!)] on J3 in 432.34s, 11 tests, 2 errors, 3 skipped <<< FAILURES!
[...truncated 56252 lines...]