You are viewing a plain text version of this content. The canonical link for it is here.
Posted to dev@lucene.apache.org by Policeman Jenkins Server <je...@thetaphi.de> on 2016/09/18 18:33:01 UTC

[JENKINS-EA] Lucene-Solr-6.2-Linux (32bit/jdk-9-ea+136) - Build # 34 - Failure!

Build: http://jenkins.thetaphi.de/job/Lucene-Solr-6.2-Linux/34/
Java: 32bit/jdk-9-ea+136 -server -XX:+UseParallelGC

No tests ran.

Build Log:
[...truncated 83 lines...]
BUILD FAILED
/home/jenkins/workspace/Lucene-Solr-6.2-Linux/build.xml:763: The following error occurred while executing this line:
/home/jenkins/workspace/Lucene-Solr-6.2-Linux/build.xml:707: The following error occurred while executing this line:
/home/jenkins/workspace/Lucene-Solr-6.2-Linux/build.xml:59: The following error occurred while executing this line:
/home/jenkins/workspace/Lucene-Solr-6.2-Linux/lucene/build.xml:50: The following error occurred while executing this line:
/home/jenkins/workspace/Lucene-Solr-6.2-Linux/lucene/common-build.xml:501: The following error occurred while executing this line:
/home/jenkins/workspace/Lucene-Solr-6.2-Linux/lucene/common-build.xml:1955: Compile failed; see the compiler error output for details.

Total time: 1 second
Build step 'Invoke Ant' marked build as failure
Archiving artifacts
[WARNINGS] Skipping publisher since build result is FAILURE
Recording test results
ERROR: Step ‘Publish JUnit test result report’ failed: No test report files were found. Configuration error?
Email was triggered for: Failure - Any
Sending email for trigger: Failure - Any



Re: [JENKINS-EA] Lucene-Solr-6.2-Linux (32bit/jdk-9-ea+136) - Build # 37 - Still Failing!

Posted by Alan Woodward <al...@flax.co.uk>.
[javac] javac: invalid flag: -release

Has something changed in the JDK-9 builds?

Alan Woodward
www.flax.co.uk


> On 19 Sep 2016, at 05:31, Policeman Jenkins Server <je...@thetaphi.de> wrote:
> 
> Build: http://jenkins.thetaphi.de/job/Lucene-Solr-6.2-Linux/37/
> Java: 32bit/jdk-9-ea+136 -client -XX:+UseG1GC
> 
> No tests ran.
> 
> Build Log:
> [...truncated 83 lines...]
> BUILD FAILED
> /home/jenkins/workspace/Lucene-Solr-6.2-Linux/build.xml:763: The following error occurred while executing this line:
> /home/jenkins/workspace/Lucene-Solr-6.2-Linux/build.xml:707: The following error occurred while executing this line:
> /home/jenkins/workspace/Lucene-Solr-6.2-Linux/build.xml:59: The following error occurred while executing this line:
> /home/jenkins/workspace/Lucene-Solr-6.2-Linux/lucene/build.xml:50: The following error occurred while executing this line:
> /home/jenkins/workspace/Lucene-Solr-6.2-Linux/lucene/common-build.xml:501: The following error occurred while executing this line:
> /home/jenkins/workspace/Lucene-Solr-6.2-Linux/lucene/common-build.xml:1955: Compile failed; see the compiler error output for details.
> 
> Total time: 1 second
> Build step 'Invoke Ant' marked build as failure
> Archiving artifacts
> [WARNINGS] Skipping publisher since build result is FAILURE
> Recording test results
> ERROR: Step ‘Publish JUnit test result report’ failed: No test report files were found. Configuration error?
> Email was triggered for: Failure - Any
> Sending email for trigger: Failure - Any
> 
> 
> 
> ---------------------------------------------------------------------
> To unsubscribe, e-mail: dev-unsubscribe@lucene.apache.org
> For additional commands, e-mail: dev-help@lucene.apache.org


[JENKINS-EA] Lucene-Solr-6.2-Linux (32bit/jdk-9-ea+136) - Build # 37 - Still Failing!

Posted by Policeman Jenkins Server <je...@thetaphi.de>.
Build: http://jenkins.thetaphi.de/job/Lucene-Solr-6.2-Linux/37/
Java: 32bit/jdk-9-ea+136 -client -XX:+UseG1GC

No tests ran.

Build Log:
[...truncated 83 lines...]
BUILD FAILED
/home/jenkins/workspace/Lucene-Solr-6.2-Linux/build.xml:763: The following error occurred while executing this line:
/home/jenkins/workspace/Lucene-Solr-6.2-Linux/build.xml:707: The following error occurred while executing this line:
/home/jenkins/workspace/Lucene-Solr-6.2-Linux/build.xml:59: The following error occurred while executing this line:
/home/jenkins/workspace/Lucene-Solr-6.2-Linux/lucene/build.xml:50: The following error occurred while executing this line:
/home/jenkins/workspace/Lucene-Solr-6.2-Linux/lucene/common-build.xml:501: The following error occurred while executing this line:
/home/jenkins/workspace/Lucene-Solr-6.2-Linux/lucene/common-build.xml:1955: Compile failed; see the compiler error output for details.

Total time: 1 second
Build step 'Invoke Ant' marked build as failure
Archiving artifacts
[WARNINGS] Skipping publisher since build result is FAILURE
Recording test results
ERROR: Step ‘Publish JUnit test result report’ failed: No test report files were found. Configuration error?
Email was triggered for: Failure - Any
Sending email for trigger: Failure - Any



[JENKINS-EA] Lucene-Solr-6.2-Linux (64bit/jdk-9-ea+136) - Build # 36 - Failure!

Posted by Policeman Jenkins Server <je...@thetaphi.de>.
Build: http://jenkins.thetaphi.de/job/Lucene-Solr-6.2-Linux/36/
Java: 64bit/jdk-9-ea+136 -XX:-UseCompressedOops -XX:+UseConcMarkSweepGC

No tests ran.

Build Log:
[...truncated 83 lines...]
BUILD FAILED
/home/jenkins/workspace/Lucene-Solr-6.2-Linux/build.xml:763: The following error occurred while executing this line:
/home/jenkins/workspace/Lucene-Solr-6.2-Linux/build.xml:707: The following error occurred while executing this line:
/home/jenkins/workspace/Lucene-Solr-6.2-Linux/build.xml:59: The following error occurred while executing this line:
/home/jenkins/workspace/Lucene-Solr-6.2-Linux/lucene/build.xml:50: The following error occurred while executing this line:
/home/jenkins/workspace/Lucene-Solr-6.2-Linux/lucene/common-build.xml:501: The following error occurred while executing this line:
/home/jenkins/workspace/Lucene-Solr-6.2-Linux/lucene/common-build.xml:1955: Compile failed; see the compiler error output for details.

Total time: 1 second
Build step 'Invoke Ant' marked build as failure
Archiving artifacts
[WARNINGS] Skipping publisher since build result is FAILURE
Recording test results
ERROR: Step ‘Publish JUnit test result report’ failed: No test report files were found. Configuration error?
Email was triggered for: Failure - Any
Sending email for trigger: Failure - Any



[JENKINS] Lucene-Solr-6.2-Linux (64bit/jdk1.8.0_102) - Build # 35 - Unstable!

Posted by Policeman Jenkins Server <je...@thetaphi.de>.
Build: http://jenkins.thetaphi.de/job/Lucene-Solr-6.2-Linux/35/
Java: 64bit/jdk1.8.0_102 -XX:-UseCompressedOops -XX:+UseParallelGC

1 tests failed.
FAILED:  org.apache.solr.cloud.ChaosMonkeyNothingIsSafeTest.test

Error Message:
document count mismatch.  control=601 sum(shards)=600 cloudClient=600

Stack Trace:
java.lang.AssertionError: document count mismatch.  control=601 sum(shards)=600 cloudClient=600
	at __randomizedtesting.SeedInfo.seed([DAEC39BD6416377F:52B80667CAEA5A87]:0)
	at org.junit.Assert.fail(Assert.java:93)
	at org.apache.solr.cloud.AbstractFullDistribZkTestBase.checkShardConsistency(AbstractFullDistribZkTestBase.java:1323)
	at org.apache.solr.cloud.ChaosMonkeyNothingIsSafeTest.test(ChaosMonkeyNothingIsSafeTest.java:228)
	at sun.reflect.NativeMethodAccessorImpl.invoke0(Native Method)
	at sun.reflect.NativeMethodAccessorImpl.invoke(NativeMethodAccessorImpl.java:62)
	at sun.reflect.DelegatingMethodAccessorImpl.invoke(DelegatingMethodAccessorImpl.java:43)
	at java.lang.reflect.Method.invoke(Method.java:498)
	at com.carrotsearch.randomizedtesting.RandomizedRunner.invoke(RandomizedRunner.java:1764)
	at com.carrotsearch.randomizedtesting.RandomizedRunner$8.evaluate(RandomizedRunner.java:871)
	at com.carrotsearch.randomizedtesting.RandomizedRunner$9.evaluate(RandomizedRunner.java:907)
	at com.carrotsearch.randomizedtesting.RandomizedRunner$10.evaluate(RandomizedRunner.java:921)
	at org.apache.solr.BaseDistributedSearchTestCase$ShardsRepeatRule$ShardsFixedStatement.callStatement(BaseDistributedSearchTestCase.java:992)
	at org.apache.solr.BaseDistributedSearchTestCase$ShardsRepeatRule$ShardsStatement.evaluate(BaseDistributedSearchTestCase.java:967)
	at com.carrotsearch.randomizedtesting.rules.SystemPropertiesRestoreRule$1.evaluate(SystemPropertiesRestoreRule.java:57)
	at org.apache.lucene.util.TestRuleSetupTeardownChained$1.evaluate(TestRuleSetupTeardownChained.java:49)
	at org.apache.lucene.util.AbstractBeforeAfterRule$1.evaluate(AbstractBeforeAfterRule.java:45)
	at org.apache.lucene.util.TestRuleThreadAndTestName$1.evaluate(TestRuleThreadAndTestName.java:48)
	at org.apache.lucene.util.TestRuleIgnoreAfterMaxFailures$1.evaluate(TestRuleIgnoreAfterMaxFailures.java:64)
	at org.apache.lucene.util.TestRuleMarkFailure$1.evaluate(TestRuleMarkFailure.java:47)
	at com.carrotsearch.randomizedtesting.rules.StatementAdapter.evaluate(StatementAdapter.java:36)
	at com.carrotsearch.randomizedtesting.ThreadLeakControl$StatementRunner.run(ThreadLeakControl.java:367)
	at com.carrotsearch.randomizedtesting.ThreadLeakControl.forkTimeoutingTask(ThreadLeakControl.java:809)
	at com.carrotsearch.randomizedtesting.ThreadLeakControl$3.evaluate(ThreadLeakControl.java:460)
	at com.carrotsearch.randomizedtesting.RandomizedRunner.runSingleTest(RandomizedRunner.java:880)
	at com.carrotsearch.randomizedtesting.RandomizedRunner$5.evaluate(RandomizedRunner.java:781)
	at com.carrotsearch.randomizedtesting.RandomizedRunner$6.evaluate(RandomizedRunner.java:816)
	at com.carrotsearch.randomizedtesting.RandomizedRunner$7.evaluate(RandomizedRunner.java:827)
	at com.carrotsearch.randomizedtesting.rules.StatementAdapter.evaluate(StatementAdapter.java:36)
	at com.carrotsearch.randomizedtesting.rules.SystemPropertiesRestoreRule$1.evaluate(SystemPropertiesRestoreRule.java:57)
	at org.apache.lucene.util.AbstractBeforeAfterRule$1.evaluate(AbstractBeforeAfterRule.java:45)
	at com.carrotsearch.randomizedtesting.rules.StatementAdapter.evaluate(StatementAdapter.java:36)
	at org.apache.lucene.util.TestRuleStoreClassName$1.evaluate(TestRuleStoreClassName.java:41)
	at com.carrotsearch.randomizedtesting.rules.NoShadowingOrOverridesOnMethodsRule$1.evaluate(NoShadowingOrOverridesOnMethodsRule.java:40)
	at com.carrotsearch.randomizedtesting.rules.NoShadowingOrOverridesOnMethodsRule$1.evaluate(NoShadowingOrOverridesOnMethodsRule.java:40)
	at com.carrotsearch.randomizedtesting.rules.StatementAdapter.evaluate(StatementAdapter.java:36)
	at com.carrotsearch.randomizedtesting.rules.StatementAdapter.evaluate(StatementAdapter.java:36)
	at com.carrotsearch.randomizedtesting.rules.StatementAdapter.evaluate(StatementAdapter.java:36)
	at org.apache.lucene.util.TestRuleAssertionsRequired$1.evaluate(TestRuleAssertionsRequired.java:53)
	at org.apache.lucene.util.TestRuleMarkFailure$1.evaluate(TestRuleMarkFailure.java:47)
	at org.apache.lucene.util.TestRuleIgnoreAfterMaxFailures$1.evaluate(TestRuleIgnoreAfterMaxFailures.java:64)
	at org.apache.lucene.util.TestRuleIgnoreTestSuites$1.evaluate(TestRuleIgnoreTestSuites.java:54)
	at com.carrotsearch.randomizedtesting.rules.StatementAdapter.evaluate(StatementAdapter.java:36)
	at com.carrotsearch.randomizedtesting.ThreadLeakControl$StatementRunner.run(ThreadLeakControl.java:367)
	at java.lang.Thread.run(Thread.java:745)




Build Log:
[...truncated 10760 lines...]
   [junit4] Suite: org.apache.solr.cloud.ChaosMonkeyNothingIsSafeTest
   [junit4]   2> Creating dataDir: /home/jenkins/workspace/Lucene-Solr-6.2-Linux/solr/build/solr-core/test/J1/temp/solr.cloud.ChaosMonkeyNothingIsSafeTest_DAEC39BD6416377F-001/init-core-data-001
   [junit4]   2> 65451 INFO  (SUITE-ChaosMonkeyNothingIsSafeTest-seed#[DAEC39BD6416377F]-worker) [    ] o.a.s.SolrTestCaseJ4 Randomized ssl (false) and clientAuth (false) via: @org.apache.solr.SolrTestCaseJ4$SuppressSSL(bugUrl=https://issues.apache.org/jira/browse/SOLR-5776)
   [junit4]   2> 65451 INFO  (SUITE-ChaosMonkeyNothingIsSafeTest-seed#[DAEC39BD6416377F]-worker) [    ] o.a.s.BaseDistributedSearchTestCase Setting hostContext system property: /
   [junit4]   2> 65454 INFO  (TEST-ChaosMonkeyNothingIsSafeTest.test-seed#[DAEC39BD6416377F]) [    ] o.a.s.c.ZkTestServer STARTING ZK TEST SERVER
   [junit4]   2> 65454 INFO  (Thread-114) [    ] o.a.s.c.ZkTestServer client port:0.0.0.0/0.0.0.0:0
   [junit4]   2> 65454 INFO  (Thread-114) [    ] o.a.s.c.ZkTestServer Starting server
   [junit4]   2> 65554 INFO  (TEST-ChaosMonkeyNothingIsSafeTest.test-seed#[DAEC39BD6416377F]) [    ] o.a.s.c.ZkTestServer start zk server on port:35379
   [junit4]   2> 65554 INFO  (TEST-ChaosMonkeyNothingIsSafeTest.test-seed#[DAEC39BD6416377F]) [    ] o.a.s.c.c.SolrZkClient Using default ZkCredentialsProvider
   [junit4]   2> 65555 INFO  (TEST-ChaosMonkeyNothingIsSafeTest.test-seed#[DAEC39BD6416377F]) [    ] o.a.s.c.c.ConnectionManager Waiting for client to connect to ZooKeeper
   [junit4]   2> 65556 INFO  (zkCallback-167-thread-1) [    ] o.a.s.c.c.ConnectionManager Watcher org.apache.solr.common.cloud.ConnectionManager@5a422729 name:ZooKeeperConnection Watcher:127.0.0.1:35379 got event WatchedEvent state:SyncConnected type:None path:null path:null type:None
   [junit4]   2> 65556 INFO  (TEST-ChaosMonkeyNothingIsSafeTest.test-seed#[DAEC39BD6416377F]) [    ] o.a.s.c.c.ConnectionManager Client is connected to ZooKeeper
   [junit4]   2> 65557 INFO  (TEST-ChaosMonkeyNothingIsSafeTest.test-seed#[DAEC39BD6416377F]) [    ] o.a.s.c.c.SolrZkClient Using default ZkACLProvider
   [junit4]   2> 65557 INFO  (TEST-ChaosMonkeyNothingIsSafeTest.test-seed#[DAEC39BD6416377F]) [    ] o.a.s.c.c.SolrZkClient makePath: /solr
   [junit4]   2> 65558 INFO  (TEST-ChaosMonkeyNothingIsSafeTest.test-seed#[DAEC39BD6416377F]) [    ] o.a.s.c.c.SolrZkClient Using default ZkCredentialsProvider
   [junit4]   2> 65558 INFO  (TEST-ChaosMonkeyNothingIsSafeTest.test-seed#[DAEC39BD6416377F]) [    ] o.a.s.c.c.ConnectionManager Waiting for client to connect to ZooKeeper
   [junit4]   2> 65559 INFO  (zkCallback-168-thread-1) [    ] o.a.s.c.c.ConnectionManager Watcher org.apache.solr.common.cloud.ConnectionManager@6b19b91f name:ZooKeeperConnection Watcher:127.0.0.1:35379/solr got event WatchedEvent state:SyncConnected type:None path:null path:null type:None
   [junit4]   2> 65559 INFO  (TEST-ChaosMonkeyNothingIsSafeTest.test-seed#[DAEC39BD6416377F]) [    ] o.a.s.c.c.ConnectionManager Client is connected to ZooKeeper
   [junit4]   2> 65559 INFO  (TEST-ChaosMonkeyNothingIsSafeTest.test-seed#[DAEC39BD6416377F]) [    ] o.a.s.c.c.SolrZkClient Using default ZkACLProvider
   [junit4]   2> 65559 INFO  (TEST-ChaosMonkeyNothingIsSafeTest.test-seed#[DAEC39BD6416377F]) [    ] o.a.s.c.c.SolrZkClient makePath: /collections/collection1
   [junit4]   2> 65560 INFO  (TEST-ChaosMonkeyNothingIsSafeTest.test-seed#[DAEC39BD6416377F]) [    ] o.a.s.c.c.SolrZkClient makePath: /collections/collection1/shards
   [junit4]   2> 65560 INFO  (TEST-ChaosMonkeyNothingIsSafeTest.test-seed#[DAEC39BD6416377F]) [    ] o.a.s.c.c.SolrZkClient makePath: /collections/control_collection
   [junit4]   2> 65560 INFO  (TEST-ChaosMonkeyNothingIsSafeTest.test-seed#[DAEC39BD6416377F]) [    ] o.a.s.c.c.SolrZkClient makePath: /collections/control_collection/shards
   [junit4]   2> 65561 INFO  (TEST-ChaosMonkeyNothingIsSafeTest.test-seed#[DAEC39BD6416377F]) [    ] o.a.s.c.AbstractZkTestCase put /home/jenkins/workspace/Lucene-Solr-6.2-Linux/solr/core/src/test-files/solr/collection1/conf/solrconfig-tlog.xml to /configs/conf1/solrconfig.xml
   [junit4]   2> 65561 INFO  (TEST-ChaosMonkeyNothingIsSafeTest.test-seed#[DAEC39BD6416377F]) [    ] o.a.s.c.c.SolrZkClient makePath: /configs/conf1/solrconfig.xml
   [junit4]   2> 65562 INFO  (TEST-ChaosMonkeyNothingIsSafeTest.test-seed#[DAEC39BD6416377F]) [    ] o.a.s.c.AbstractZkTestCase put /home/jenkins/workspace/Lucene-Solr-6.2-Linux/solr/core/src/test-files/solr/collection1/conf/schema15.xml to /configs/conf1/schema.xml
   [junit4]   2> 65562 INFO  (TEST-ChaosMonkeyNothingIsSafeTest.test-seed#[DAEC39BD6416377F]) [    ] o.a.s.c.c.SolrZkClient makePath: /configs/conf1/schema.xml
   [junit4]   2> 65562 INFO  (TEST-ChaosMonkeyNothingIsSafeTest.test-seed#[DAEC39BD6416377F]) [    ] o.a.s.c.AbstractZkTestCase put /home/jenkins/workspace/Lucene-Solr-6.2-Linux/solr/core/src/test-files/solr/collection1/conf/solrconfig.snippet.randomindexconfig.xml to /configs/conf1/solrconfig.snippet.randomindexconfig.xml
   [junit4]   2> 65562 INFO  (TEST-ChaosMonkeyNothingIsSafeTest.test-seed#[DAEC39BD6416377F]) [    ] o.a.s.c.c.SolrZkClient makePath: /configs/conf1/solrconfig.snippet.randomindexconfig.xml
   [junit4]   2> 65563 INFO  (TEST-ChaosMonkeyNothingIsSafeTest.test-seed#[DAEC39BD6416377F]) [    ] o.a.s.c.AbstractZkTestCase put /home/jenkins/workspace/Lucene-Solr-6.2-Linux/solr/core/src/test-files/solr/collection1/conf/stopwords.txt to /configs/conf1/stopwords.txt
   [junit4]   2> 65563 INFO  (TEST-ChaosMonkeyNothingIsSafeTest.test-seed#[DAEC39BD6416377F]) [    ] o.a.s.c.c.SolrZkClient makePath: /configs/conf1/stopwords.txt
   [junit4]   2> 65563 INFO  (TEST-ChaosMonkeyNothingIsSafeTest.test-seed#[DAEC39BD6416377F]) [    ] o.a.s.c.AbstractZkTestCase put /home/jenkins/workspace/Lucene-Solr-6.2-Linux/solr/core/src/test-files/solr/collection1/conf/protwords.txt to /configs/conf1/protwords.txt
   [junit4]   2> 65563 INFO  (TEST-ChaosMonkeyNothingIsSafeTest.test-seed#[DAEC39BD6416377F]) [    ] o.a.s.c.c.SolrZkClient makePath: /configs/conf1/protwords.txt
   [junit4]   2> 65564 INFO  (TEST-ChaosMonkeyNothingIsSafeTest.test-seed#[DAEC39BD6416377F]) [    ] o.a.s.c.AbstractZkTestCase put /home/jenkins/workspace/Lucene-Solr-6.2-Linux/solr/core/src/test-files/solr/collection1/conf/currency.xml to /configs/conf1/currency.xml
   [junit4]   2> 65564 INFO  (TEST-ChaosMonkeyNothingIsSafeTest.test-seed#[DAEC39BD6416377F]) [    ] o.a.s.c.c.SolrZkClient makePath: /configs/conf1/currency.xml
   [junit4]   2> 65564 INFO  (TEST-ChaosMonkeyNothingIsSafeTest.test-seed#[DAEC39BD6416377F]) [    ] o.a.s.c.AbstractZkTestCase put /home/jenkins/workspace/Lucene-Solr-6.2-Linux/solr/core/src/test-files/solr/collection1/conf/enumsConfig.xml to /configs/conf1/enumsConfig.xml
   [junit4]   2> 65564 INFO  (TEST-ChaosMonkeyNothingIsSafeTest.test-seed#[DAEC39BD6416377F]) [    ] o.a.s.c.c.SolrZkClient makePath: /configs/conf1/enumsConfig.xml
   [junit4]   2> 65565 INFO  (TEST-ChaosMonkeyNothingIsSafeTest.test-seed#[DAEC39BD6416377F]) [    ] o.a.s.c.AbstractZkTestCase put /home/jenkins/workspace/Lucene-Solr-6.2-Linux/solr/core/src/test-files/solr/collection1/conf/open-exchange-rates.json to /configs/conf1/open-exchange-rates.json
   [junit4]   2> 65565 INFO  (TEST-ChaosMonkeyNothingIsSafeTest.test-seed#[DAEC39BD6416377F]) [    ] o.a.s.c.c.SolrZkClient makePath: /configs/conf1/open-exchange-rates.json
   [junit4]   2> 65565 INFO  (TEST-ChaosMonkeyNothingIsSafeTest.test-seed#[DAEC39BD6416377F]) [    ] o.a.s.c.AbstractZkTestCase put /home/jenkins/workspace/Lucene-Solr-6.2-Linux/solr/core/src/test-files/solr/collection1/conf/mapping-ISOLatin1Accent.txt to /configs/conf1/mapping-ISOLatin1Accent.txt
   [junit4]   2> 65565 INFO  (TEST-ChaosMonkeyNothingIsSafeTest.test-seed#[DAEC39BD6416377F]) [    ] o.a.s.c.c.SolrZkClient makePath: /configs/conf1/mapping-ISOLatin1Accent.txt
   [junit4]   2> 65566 INFO  (TEST-ChaosMonkeyNothingIsSafeTest.test-seed#[DAEC39BD6416377F]) [    ] o.a.s.c.AbstractZkTestCase put /home/jenkins/workspace/Lucene-Solr-6.2-Linux/solr/core/src/test-files/solr/collection1/conf/old_synonyms.txt to /configs/conf1/old_synonyms.txt
   [junit4]   2> 65566 INFO  (TEST-ChaosMonkeyNothingIsSafeTest.test-seed#[DAEC39BD6416377F]) [    ] o.a.s.c.c.SolrZkClient makePath: /configs/conf1/old_synonyms.txt
   [junit4]   2> 65566 INFO  (TEST-ChaosMonkeyNothingIsSafeTest.test-seed#[DAEC39BD6416377F]) [    ] o.a.s.c.AbstractZkTestCase put /home/jenkins/workspace/Lucene-Solr-6.2-Linux/solr/core/src/test-files/solr/collection1/conf/synonyms.txt to /configs/conf1/synonyms.txt
   [junit4]   2> 65566 INFO  (TEST-ChaosMonkeyNothingIsSafeTest.test-seed#[DAEC39BD6416377F]) [    ] o.a.s.c.c.SolrZkClient makePath: /configs/conf1/synonyms.txt
   [junit4]   2> 65622 INFO  (TEST-ChaosMonkeyNothingIsSafeTest.test-seed#[DAEC39BD6416377F]) [    ] o.a.s.SolrTestCaseJ4 Writing core.properties file to /home/jenkins/workspace/Lucene-Solr-6.2-Linux/solr/build/solr-core/test/J1/temp/solr.cloud.ChaosMonkeyNothingIsSafeTest_DAEC39BD6416377F-001/control-001/cores/collection1
   [junit4]   2> 65624 INFO  (TEST-ChaosMonkeyNothingIsSafeTest.test-seed#[DAEC39BD6416377F]) [    ] o.e.j.s.Server jetty-9.3.8.v20160314
   [junit4]   2> 65624 INFO  (TEST-ChaosMonkeyNothingIsSafeTest.test-seed#[DAEC39BD6416377F]) [    ] o.e.j.s.h.ContextHandler Started o.e.j.s.ServletContextHandler@12ba6032{/,null,AVAILABLE}
   [junit4]   2> 65626 INFO  (TEST-ChaosMonkeyNothingIsSafeTest.test-seed#[DAEC39BD6416377F]) [    ] o.e.j.s.ServerConnector Started ServerConnector@d6c179d{HTTP/1.1,[http/1.1]}{127.0.0.1:44143}
   [junit4]   2> 65626 INFO  (TEST-ChaosMonkeyNothingIsSafeTest.test-seed#[DAEC39BD6416377F]) [    ] o.e.j.s.Server Started @67364ms
   [junit4]   2> 65626 INFO  (TEST-ChaosMonkeyNothingIsSafeTest.test-seed#[DAEC39BD6416377F]) [    ] o.a.s.c.s.e.JettySolrRunner Jetty properties: {solr.data.dir=/home/jenkins/workspace/Lucene-Solr-6.2-Linux/solr/build/solr-core/test/J1/temp/solr.cloud.ChaosMonkeyNothingIsSafeTest_DAEC39BD6416377F-001/tempDir-001/control/data, hostContext=/, hostPort=44143, coreRootDirectory=/home/jenkins/workspace/Lucene-Solr-6.2-Linux/solr/build/solr-core/test/J1/temp/solr.cloud.ChaosMonkeyNothingIsSafeTest_DAEC39BD6416377F-001/control-001/cores}
   [junit4]   2> 65626 INFO  (TEST-ChaosMonkeyNothingIsSafeTest.test-seed#[DAEC39BD6416377F]) [    ] o.a.s.s.SolrDispatchFilter SolrDispatchFilter.init(): sun.misc.Launcher$AppClassLoader@73d16e93
   [junit4]   2> 65627 INFO  (TEST-ChaosMonkeyNothingIsSafeTest.test-seed#[DAEC39BD6416377F]) [    ] o.a.s.c.SolrResourceLoader new SolrResourceLoader for directory: '/home/jenkins/workspace/Lucene-Solr-6.2-Linux/solr/build/solr-core/test/J1/temp/solr.cloud.ChaosMonkeyNothingIsSafeTest_DAEC39BD6416377F-001/control-001'
   [junit4]   2> 65627 INFO  (TEST-ChaosMonkeyNothingIsSafeTest.test-seed#[DAEC39BD6416377F]) [    ] o.a.s.c.SolrResourceLoader JNDI not configured for solr (NoInitialContextEx)
   [junit4]   2> 65627 INFO  (TEST-ChaosMonkeyNothingIsSafeTest.test-seed#[DAEC39BD6416377F]) [    ] o.a.s.c.SolrResourceLoader solr home defaulted to 'solr/' (could not find system property or JNDI)
   [junit4]   2> 65627 INFO  (TEST-ChaosMonkeyNothingIsSafeTest.test-seed#[DAEC39BD6416377F]) [    ] o.a.s.c.c.SolrZkClient Using default ZkCredentialsProvider
   [junit4]   2> 65627 INFO  (TEST-ChaosMonkeyNothingIsSafeTest.test-seed#[DAEC39BD6416377F]) [    ] o.a.s.c.c.ConnectionManager Waiting for client to connect to ZooKeeper
   [junit4]   2> 65628 INFO  (zkCallback-169-thread-1) [    ] o.a.s.c.c.ConnectionManager Watcher org.apache.solr.common.cloud.ConnectionManager@7c101e29 name:ZooKeeperConnection Watcher:127.0.0.1:35379/solr got event WatchedEvent state:SyncConnected type:None path:null path:null type:None
   [junit4]   2> 65628 INFO  (TEST-ChaosMonkeyNothingIsSafeTest.test-seed#[DAEC39BD6416377F]) [    ] o.a.s.c.c.ConnectionManager Client is connected to ZooKeeper
   [junit4]   2> 65628 INFO  (TEST-ChaosMonkeyNothingIsSafeTest.test-seed#[DAEC39BD6416377F]) [    ] o.a.s.c.c.SolrZkClient Using default ZkACLProvider
   [junit4]   2> 65629 INFO  (TEST-ChaosMonkeyNothingIsSafeTest.test-seed#[DAEC39BD6416377F]) [    ] o.a.s.s.SolrDispatchFilter Loading solr.xml from SolrHome (not found in ZooKeeper)
   [junit4]   2> 65629 INFO  (TEST-ChaosMonkeyNothingIsSafeTest.test-seed#[DAEC39BD6416377F]) [    ] o.a.s.c.SolrXmlConfig Loading container configuration from /home/jenkins/workspace/Lucene-Solr-6.2-Linux/solr/build/solr-core/test/J1/temp/solr.cloud.ChaosMonkeyNothingIsSafeTest_DAEC39BD6416377F-001/control-001/solr.xml
   [junit4]   2> 65638 INFO  (TEST-ChaosMonkeyNothingIsSafeTest.test-seed#[DAEC39BD6416377F]) [    ] o.a.s.c.CorePropertiesLocator Config-defined core root directory: /home/jenkins/workspace/Lucene-Solr-6.2-Linux/solr/build/solr-core/test/J1/temp/solr.cloud.ChaosMonkeyNothingIsSafeTest_DAEC39BD6416377F-001/control-001/cores
   [junit4]   2> 65638 INFO  (TEST-ChaosMonkeyNothingIsSafeTest.test-seed#[DAEC39BD6416377F]) [    ] o.a.s.c.CoreContainer New CoreContainer 958095338
   [junit4]   2> 65638 INFO  (TEST-ChaosMonkeyNothingIsSafeTest.test-seed#[DAEC39BD6416377F]) [    ] o.a.s.c.CoreContainer Loading cores into CoreContainer [instanceDir=/home/jenkins/workspace/Lucene-Solr-6.2-Linux/solr/build/solr-core/test/J1/temp/solr.cloud.ChaosMonkeyNothingIsSafeTest_DAEC39BD6416377F-001/control-001]
   [junit4]   2> 65638 WARN  (TEST-ChaosMonkeyNothingIsSafeTest.test-seed#[DAEC39BD6416377F]) [    ] o.a.s.c.CoreContainer Couldn't add files from /home/jenkins/workspace/Lucene-Solr-6.2-Linux/solr/build/solr-core/test/J1/temp/solr.cloud.ChaosMonkeyNothingIsSafeTest_DAEC39BD6416377F-001/control-001/lib to classpath: /home/jenkins/workspace/Lucene-Solr-6.2-Linux/solr/build/solr-core/test/J1/temp/solr.cloud.ChaosMonkeyNothingIsSafeTest_DAEC39BD6416377F-001/control-001/lib
   [junit4]   2> 65638 INFO  (TEST-ChaosMonkeyNothingIsSafeTest.test-seed#[DAEC39BD6416377F]) [    ] o.a.s.h.c.HttpShardHandlerFactory created with socketTimeout : 90000,urlScheme : ,connTimeout : 15000,maxConnectionsPerHost : 20,maxConnections : 10000,corePoolSize : 0,maximumPoolSize : 2147483647,maxThreadIdleTime : 5,sizeOfQueue : -1,fairnessPolicy : false,useRetries : false,connectionsEvictorSleepDelay : 5000,maxConnectionIdleTime : 40000,
   [junit4]   2> 65639 INFO  (TEST-ChaosMonkeyNothingIsSafeTest.test-seed#[DAEC39BD6416377F]) [    ] o.a.s.u.UpdateShardHandler Creating UpdateShardHandler HTTP client with params: socketTimeout=340000&connTimeout=45000&retry=true
   [junit4]   2> 65640 INFO  (TEST-ChaosMonkeyNothingIsSafeTest.test-seed#[DAEC39BD6416377F]) [    ] o.a.s.l.LogWatcher SLF4J impl is org.slf4j.impl.Log4jLoggerFactory
   [junit4]   2> 65640 INFO  (TEST-ChaosMonkeyNothingIsSafeTest.test-seed#[DAEC39BD6416377F]) [    ] o.a.s.l.LogWatcher Registering Log Listener [Log4j (org.slf4j.impl.Log4jLoggerFactory)]
   [junit4]   2> 65640 INFO  (TEST-ChaosMonkeyNothingIsSafeTest.test-seed#[DAEC39BD6416377F]) [    ] o.a.s.c.ZkContainer Zookeeper client=127.0.0.1:35379/solr
   [junit4]   2> 65640 INFO  (TEST-ChaosMonkeyNothingIsSafeTest.test-seed#[DAEC39BD6416377F]) [    ] o.a.s.c.ZkController zkHost includes chroot
   [junit4]   2> 65640 INFO  (TEST-ChaosMonkeyNothingIsSafeTest.test-seed#[DAEC39BD6416377F]) [    ] o.a.s.c.c.SolrZkClient Using default ZkCredentialsProvider
   [junit4]   2> 65640 INFO  (TEST-ChaosMonkeyNothingIsSafeTest.test-seed#[DAEC39BD6416377F]) [    ] o.a.s.c.c.ConnectionManager Waiting for client to connect to ZooKeeper
   [junit4]   2> 65643 INFO  (zkCallback-172-thread-1) [    ] o.a.s.c.c.ConnectionManager Watcher org.apache.solr.common.cloud.ConnectionManager@49e91160 name:ZooKeeperConnection Watcher:127.0.0.1:35379 got event WatchedEvent state:SyncConnected type:None path:null path:null type:None
   [junit4]   2> 65644 INFO  (TEST-ChaosMonkeyNothingIsSafeTest.test-seed#[DAEC39BD6416377F]) [    ] o.a.s.c.c.ConnectionManager Client is connected to ZooKeeper
   [junit4]   2> 65644 INFO  (TEST-ChaosMonkeyNothingIsSafeTest.test-seed#[DAEC39BD6416377F]) [    ] o.a.s.c.c.SolrZkClient Using default ZkACLProvider
   [junit4]   2> 65645 INFO  (TEST-ChaosMonkeyNothingIsSafeTest.test-seed#[DAEC39BD6416377F]) [n:127.0.0.1:44143_    ] o.a.s.c.ZkController Added new OnReconnect listener org.apache.solr.cloud.ZkController$$Lambda$74/2079091424@4f2e34b7
   [junit4]   2> 65645 INFO  (TEST-ChaosMonkeyNothingIsSafeTest.test-seed#[DAEC39BD6416377F]) [n:127.0.0.1:44143_    ] o.a.s.c.c.ConnectionManager Waiting for client to connect to ZooKeeper
   [junit4]   2> 65646 INFO  (zkCallback-173-thread-1-processing-n:127.0.0.1:44143_) [n:127.0.0.1:44143_    ] o.a.s.c.c.ConnectionManager Watcher org.apache.solr.common.cloud.ConnectionManager@5aa38bf4 name:ZooKeeperConnection Watcher:127.0.0.1:35379/solr got event WatchedEvent state:SyncConnected type:None path:null path:null type:None
   [junit4]   2> 65646 INFO  (TEST-ChaosMonkeyNothingIsSafeTest.test-seed#[DAEC39BD6416377F]) [n:127.0.0.1:44143_    ] o.a.s.c.c.ConnectionManager Client is connected to ZooKeeper
   [junit4]   2> 65647 INFO  (TEST-ChaosMonkeyNothingIsSafeTest.test-seed#[DAEC39BD6416377F]) [n:127.0.0.1:44143_    ] o.a.s.c.c.SolrZkClient makePath: /overseer/queue
   [junit4]   2> 65648 INFO  (TEST-ChaosMonkeyNothingIsSafeTest.test-seed#[DAEC39BD6416377F]) [n:127.0.0.1:44143_    ] o.a.s.c.c.SolrZkClient makePath: /overseer/collection-queue-work
   [junit4]   2> 65649 INFO  (TEST-ChaosMonkeyNothingIsSafeTest.test-seed#[DAEC39BD6416377F]) [n:127.0.0.1:44143_    ] o.a.s.c.c.SolrZkClient makePath: /overseer/collection-map-running
   [junit4]   2> 65650 INFO  (TEST-ChaosMonkeyNothingIsSafeTest.test-seed#[DAEC39BD6416377F]) [n:127.0.0.1:44143_    ] o.a.s.c.c.SolrZkClient makePath: /overseer/collection-map-completed
   [junit4]   2> 65651 INFO  (TEST-ChaosMonkeyNothingIsSafeTest.test-seed#[DAEC39BD6416377F]) [n:127.0.0.1:44143_    ] o.a.s.c.c.SolrZkClient makePath: /overseer/collection-map-failure
   [junit4]   2> 65651 INFO  (TEST-ChaosMonkeyNothingIsSafeTest.test-seed#[DAEC39BD6416377F]) [n:127.0.0.1:44143_    ] o.a.s.c.c.SolrZkClient makePath: /live_nodes
   [junit4]   2> 65652 INFO  (TEST-ChaosMonkeyNothingIsSafeTest.test-seed#[DAEC39BD6416377F]) [n:127.0.0.1:44143_    ] o.a.s.c.c.SolrZkClient makePath: /aliases.json
   [junit4]   2> 65652 INFO  (TEST-ChaosMonkeyNothingIsSafeTest.test-seed#[DAEC39BD6416377F]) [n:127.0.0.1:44143_    ] o.a.s.c.c.SolrZkClient makePath: /clusterstate.json
   [junit4]   2> 65654 INFO  (TEST-ChaosMonkeyNothingIsSafeTest.test-seed#[DAEC39BD6416377F]) [n:127.0.0.1:44143_    ] o.a.s.c.c.SolrZkClient makePath: /security.json
   [junit4]   2> 65655 INFO  (TEST-ChaosMonkeyNothingIsSafeTest.test-seed#[DAEC39BD6416377F]) [n:127.0.0.1:44143_    ] o.a.s.c.c.ZkStateReader Updating cluster state from ZooKeeper... 
   [junit4]   2> 65655 INFO  (TEST-ChaosMonkeyNothingIsSafeTest.test-seed#[DAEC39BD6416377F]) [n:127.0.0.1:44143_    ] o.a.s.c.c.ZkStateReader Loaded empty cluster properties
   [junit4]   2> 65656 INFO  (TEST-ChaosMonkeyNothingIsSafeTest.test-seed#[DAEC39BD6416377F]) [n:127.0.0.1:44143_    ] o.a.s.c.c.ZkStateReader Updated live nodes from ZooKeeper... (0) -> (0)
   [junit4]   2> 65657 INFO  (TEST-ChaosMonkeyNothingIsSafeTest.test-seed#[DAEC39BD6416377F]) [n:127.0.0.1:44143_    ] o.a.s.c.c.SolrZkClient makePath: /overseer_elect
   [junit4]   2> 65657 INFO  (TEST-ChaosMonkeyNothingIsSafeTest.test-seed#[DAEC39BD6416377F]) [n:127.0.0.1:44143_    ] o.a.s.c.c.SolrZkClient makePath: /overseer_elect/election
   [junit4]   2> 65658 INFO  (TEST-ChaosMonkeyNothingIsSafeTest.test-seed#[DAEC39BD6416377F]) [n:127.0.0.1:44143_    ] o.a.s.c.Overseer Overseer (id=null) closing
   [junit4]   2> 65658 INFO  (TEST-ChaosMonkeyNothingIsSafeTest.test-seed#[DAEC39BD6416377F]) [n:127.0.0.1:44143_    ] o.a.s.c.LeaderElector Joined leadership election with path: /overseer_elect/election/96615563600461828-127.0.0.1:44143_-n_0000000000
   [junit4]   2> 65658 INFO  (TEST-ChaosMonkeyNothingIsSafeTest.test-seed#[DAEC39BD6416377F]) [n:127.0.0.1:44143_    ] o.a.s.c.OverseerElectionContext I am going to be the leader 127.0.0.1:44143_
   [junit4]   2> 65658 INFO  (TEST-ChaosMonkeyNothingIsSafeTest.test-seed#[DAEC39BD6416377F]) [n:127.0.0.1:44143_    ] o.a.s.c.c.SolrZkClient makePath: /overseer_elect/leader
   [junit4]   2> 65659 INFO  (TEST-ChaosMonkeyNothingIsSafeTest.test-seed#[DAEC39BD6416377F]) [n:127.0.0.1:44143_    ] o.a.s.c.Overseer Overseer (id=96615563600461828-127.0.0.1:44143_-n_0000000000) starting
   [junit4]   2> 65659 INFO  (TEST-ChaosMonkeyNothingIsSafeTest.test-seed#[DAEC39BD6416377F]) [n:127.0.0.1:44143_    ] o.a.s.c.c.SolrZkClient makePath: /overseer/queue-work
   [junit4]   2> 65662 INFO  (TEST-ChaosMonkeyNothingIsSafeTest.test-seed#[DAEC39BD6416377F]) [n:127.0.0.1:44143_    ] o.a.s.c.OverseerAutoReplicaFailoverThread Starting OverseerAutoReplicaFailoverThread autoReplicaFailoverWorkLoopDelay=10000 autoReplicaFailoverWaitAfterExpiration=10000 autoReplicaFailoverBadNodeExpiration=60000
   [junit4]   2> 65662 INFO  (OverseerCollectionConfigSetProcessor-96615563600461828-127.0.0.1:44143_-n_0000000000) [n:127.0.0.1:44143_    ] o.a.s.c.OverseerTaskProcessor Process current queue of overseer operations
   [junit4]   2> 65662 INFO  (TEST-ChaosMonkeyNothingIsSafeTest.test-seed#[DAEC39BD6416377F]) [n:127.0.0.1:44143_    ] o.a.s.c.ZkController Register node as live in ZooKeeper:/live_nodes/127.0.0.1:44143_
   [junit4]   2> 65662 INFO  (TEST-ChaosMonkeyNothingIsSafeTest.test-seed#[DAEC39BD6416377F]) [n:127.0.0.1:44143_    ] o.a.s.c.c.SolrZkClient makePath: /live_nodes/127.0.0.1:44143_
   [junit4]   2> 65662 INFO  (OverseerStateUpdate-96615563600461828-127.0.0.1:44143_-n_0000000000) [n:127.0.0.1:44143_    ] o.a.s.c.Overseer Starting to work on the main queue
   [junit4]   2> 65663 INFO  (zkCallback-173-thread-1-processing-n:127.0.0.1:44143_) [n:127.0.0.1:44143_    ] o.a.s.c.c.ZkStateReader A live node change: [WatchedEvent state:SyncConnected type:NodeChildrenChanged path:/live_nodes], has occurred - updating... (live nodes size: [0])
   [junit4]   2> 65663 INFO  (OverseerStateUpdate-96615563600461828-127.0.0.1:44143_-n_0000000000) [n:127.0.0.1:44143_    ] o.a.s.c.c.ZkStateReader Updated live nodes from ZooKeeper... (0) -> (1)
   [junit4]   2> 65663 INFO  (zkCallback-173-thread-1-processing-n:127.0.0.1:44143_) [n:127.0.0.1:44143_    ] o.a.s.c.c.ZkStateReader Updated live nodes from ZooKeeper... (1) -> (1)
   [junit4]   2> 65678 INFO  (TEST-ChaosMonkeyNothingIsSafeTest.test-seed#[DAEC39BD6416377F]) [n:127.0.0.1:44143_    ] o.a.s.c.CoreContainer Security conf doesn't exist. Skipping setup for authorization module.
   [junit4]   2> 65678 INFO  (TEST-ChaosMonkeyNothingIsSafeTest.test-seed#[DAEC39BD6416377F]) [n:127.0.0.1:44143_    ] o.a.s.c.CoreContainer No authentication plugin used.
   [junit4]   2> 65678 INFO  (TEST-ChaosMonkeyNothingIsSafeTest.test-seed#[DAEC39BD6416377F]) [n:127.0.0.1:44143_    ] o.a.s.c.CorePropertiesLocator Looking for core definitions underneath /home/jenkins/workspace/Lucene-Solr-6.2-Linux/solr/build/solr-core/test/J1/temp/solr.cloud.ChaosMonkeyNothingIsSafeTest_DAEC39BD6416377F-001/control-001/cores
   [junit4]   2> 65679 INFO  (TEST-ChaosMonkeyNothingIsSafeTest.test-seed#[DAEC39BD6416377F]) [n:127.0.0.1:44143_    ] o.a.s.c.CoreDescriptor Created CoreDescriptor: {name=collection1, config=solrconfig.xml, transient=false, schema=schema.xml, loadOnStartup=true, configSetProperties=configsetprops.json, collection=control_collection, coreNodeName=, dataDir=data/, shard=}
   [junit4]   2> 65679 INFO  (TEST-ChaosMonkeyNothingIsSafeTest.test-seed#[DAEC39BD6416377F]) [n:127.0.0.1:44143_    ] o.a.s.c.CorePropertiesLocator Found core collection1 in /home/jenkins/workspace/Lucene-Solr-6.2-Linux/solr/build/solr-core/test/J1/temp/solr.cloud.ChaosMonkeyNothingIsSafeTest_DAEC39BD6416377F-001/control-001/cores/collection1
   [junit4]   2> 65679 INFO  (TEST-ChaosMonkeyNothingIsSafeTest.test-seed#[DAEC39BD6416377F]) [n:127.0.0.1:44143_    ] o.a.s.c.CorePropertiesLocator Found 1 core definitions
   [junit4]   2> 65680 INFO  (TEST-ChaosMonkeyNothingIsSafeTest.test-seed#[DAEC39BD6416377F]) [n:127.0.0.1:44143_    ] o.a.s.s.SolrDispatchFilter user.dir=/home/jenkins/workspace/Lucene-Solr-6.2-Linux/solr/build/solr-core/test/J1
   [junit4]   2> 65680 INFO  (TEST-ChaosMonkeyNothingIsSafeTest.test-seed#[DAEC39BD6416377F]) [n:127.0.0.1:44143_    ] o.a.s.s.SolrDispatchFilter SolrDispatchFilter.init() done
   [junit4]   2> 65680 INFO  (coreLoadExecutor-193-thread-1-processing-n:127.0.0.1:44143_) [n:127.0.0.1:44143_ c:control_collection   x:collection1] o.a.s.c.ZkController publishing state=down
   [junit4]   2> 65680 INFO  (coreLoadExecutor-193-thread-1-processing-n:127.0.0.1:44143_) [n:127.0.0.1:44143_ c:control_collection   x:collection1] o.a.s.c.ZkController numShards not found on descriptor - reading it from system property
   [junit4]   2> 65681 INFO  (coreLoadExecutor-193-thread-1-processing-n:127.0.0.1:44143_) [n:127.0.0.1:44143_ c:control_collection   x:collection1] o.a.s.c.ZkController Collection control_collection not visible yet, but flagging it so a watch is registered when it becomes visible
   [junit4]   2> 65681 INFO  (OverseerStateUpdate-96615563600461828-127.0.0.1:44143_-n_0000000000) [n:127.0.0.1:44143_    ] o.a.s.c.Overseer processMessage: queueSize: 1, message = {
   [junit4]   2>   "core":"collection1",
   [junit4]   2>   "roles":null,
   [junit4]   2>   "base_url":"http://127.0.0.1:44143",
   [junit4]   2>   "node_name":"127.0.0.1:44143_",
   [junit4]   2>   "numShards":"1",
   [junit4]   2>   "state":"down",
   [junit4]   2>   "shard":null,
   [junit4]   2>   "collection":"control_collection",
   [junit4]   2>   "operation":"state"} current state version: 0
   [junit4]   2> 65681 INFO  (OverseerStateUpdate-96615563600461828-127.0.0.1:44143_-n_0000000000) [n:127.0.0.1:44143_    ] o.a.s.c.o.ReplicaMutator Update state numShards=1 message={
   [junit4]   2>   "core":"collection1",
   [junit4]   2>   "roles":null,
   [junit4]   2>   "base_url":"http://127.0.0.1:44143",
   [junit4]   2>   "node_name":"127.0.0.1:44143_",
   [junit4]   2>   "numShards":"1",
   [junit4]   2>   "state":"down",
   [junit4]   2>   "shard":null,
   [junit4]   2>   "collection":"control_collection",
   [junit4]   2>   "operation":"state"}
   [junit4]   2> 65681 INFO  (coreLoadExecutor-193-thread-1-processing-n:127.0.0.1:44143_) [n:127.0.0.1:44143_ c:control_collection   x:collection1] o.a.s.c.c.ZkStateReader Deleting data for [control_collection]
   [junit4]   2> 65682 INFO  (OverseerStateUpdate-96615563600461828-127.0.0.1:44143_-n_0000000000) [n:127.0.0.1:44143_    ] o.a.s.c.o.ClusterStateMutator building a new cName: control_collection
   [junit4]   2> 65682 INFO  (OverseerStateUpdate-96615563600461828-127.0.0.1:44143_-n_0000000000) [n:127.0.0.1:44143_    ] o.a.s.c.o.ReplicaMutator Assigning new node to shard shard=shard1
   [junit4]   2> 65682 INFO  (coreLoadExecutor-193-thread-1-processing-n:127.0.0.1:44143_) [n:127.0.0.1:44143_ c:control_collection   x:collection1] o.a.s.c.ZkController look for our core node name
   [junit4]   2> 65683 INFO  (zkCallback-173-thread-1-processing-n:127.0.0.1:44143_) [n:127.0.0.1:44143_    ] o.a.s.c.c.ZkStateReader A cluster state change: [WatchedEvent state:SyncConnected type:NodeDataChanged path:/clusterstate.json], has occurred - updating... (live nodes size: [1])
   [junit4]   2> 66682 INFO  (coreLoadExecutor-193-thread-1-processing-n:127.0.0.1:44143_) [n:127.0.0.1:44143_ c:control_collection   x:collection1] o.a.s.c.ZkController waiting to find shard id in clusterstate for collection1
   [junit4]   2> 66682 INFO  (coreLoadExecutor-193-thread-1-processing-n:127.0.0.1:44143_) [n:127.0.0.1:44143_ c:control_collection   x:collection1] o.a.s.c.ZkController Check for collection zkNode:control_collection
   [junit4]   2> 66683 INFO  (coreLoadExecutor-193-thread-1-processing-n:127.0.0.1:44143_) [n:127.0.0.1:44143_ c:control_collection   x:collection1] o.a.s.c.ZkController Collection zkNode exists
   [junit4]   2> 66683 INFO  (coreLoadExecutor-193-thread-1-processing-n:127.0.0.1:44143_) [n:127.0.0.1:44143_ c:control_collection   x:collection1] o.a.s.c.c.ZkStateReader Load collection config from: [/collections/control_collection]
   [junit4]   2> 66683 INFO  (coreLoadExecutor-193-thread-1-processing-n:127.0.0.1:44143_) [n:127.0.0.1:44143_ c:control_collection   x:collection1] o.a.s.c.c.ZkStateReader path=[/collections/control_collection] [configName]=[conf1] specified config exists in ZooKeeper
   [junit4]   2> 66683 INFO  (coreLoadExecutor-193-thread-1-processing-n:127.0.0.1:44143_) [n:127.0.0.1:44143_ c:control_collection   x:collection1] o.a.s.c.SolrResourceLoader new SolrResourceLoader for directory: '/home/jenkins/workspace/Lucene-Solr-6.2-Linux/solr/build/solr-core/test/J1/temp/solr.cloud.ChaosMonkeyNothingIsSafeTest_DAEC39BD6416377F-001/control-001/cores/collection1'
   [junit4]   2> 66683 INFO  (coreLoadExecutor-193-thread-1-processing-n:127.0.0.1:44143_) [n:127.0.0.1:44143_ c:control_collection   x:collection1] o.a.s.c.SolrResourceLoader JNDI not configured for solr (NoInitialContextEx)
   [junit4]   2> 66683 INFO  (coreLoadExecutor-193-thread-1-processing-n:127.0.0.1:44143_) [n:127.0.0.1:44143_ c:control_collection   x:collection1] o.a.s.c.SolrResourceLoader solr home defaulted to 'solr/' (could not find system property or JNDI)
   [junit4]   2> 66684 INFO  (coreLoadExecutor-193-thread-1-processing-n:127.0.0.1:44143_) [n:127.0.0.1:44143_ c:control_collection   x:collection1] o.a.s.c.Config loaded config solrconfig.xml with version 0 
   [junit4]   2> 66689 INFO  (coreLoadExecutor-193-thread-1-processing-n:127.0.0.1:44143_) [n:127.0.0.1:44143_ c:control_collection   x:collection1] o.a.s.c.SolrConfig current version of requestparams : -1
   [junit4]   2> 66692 INFO  (coreLoadExecutor-193-thread-1-processing-n:127.0.0.1:44143_) [n:127.0.0.1:44143_ c:control_collection   x:collection1] o.a.s.c.SolrConfig Using Lucene MatchVersion: 6.2.1
   [junit4]   2> 66707 INFO  (coreLoadExecutor-193-thread-1-processing-n:127.0.0.1:44143_) [n:127.0.0.1:44143_ c:control_collection   x:collection1] o.a.s.c.SolrConfig Loaded SolrConfig: solrconfig.xml
   [junit4]   2> 66712 INFO  (coreLoadExecutor-193-thread-1-processing-n:127.0.0.1:44143_) [n:127.0.0.1:44143_ c:control_collection   x:collection1] o.a.s.s.IndexSchema [collection1] Schema name=test
   [junit4]   2> 66767 INFO  (coreLoadExecutor-193-thread-1-processing-n:127.0.0.1:44143_) [n:127.0.0.1:44143_ c:control_collection   x:collection1] o.a.s.s.IndexSchema default search field in schema is text
   [junit4]   2> 66767 INFO  (coreLoadExecutor-193-thread-1-processing-n:127.0.0.1:44143_) [n:127.0.0.1:44143_ c:control_collection   x:collection1] o.a.s.s.IndexSchema unique key field: id
   [junit4]   2> 66768 INFO  (coreLoadExecutor-193-thread-1-processing-n:127.0.0.1:44143_) [n:127.0.0.1:44143_ c:control_collection   x:collection1] o.a.s.s.FileExchangeRateProvider Reloading exchange rates from file currency.xml
   [junit4]   2> 66770 INFO  (coreLoadExecutor-193-thread-1-processing-n:127.0.0.1:44143_) [n:127.0.0.1:44143_ c:control_collection   x:collection1] o.a.s.s.FileExchangeRateProvider Reloading exchange rates from file currency.xml
   [junit4]   2> 66780 INFO  (coreLoadExecutor-193-thread-1-processing-n:127.0.0.1:44143_) [n:127.0.0.1:44143_ c:control_collection   x:collection1] o.a.s.c.ConfigSetProperties Did not find ConfigSet properties, assuming default properties: Can't find resource 'configsetprops.json' in classpath or '/configs/conf1', cwd=/home/jenkins/workspace/Lucene-Solr-6.2-Linux/solr/build/solr-core/test/J1
   [junit4]   2> 66780 INFO  (coreLoadExecutor-193-thread-1-processing-n:127.0.0.1:44143_) [n:127.0.0.1:44143_ c:control_collection   x:collection1] o.a.s.c.CoreContainer Creating SolrCore 'collection1' using configuration from collection control_collection
   [junit4]   2> 66780 INFO  (coreLoadExecutor-193-thread-1-processing-n:127.0.0.1:44143_) [n:127.0.0.1:44143_ c:control_collection s:shard1 r:core_node1 x:collection1] o.a.s.c.SolrCore solr.StandardDirectoryFactory
   [junit4]   2> 66785 INFO  (coreLoadExecutor-193-thread-1-processing-n:127.0.0.1:44143_) [n:127.0.0.1:44143_ c:control_collection s:shard1 r:core_node1 x:collection1] o.a.s.c.SolrCore [[collection1] ] Opening new SolrCore at [/home/jenkins/workspace/Lucene-Solr-6.2-Linux/solr/build/solr-core/test/J1/temp/solr.cloud.ChaosMonkeyNothingIsSafeTest_DAEC39BD6416377F-001/control-001/cores/collection1], dataDir=[/home/jenkins/workspace/Lucene-Solr-6.2-Linux/solr/build/solr-core/test/J1/temp/solr.cloud.ChaosMonkeyNothingIsSafeTest_DAEC39BD6416377F-001/control-001/cores/collection1/data/]
   [junit4]   2> 66785 INFO  (coreLoadExecutor-193-thread-1-processing-n:127.0.0.1:44143_) [n:127.0.0.1:44143_ c:control_collection s:shard1 r:core_node1 x:collection1] o.a.s.c.JmxMonitoredMap JMX monitoring is enabled. Adding Solr mbeans to JMX Server: com.sun.jmx.mbeanserver.JmxMBeanServer@288ecfef
   [junit4]   2> 66786 INFO  (coreLoadExecutor-193-thread-1-processing-n:127.0.0.1:44143_) [n:127.0.0.1:44143_ c:control_collection s:shard1 r:core_node1 x:collection1] o.a.s.c.CachingDirectoryFactory return new directory for /home/jenkins/workspace/Lucene-Solr-6.2-Linux/solr/build/solr-core/test/J1/temp/solr.cloud.ChaosMonkeyNothingIsSafeTest_DAEC39BD6416377F-001/control-001/cores/collection1/data/snapshot_metadata
   [junit4]   2> 66786 INFO  (coreLoadExecutor-193-thread-1-processing-n:127.0.0.1:44143_) [n:127.0.0.1:44143_ c:control_collection s:shard1 r:core_node1 x:collection1] o.a.s.c.s.SolrSnapshotMetaDataManager Loading from snapshot metadata file...
   [junit4]   2> 66786 INFO  (coreLoadExecutor-193-thread-1-processing-n:127.0.0.1:44143_) [n:127.0.0.1:44143_ c:control_collection s:shard1 r:core_node1 x:collection1] o.a.s.c.CachingDirectoryFactory return new directory for /home/jenkins/workspace/Lucene-Solr-6.2-Linux/solr/build/solr-core/test/J1/temp/solr.cloud.ChaosMonkeyNothingIsSafeTest_DAEC39BD6416377F-001/control-001/cores/collection1/data
   [junit4]   2> 66786 INFO  (coreLoadExecutor-193-thread-1-processing-n:127.0.0.1:44143_) [n:127.0.0.1:44143_ c:control_collection s:shard1 r:core_node1 x:collection1] o.a.s.c.SolrCore New index directory detected: old=null new=/home/jenkins/workspace/Lucene-Solr-6.2-Linux/solr/build/solr-core/test/J1/temp/solr.cloud.ChaosMonkeyNothingIsSafeTest_DAEC39BD6416377F-001/control-001/cores/collection1/data/index/
   [junit4]   2> 66786 WARN  (coreLoadExecutor-193-thread-1-processing-n:127.0.0.1:44143_) [n:127.0.0.1:44143_ c:control_collection s:shard1 r:core_node1 x:collection1] o.a.s.c.SolrCore [collection1] Solr index directory '/home/jenkins/workspace/Lucene-Solr-6.2-Linux/solr/build/solr-core/test/J1/temp/solr.cloud.ChaosMonkeyNothingIsSafeTest_DAEC39BD6416377F-001/control-001/cores/collection1/data/index' doesn't exist. Creating new index...
   [junit4]   2> 66786 INFO  (coreLoadExecutor-193-thread-1-processing-n:127.0.0.1:44143_) [n:127.0.0.1:44143_ c:control_collection s:shard1 r:core_node1 x:collection1] o.a.s.c.CachingDirectoryFactory return new directory for /home/jenkins/workspace/Lucene-Solr-6.2-Linux/solr/build/solr-core/test/J1/temp/solr.cloud.ChaosMonkeyNothingIsSafeTest_DAEC39BD6416377F-001/control-001/cores/collection1/data/index
   [junit4]   2> 66787 INFO  (coreLoadExecutor-193-thread-1-processing-n:127.0.0.1:44143_) [n:127.0.0.1:44143_ c:control_collection s:shard1 r:core_node1 x:collection1] o.a.s.u.RandomMergePolicy RandomMergePolicy wrapping class org.apache.lucene.index.TieredMergePolicy: [TieredMergePolicy: maxMergeAtOnce=14, maxMergeAtOnceExplicit=50, maxMergedSegmentMB=50.8779296875, floorSegmentMB=1.501953125, forceMergeDeletesPctAllowed=0.29475918968730697, segmentsPerTier=37.0, maxCFSSegmentSizeMB=8.796093022207999E12, noCFSRatio=1.0
   [junit4]   2> 66807 INFO  (coreLoadExecutor-193-thread-1-processing-n:127.0.0.1:44143_) [n:127.0.0.1:44143_ c:control_collection s:shard1 r:core_node1 x:collection1] o.a.s.c.SolrDeletionPolicy SolrDeletionPolicy.onCommit: commits: num=1
   [junit4]   2> 	commit{dir=/home/jenkins/workspace/Lucene-Solr-6.2-Linux/solr/build/solr-core/test/J1/temp/solr.cloud.ChaosMonkeyNothingIsSafeTest_DAEC39BD6416377F-001/control-001/cores/collection1/data/index,segFN=segments_1,generation=1}
   [junit4]   2> 66807 INFO  (coreLoadExecutor-193-thread-1-processing-n:127.0.0.1:44143_) [n:127.0.0.1:44143_ c:control_collection s:shard1 r:core_node1 x:collection1] o.a.s.c.SolrDeletionPolicy newest commit generation = 1
   [junit4]   2> 66808 INFO  (OldIndexDirectoryCleanupThreadForCore-collection1) [n:127.0.0.1:44143_ c:control_collection s:shard1 r:core_node1 x:collection1] o.a.s.c.SolrCore Looking for old index directories to cleanup for core collection1 in /home/jenkins/workspace/Lucene-Solr-6.2-Linux/solr/build/solr-core/test/J1/temp/solr.cloud.ChaosMonkeyNothingIsSafeTest_DAEC39BD6416377F-001/control-001/cores/collection1/data/
   [junit4]   2> 66810 INFO  (coreLoadExecutor-193-thread-1-processing-n:127.0.0.1:44143_) [n:127.0.0.1:44143_ c:control_collection s:shard1 r:core_node1 x:collection1] o.a.s.u.p.UpdateRequestProcessorChain creating updateRequestProcessorChain "nodistrib"
   [junit4]   2> 66810 INFO  (coreLoadExecutor-193-thread-1-processing-n:127.0.0.1:44143_) [n:127.0.0.1:44143_ c:control_collection s:shard1 r:core_node1 x:collection1] o.a.s.u.p.UpdateRequestProcessorChain creating updateRequestProcessorChain "dedupe"
   [junit4]   2> 66810 INFO  (coreLoadExecutor-193-thread-1-processing-n:127.0.0.1:44143_) [n:127.0.0.1:44143_ c:control_collection s:shard1 r:core_node1 x:collection1] o.a.s.u.p.UpdateRequestProcessorChain inserting DistributedUpdateProcessorFactory into updateRequestProcessorChain "dedupe"
   [junit4]   2> 66810 INFO  (coreLoadExecutor-193-thread-1-processing-n:127.0.0.1:44143_) [n:127.0.0.1:44143_ c:control_collection s:shard1 r:core_node1 x:collection1] o.a.s.u.p.UpdateRequestProcessorChain creating updateRequestProcessorChain "stored_sig"
   [junit4]   2> 66811 INFO  (coreLoadExecutor-193-thread-1-processing-n:127.0.0.1:44143_) [n:127.0.0.1:44143_ c:control_collection s:shard1 r:core_node1 x:collection1] o.a.s.u.p.UpdateRequestProcessorChain inserting DistributedUpdateProcessorFactory into updateRequestProcessorChain "stored_sig"
   [junit4]   2> 66811 INFO  (coreLoadExecutor-193-thread-1-processing-n:127.0.0.1:44143_) [n:127.0.0.1:44143_ c:control_collection s:shard1 r:core_node1 x:collection1] o.a.s.u.p.UpdateRequestProcessorChain creating updateRequestProcessorChain "distrib-dup-test-chain-explicit"
   [junit4]   2> 66811 INFO  (coreLoadExecutor-193-thread-1-processing-n:127.0.0.1:44143_) [n:127.0.0.1:44143_ c:control_collection s:shard1 r:core_node1 x:collection1] o.a.s.u.p.UpdateRequestProcessorChain creating updateRequestProcessorChain "distrib-dup-test-chain-implicit"
   [junit4]   2> 66811 INFO  (coreLoadExecutor-193-thread-1-processing-n:127.0.0.1:44143_) [n:127.0.0.1:44143_ c:control_collection s:shard1 r:core_node1 x:collection1] o.a.s.u.p.UpdateRequestProcessorChain inserting DistributedUpdateProcessorFactory into updateRequestProcessorChain "distrib-dup-test-chain-implicit"
   [junit4]   2> 66811 INFO  (coreLoadExecutor-193-thread-1-processing-n:127.0.0.1:44143_) [n:127.0.0.1:44143_ c:control_collection s:shard1 r:core_node1 x:collection1] o.a.s.c.SolrCore no updateRequestProcessorChain defined as default, creating implicit default
   [junit4]   2> 66811 WARN  (coreLoadExecutor-193-thread-1-processing-n:127.0.0.1:44143_) [n:127.0.0.1:44143_ c:control_collection s:shard1 r:core_node1 x:collection1] o.a.s.c.RequestHandlers INVALID paramSet a in requestHandler {type = requestHandler,name = /dump,class = DumpRequestHandler,args = {defaults={a=A,b=B}}}
   [junit4]   2> 66813 INFO  (coreLoadExecutor-193-thread-1-processing-n:127.0.0.1:44143_) [n:127.0.0.1:44143_ c:control_collection s:shard1 r:core_node1 x:collection1] o.a.s.h.l.XMLLoader xsltCacheLifetimeSeconds=60
   [junit4]   2> 66814 INFO  (coreLoadExecutor-193-thread-1-processing-n:127.0.0.1:44143_) [n:127.0.0.1:44143_ c:control_collection s:shard1 r:core_node1 x:collection1] o.a.s.h.l.XMLLoader xsltCacheLifetimeSeconds=60
   [junit4]   2> 66814 INFO  (coreLoadExecutor-193-thread-1-processing-n:127.0.0.1:44143_) [n:127.0.0.1:44143_ c:control_collection s:shard1 r:core_node1 x:collection1] o.a.s.h.l.XMLLoader xsltCacheLifetimeSeconds=60
   [junit4]   2> 66815 INFO  (coreLoadExecutor-193-thread-1-processing-n:127.0.0.1:44143_) [n:127.0.0.1:44143_ c:control_collection s:shard1 r:core_node1 x:collection1] o.a.s.h.l.XMLLoader xsltCacheLifetimeSeconds=60
   [junit4]   2> 66821 INFO  (coreLoadExecutor-193-thread-1-processing-n:127.0.0.1:44143_) [n:127.0.0.1:44143_ c:control_collection s:shard1 r:core_node1 x:collection1] o.a.s.c.RequestHandlers Registered paths: /admin/mbeans,standard,/update/json/docs,/admin/luke,/export,/get,/admin/properties,/update/json,/admin/threads,/dump,/update/csv,/sql,/graph,/admin/segments,/admin/system,/replication,/config,/stream,/schema,/admin/plugins,/admin/logging,/admin/ping,/update,/admin/file,/terms
   [junit4]   2> 66821 INFO  (coreLoadExecutor-193-thread-1-processing-n:127.0.0.1:44143_) [n:127.0.0.1:44143_ c:control_collection s:shard1 r:core_node1 x:collection1] o.a.s.c.SolrCore Using default statsCache cache: org.apache.solr.search.stats.LocalStatsCache
   [junit4]   2> 66821 INFO  (coreLoadExecutor-193-thread-1-processing-n:127.0.0.1:44143_) [n:127.0.0.1:44143_ c:control_collection s:shard1 r:core_node1 x:collection1] o.a.s.u.UpdateHandler Using UpdateLog implementation: org.apache.solr.update.UpdateLog
   [junit4]   2> 66821 INFO  (coreLoadExecutor-193-thread-1-processing-n:127.0.0.1:44143_) [n:127.0.0.1:44143_ c:control_collection s:shard1 r:core_node1 x:collection1] o.a.s.u.UpdateLog Initializing UpdateLog: dataDir= defaultSyncLevel=FLUSH numRecordsToKeep=100 maxNumLogsToKeep=10 numVersionBuckets=65536
   [junit4]   2> 66822 INFO  (coreLoadExecutor-193-thread-1-processing-n:127.0.0.1:44143_) [n:127.0.0.1:44143_ c:control_collection s:shard1 r:core_node1 x:collection1] o.a.s.u.CommitTracker Hard AutoCommit: if uncommited for 15000ms; 
   [junit4]   2> 66822 INFO  (coreLoadExecutor-193-thread-1-processing-n:127.0.0.1:44143_) [n:127.0.0.1:44143_ c:control_collection s:shard1 r:core_node1 x:collection1] o.a.s.u.CommitTracker Soft AutoCommit: disabled
   [junit4]   2> 66822 INFO  (coreLoadExecutor-193-thread-1-processing-n:127.0.0.1:44143_) [n:127.0.0.1:44143_ c:control_collection s:shard1 r:core_node1 x:collection1] o.a.s.u.RandomMergePolicy RandomMergePolicy wrapping class org.apache.lucene.index.TieredMergePolicy: [TieredMergePolicy: maxMergeAtOnce=14, maxMergeAtOnceExplicit=14, maxMergedSegmentMB=34.83203125, floorSegmentMB=2.0244140625, forceMergeDeletesPctAllowed=3.392283340727973, segmentsPerTier=38.0, maxCFSSegmentSizeMB=8.796093022207999E12, noCFSRatio=0.0
   [junit4]   2> 66823 INFO  (coreLoadExecutor-193-thread-1-processing-n:127.0.0.1:44143_) [n:127.0.0.1:44143_ c:control_collection s:shard1 r:core_node1 x:collection1] o.a.s.c.SolrDeletionPolicy SolrDeletionPolicy.onInit: commits: num=1
   [junit4]   2> 	commit{dir=/home/jenkins/workspace/Lucene-Solr-6.2-Linux/solr/build/solr-core/test/J1/temp/solr.cloud.ChaosMonkeyNothingIsSafeTest_DAEC39BD6416377F-001/control-001/cores/collection1/data/index,segFN=segments_1,generation=1}
   [junit4]   2> 66823 INFO  (coreLoadExecutor-193-thread-1-processing-n:127.0.0.1:44143_) [n:127.0.0.1:44143_ c:control_collection s:shard1 r:core_node1 x:collection1] o.a.s.c.SolrDeletionPolicy newest commit generation = 1
   [junit4]   2> 66823 INFO  (coreLoadExecutor-193-thread-1-processing-n:127.0.0.1:44143_) [n:127.0.0.1:44143_ c:control_collection s:shard1 r:core_node1 x:collection1] o.a.s.s.SolrIndexSearcher Opening [Searcher@3957e6f5[collection1] main]
   [junit4]   2> 66823 INFO  (coreLoadExecutor-193-thread-1-processing-n:127.0.0.1:44143_) [n:127.0.0.1:44143_ c:control_collection s:shard1 r:core_node1 x:collection1] o.a.s.c.c.ZkStateReader Load collection config from: [/collections/control_collection]
   [junit4]   2> 66824 INFO  (coreLoadExecutor-193-thread-1-processing-n:127.0.0.1:44143_) [n:127.0.0.1:44143_ c:control_collection s:shard1 r:core_node1 x:collection1] o.a.s.c.c.ZkStateReader path=[/collections/control_collection] [configName]=[conf1] specified config exists in ZooKeeper
   [junit4]   2> 66824 INFO  (coreLoadExecutor-193-thread-1-processing-n:127.0.0.1:44143_) [n:127.0.0.1:44143_ c:control_collection s:shard1 r:core_node1 x:collection1] o.a.s.r.ManagedResourceStorage Setting up ZooKeeper-based storage for the RestManager with znodeBase: /configs/conf1
   [junit4]   2> 66824 INFO  (coreLoadExecutor-193-thread-1-processing-n:127.0.0.1:44143_) [n:127.0.0.1:44143_ c:control_collection s:shard1 r:core_node1 x:collection1] o.a.s.r.ManagedResourceStorage Configured ZooKeeperStorageIO with znodeBase: /configs/conf1
   [junit4]   2> 66824 INFO  (coreLoadExecutor-193-thread-1-processing-n:127.0.0.1:44143_) [n:127.0.0.1:44143_ c:control_collection s:shard1 r:core_node1 x:collection1] o.a.s.r.RestManager Initializing RestManager with initArgs: {}
   [junit4]   2> 66824 INFO  (coreLoadExecutor-193-thread-1-processing-n:127.0.0.1:44143_) [n:127.0.0.1:44143_ c:control_collection s:shard1 r:core_node1 x:collection1] o.a.s.r.ManagedResourceStorage Reading _rest_managed.json using ZooKeeperStorageIO:path=/configs/conf1
   [junit4]   2> 66824 INFO  (coreLoadExecutor-193-thread-1-processing-n:127.0.0.1:44143_) [n:127.0.0.1:44143_ c:control_collection s:shard1 r:core_node1 x:collection1] o.a.s.r.ManagedResourceStorage No data found for znode /configs/conf1/_rest_managed.json
   [junit4]   2> 66824 INFO  (coreLoadExecutor-193-thread-1-processing-n:127.0.0.1:44143_) [n:127.0.0.1:44143_ c:control_collection s:shard1 r:core_node1 x:collection1] o.a.s.r.ManagedResourceStorage Loaded null at path _rest_managed.json using ZooKeeperStorageIO:path=/configs/conf1
   [junit4]   2> 66824 INFO  (coreLoadExecutor-193-thread-1-processing-n:127.0.0.1:44143_) [n:127.0.0.1:44143_ c:control_collection s:shard1 r:core_node1 x:collection1] o.a.s.r.RestManager Initializing 0 registered ManagedResources
   [junit4]   2> 66824 INFO  (coreLoadExecutor-193-thread-1-processing-n:127.0.0.1:44143_) [n:127.0.0.1:44143_ c:control_collection s:shard1 r:core_node1 x:collection1] o.a.s.h.ReplicationHandler Commits will be reserved for  10000
   [junit4]   2> 66825 INFO  (searcherExecutor-194-thread-1-processing-n:127.0.0.1:44143_ x:collection1 s:shard1 c:control_collection r:core_node1) [n:127.0.0.1:44143_ c:control_collection s:shard1 r:core_node1 x:collection1] o.a.s.c.SolrCore [collection1] Registered new searcher Searcher@3957e6f5[collection1] main{ExitableDirectoryReader(UninvertingDirectoryReader())}
   [junit4]   2> 66825 INFO  (coreLoadExecutor-193-thread-1-processing-n:127.0.0.1:44143_) [n:127.0.0.1:44143_ c:control_collection s:shard1 r:core_node1 x:collection1] o.a.s.u.UpdateLog Looking up max value of version field to seed version buckets
   [junit4]   2> 66825 INFO  (coreLoadExecutor-193-thread-1-processing-n:127.0.0.1:44143_) [n:127.0.0.1:44143_ c:control_collection s:shard1 r:core_node1 x:collection1] o.a.s.u.VersionInfo Refreshing highest value of _version_ for 65536 version buckets from index
   [junit4]   2> 66825 INFO  (coreLoadExecutor-193-thread-1-processing-n:127.0.0.1:44143_) [n:127.0.0.1:44143_ c:control_collection s:shard1 r:core_node1 x:collection1] o.a.s.u.VersionInfo No terms found for _version_, cannot seed version bucket highest value from index
   [junit4]   2> 66825 INFO  (coreLoadExecutor-193-thread-1-processing-n:127.0.0.1:44143_) [n:127.0.0.1:44143_ c:control_collection s:shard1 r:core_node1 x:collection1] o.a.s.u.UpdateLog Could not find max version in index or recent updates, using new clock 1545849019043938304
   [junit4]   2> 66827 INFO  (coreLoadExecutor-193-thread-1-processing-n:127.0.0.1:44143_) [n:127.0.0.1:44143_ c:control_collection s:shard1 r:core_node1 x:collection1] o.a.s.u.UpdateLog Took 1.0ms to seed version buckets with highest version 1545849019043938304
   [junit4]   2> 66827 INFO  (coreLoadExecutor-193-thread-1-processing-n:127.0.0.1:44143_) [n:127.0.0.1:44143_ c:control_collection s:shard1 r:core_node1 x:collection1] o.a.s.c.ZkController watch zkdir /configs/conf1
   [junit4]   2> 66827 INFO  (coreLoadExecutor-193-thread-1-processing-n:127.0.0.1:44143_) [n:127.0.0.1:44143_ c:control_collection s:shard1 r:core_node1 x:collection1] o.a.s.c.CoreContainer registering core: collection1
   [junit4]   2> 66828 INFO  (coreZkRegister-186-thread-1-processing-n:127.0.0.1:44143_ x:collection1 s:shard1 c:control_collection r:core_node1) [n:127.0.0.1:44143_ c:control_collection s:shard1 r:core_node1 x:collection1] o.a.s.c.ZkController Register replica - core:collection1 address:http://127.0.0.1:44143 collection:control_collection shard:shard1
   [junit4]   2> 66828 INFO  (coreZkRegister-186-thread-1-processing-n:127.0.0.1:44143_ x:collection1 s:shard1 c:control_collection r:core_node1) [n:127.0.0.1:44143_ c:control_collection s:shard1 r:core_node1 x:collection1] o.a.s.c.c.SolrZkClient makePath: /collections/control_collection/leader_elect/shard1/election
   [junit4]   2> 66830 INFO  (coreZkRegister-186-thread-1-processing-n:127.0.0.1:44143_ x:collection1 s:shard1 c:control_collection r:core_node1) [n:127.0.0.1:44143_ c:control_collection s:shard1 r:core_node1 x:collection1] o.a.s.c.LeaderElector Joined leadership election with path: /collections/control_collection/leader_elect/shard1/election/96615563600461828-core_node1-n_0000000000
   [junit4]   2> 66831 INFO  (coreZkRegister-186-thread-1-processing-n:127.0.0.1:44143_ x:collection1 s:shard1 c:control_collection r:core_node1) [n:127.0.0.1:44143_ c:control_collection s:shard1 r:core_node1 x:collection1] o.a.s.c.ShardLeaderElectionContext Running the leader process for shard=shard1 and weAreReplacement=false and leaderVoteWait=10000
   [junit4]   2> 66831 INFO  (coreZkRegister-186-thread-1-processing-n:127.0.0.1:44143_ x:collection1 s:shard1 c:control_collection r:core_node1) [n:127.0.0.1:44143_ c:control_collection s:shard1 r:core_node1 x:collection1] o.a.s.c.ShardLeaderElectionContext Enough replicas found to continue.
   [junit4]   2> 66831 INFO  (coreZkRegister-186-thread-1-processing-n:127.0.0.1:44143_ x:collection1 s:shard1 c:control_collection r:core_node1) [n:127.0.0.1:44143_ c:control_collection s:shard1 r:core_node1 x:collection1] o.a.s.c.ShardLeaderElectionContext I may be the new leader - try and sync
   [junit4]   2> 66831 INFO  (coreZkRegister-186-thread-1-processing-n:127.0.0.1:44143_ x:collection1 s:shard1 c:control_collection r:core_node1) [n:127.0.0.1:44143_ c:control_collection s:shard1 r:core_node1 x:collection1] o.a.s.c.SyncStrategy Sync replicas to http://127.0.0.1:44143/collection1/
   [junit4]   2> 66831 INFO  (coreZkRegister-186-thread-1-processing-n:127.0.0.1:44143_ x:collection1 s:shard1 c:control_collection r:core_node1) [n:127.0.0.1:44143_ c:control_collection s:shard1 r:core_node1 x:collection1] o.a.s.c.SyncStrategy Sync Success - now sync replicas to me
   [junit4]   2> 66831 INFO  (coreZkRegister-186-thread-1-processing-n:127.0.0.1:44143_ x:collection1 s:shard1 c:control_collection r:core_node1) [n:127.0.0.1:44143_ c:control_collection s:shard1 r:core_node1 x:collection1] o.a.s.c.SyncStrategy http://127.0.0.1:44143/collection1/ has no replicas
   [junit4]   2> 66831 INFO  (OverseerStateUpdate-96615563600461828-127.0.0.1:44143_-n_0000000000) [n:127.0.0.1:44143_    ] o.a.s.c.Overseer processMessage: queueSize: 1, message = {
   [junit4]   2>   "operation":"leader",
   [junit4]   2>   "shard":"shard1",
   [junit4]   2>   "collection":"control_collection"} current state version: 1
   [junit4]   2> 66832 INFO  (coreZkRegister-186-thread-1-processing-n:127.0.0.1:44143_ x:collection1 s:shard1 c:control_collection r:core_node1) [n:127.0.0.1:44143_ c:control_collection s:shard1 r:core_node1 x:collection1] o.a.s.c.c.SolrZkClient makePath: /collections/control_collection/leaders/shard1
   [junit4]   2> 66833 INFO  (coreZkRegister-186-thread-1-processing-n:127.0.0.1:44143_ x:collection1 s:shard1 c:control_collection r:core_node1) [n:127.0.0.1:44143_ c:control_collection s:shard1 r:core_node1 x:collection1] o.a.s.c.ShardLeaderElectionContextBase Creating leader registration node /collections/control_collection/leaders/shard1/leader after winning as /collections/control_collection/leader_elect/shard1/election/96615563600461828-core_node1-n_0000000000
   [junit4]   2> 66834 INFO  (coreZkRegister-186-thread-1-processing-n:127.0.0.1:44143_ x:collection1 s:shard1 c:control_collection r:core_node1) [n:127.0.0.1:44143_ c:control_collection s:shard1 r:core_node1 x:collection1] o.a.s.c.ShardLeaderElectionContext I am the new leader: http://127.0.0.1:44143/collection1/ shard1
   [junit4]   2> 66834 INFO  (OverseerStateUpdate-96615563600461828-127.0.0.1:44143_-n_0000000000) [n:127.0.0.1:44143_    ] o.a.s.c.Overseer processMessage: queueSize: 1, message = {
   [junit4]   2>   "operation":"leader",
   [junit4]   2>   "shard":"shard1",
   [junit4]   2>   "collection":"control_collection",
   [junit4]   2>   "base_url":"http://127.0.0.1:44143",
   [junit4]   2>   "core":"collection1",
   [junit4]   2>   "state":"active"} current state version: 1
   [junit4]   2> 66935 INFO  (zkCallback-173-thread-1-processing-n:127.0.0.1:44143_) [n:127.0.0.1:44143_    ] o.a.s.c.c.ZkStateReader A cluster state change: [WatchedEvent state:SyncConnected type:NodeDataChanged path:/clusterstate.json], has occurred - updating... (live nodes size: [1])
   [junit4]   2> 66984 INFO  (coreZkRegister-186-thread-1-processing-n:127.0.0.1:44143_ x:collection1 s:shard1 c:control_collection r:core_node1) [n:127.0.0.1:44143_ c:control_collection s:shard1 r:core_node1 x:collection1] o.a.s.c.ZkController We are http://127.0.0.1:44143/collection1/ and leader is http://127.0.0.1:44143/collection1/
   [junit4]   2> 66984 INFO  (coreZkRegister-186-thread-1-processing-n:127.0.0.1:44143_ x:collection1 s:shard1 c:control_collection r:core_node1) [n:127.0.0.1:44143_ c:control_collection s:shard1 r:core_node1 x:collection1] o.a.s.c.ZkController No LogReplay needed for core=collection1 baseURL=http://127.0.0.1:44143
   [junit4]   2> 66984 INFO  (coreZkRegister-186-thread-1-processing-n:127.0.0.1:44143_ x:collection1 s:shard1 c:control_collection r:core_node1) [n:127.0.0.1:44143_ c:control_collection s:shard1 r:core_node1 x:collection1] o.a.s.c.ZkController I am the leader, no recovery necessary
   [junit4]   2> 66984 INFO  (coreZkRegister-186-thread-1-processing-n:127.0.0.1:44143_ x:collection1 s:shard1 c:control_collection r:core_node1) [n:127.0.0.1:44143_ c:control_collection s:shard1 r:core_node1 x:collection1] o.a.s.c.ZkController publishing state=active
   [junit4]   2> 66984 INFO  (coreZkRegister-186-thread-1-processing-n:127.0.0.1:44143_ x:collection1 s:shard1 c:control_collection r:core_node1) [n:127.0.0.1:44143_ c:control_collection s:shard1 r:core_node1 x:collection1] o.a.s.c.ZkController numShards not found on descriptor - reading it from system property
   [junit4]   2> 66985 INFO  (coreZkRegister-186-thread-1-processing-n:127.0.0.1:44143_ x:collection1 s:shard1 c:control_collection r:core_node1) [n:127.0.0.1:44143_ c:control_collection s:shard1 r:core_node1 x:collection1] o.a.s.c.c.ZkStateReader Checking legacy cluster state for collection control_collection
   [junit4]   2> 66985 INFO  (OverseerStateUpdate-96615563600461828-127.0.0.1:44143_-n_0000000000) [n:127.0.0.1:44143_    ] o.a.s.c.Overseer processMessage: queueSize: 1, message = {
   [junit4]   2>   "core":"collection1",
   [junit4]   2>   "core_node_name":"core_node1",
   [junit4]   2>   "roles":null,
   [junit4]   2>   "base_url":"http://127.0.0.1:44143",
   [junit4]   2>   "node_name":"127.0.0.1:44143_",
   [junit4]   2>   "numShards":"1",
   [junit4]   2>   "state":"active",
   [junit4]   2>   "shard":"shard1",
   [junit4]   2>   "collection":"control_collection",
   [junit4]   2>   "operation":"state"} current state version: 2
   [junit4]   2> 66985 INFO  (OverseerStateUpdate-96615563600461828-127.0.0.1:44143_-n_0000000000) [n:127.0.0.1:44143_    ] o.a.s.c.o.ReplicaMutator Update state numShards=1 message={
   [junit4]   2>   "core":"collection1",
   [junit4]   2>   "core_node_name":"core_node1",
   [junit4]   2>   "roles":null,
   [junit4]   2>   "base_url":"http://127.0.0.1:44143",
   [junit4]   2>   "node_name":"127.0.0.1:44143_",
   [junit4]   2>   "numShards":"1",
   [junit4]   2>   "state":"active",
   [junit4]   2>   "shard":"shard1",
   [junit4]   2>   "collection":"control_collection",
   [junit4]   2>   "operation":"state"}
   [junit4]   2> 67087 INFO  (zkCallback-173-thread-2-processing-n:127.0.0.1:44143_) [n:127.0.0.1:44143_    ] o.a.s.c.c.ZkStateReader A cluster state change: [WatchedEvent state:SyncConnected type:NodeDataChanged path:/clusterstate.json], has occurred - updating... (live nodes size: [1])
   [junit4]   2> 67182 INFO  (TEST-ChaosMonkeyNothingIsSafeTest.test-seed#[DAEC39BD6416377F]) [    ] o.a.s.c.c.SolrZkClient Using default ZkCredentialsProvider
   [junit4]   2> 67183 INFO  (TEST-ChaosMonkeyNothingIsSafeTest.test-seed#[DAEC39BD6416377F]) [    ] o.a.s.c.c.ConnectionManager Waiting for client to connect to ZooKeeper
   [junit4]   2> 67183 INFO  (zkCallback-177-thread-1) [    ] o.a.s.c.c.ConnectionManager Watcher org.apache.solr.common.cloud.ConnectionManager@15b888c7 name:ZooKeeperConnection Watcher:127.0.0.1:35379/solr got event WatchedEvent state:SyncConnected type:None path:null path:null type:None
   [junit4]   2> 67183 INFO  (TEST-ChaosMonkeyNothingIsSafeTest.test-seed#[DAEC39BD6416377F]) [    ] o.a.s.c.c.ConnectionManager Client is connected to ZooKeeper
   [junit4]   2> 67184 INFO  (TEST-ChaosMonkeyNothingIsSafeTest.test-seed#[DAEC39BD6416377F]) [    ] o.a.s.c.c.SolrZkClient Using default ZkACLProvider
   [junit4]   2> 67184 INFO  (TEST-ChaosMonkeyNothingIsSafeTest.test-seed#[DAEC39BD6416377F]) [    ] o.a.s.c.c.ZkStateReader Updating cluster state from ZooKeeper... 
   [junit4]   2> 67184 INFO  (TEST-ChaosMonkeyNothingIsSafeTest.test-seed#[DAEC39BD6416377F]) [    ] o.a.s.c.c.ZkStateReader Loaded empty cluster properties
   [junit4]   2> 67184 INFO  (TEST-ChaosMonkeyNothingIsSafeTest.test-seed#[DAEC39BD6416377F]) [    ] o.a.s.c.c.ZkStateReader Updated live nodes from ZooKeeper... (0) -> (1)
   [junit4]   2> 67184 INFO  (TEST-ChaosMonkeyNothingIsSafeTest.test-seed#[DAEC39BD6416377F]) [    ] o.a.s.c.ChaosMonkey monkey: init - expire sessions:false cause connection loss:false
   [junit4]   2> 67185 INFO  (TEST-ChaosMonkeyNothingIsSafeTest.test-seed#[DAEC39BD6416377F]) [    ] o.a.s.c.AbstractFullDistribZkTestBase Creating collection1 with stateFormat=2
   [junit4]   2> 67185 INFO  (TEST-ChaosMonkeyNothingIsSafeTest.test-seed#[DAEC39BD6416377F]) [    ] o.a.s.c.c.SolrZkClient Using default ZkCredentialsProvider
   [junit4]   2> 67185 INFO  (TEST-ChaosMonkeyNothingIsSafeTest.test-seed#[DAEC39BD6416377F]) [    ] o.a.s.c.c.ConnectionManager Waiting for client to connect to ZooKeeper
   [junit4]   2> 67186 INFO  (zkCallback-178-thread-1) [    ] o.a.s.c.c.ConnectionManager Watcher org.apache.solr.common.cloud.ConnectionManager@6eaa4a0d name:ZooKeeperConnection Watcher:127.0.0.1:35379/solr got event WatchedEvent state:SyncConnected type:None path:null path:null type:None
   [junit4]   2> 67186 INFO  (TEST-ChaosMonkeyNothingIsSafeTest.test-seed#[DAEC39BD6416377F]) [    ] o.a.s.c.c.ConnectionManager Client is connected to ZooKeeper
   [junit4]   2> 67186 INFO  (TEST-ChaosMonkeyNothingIsSafeTest.test-seed#[DAEC39BD6416377F]) [    ] o.a.s.c.c.SolrZkClient Using default ZkACLProvider
   [junit4]   2> 67187 INFO  (OverseerStateUpdate-96615563600461828-127.0.0.1:44143_-n_0000000000) [n:127.0.0.1:44143_    ] o.a.s.c.Overseer processMessage: queueSize: 1, message = {
   [junit4]   2>   "operation":"create",
   [junit4]   2>   "name":"collection1",
   [junit4]   2>   "numShards":"1",
   [junit4]   2>   "stateFormat":"2"} current state version: 3
   [junit4]   2> 67187 INFO  (OverseerStateUpdate-96615563600461828-127.0.0.1:44143_-n_0000000000) [n:127.0.0.1:44143_    ] o.a.s.c.o.ClusterStateMutator building a new cName: collection1
   [junit4]   2> 67242 INFO  (TEST-ChaosMonkeyNothingIsSafeTest.test-seed#[DAEC39BD6416377F]) [    ] o.a.s.SolrTestCaseJ4 Writing core.properties file to /home/jenkins/workspace/Lucene-Solr-6.2-Linux/solr/build/solr-core/test/J1/temp/solr.cloud.ChaosMonkeyNothingIsSafeTest_DAEC39BD6416377F-001/shard-1-001/cores/collection1
   [junit4]   2> 67243 INFO  (TEST-ChaosMonkeyNothingIsSafeTest.test-seed#[DAEC39BD6416377F]) [    ] o.a.s.c.AbstractFullDistribZkTestBase create jetty 1 in directory /home/jenkins/workspace/Lucene-Solr-6.2-Linux/solr/build/solr-core/test/J1/temp/solr.cloud.ChaosMonkeyNothingIsSafeTest_DAEC39BD6416377F-001/shard-1-001
   [junit4]   2> 67243 INFO  (TEST-ChaosMonkeyNothingIsSafeTest.test-seed#[DAEC39BD6416377F]) [    ] o.e.j.s.Server jetty-9.3.8.v20160314
   [junit4]   2> 67244 INFO  (TEST-ChaosMonkeyNothingIsSafeTest.test-seed#[DAEC39BD6416377F]) [    ] o.e.j.s.h.ContextHandler Started o.e.j.s.ServletContextHandler@27985a65{/,null,AVAILABLE}
   [junit4]   2> 67245 INFO  (TEST-ChaosMonkeyNothingIsSafeTest.test-seed#[DAEC39BD6416377F]) [    ] o.e.j.s.ServerConnector Started ServerConnector@6c3ae1c3{HTTP/1.1,[http/1.1]}{127.0.0.1:36465}
   [junit4]   2> 67245 INFO  (TEST-ChaosMonkeyNothingIsSafeTest.test-seed#[DAEC39BD6416377F]) [    ] o.e.j.s.Server Started @68983ms
   [junit4]   2> 67245 INFO  (TEST-ChaosMonkeyNothingIsSafeTest.test-seed#[DAEC39BD6416377F]) [    ] o.a.s.c.s.e.JettySolrRunner Jetty properties: {solr.data.dir=/home/jenkins/workspace/Lucene-Solr-6.2-Linux/solr/build/solr-core/test/J1/temp/solr.cloud.ChaosMonkeyNothingIsSafeTest_DAEC39BD6416377F-001/tempDir-001/jetty1, solrconfig=solrconfig.xml, hostContext=/, hostPort=36465, coreRootDirectory=/home/jenkins/workspace/Lucene-Solr-6.2-Linux/solr/build/solr-core/test/J1/temp/solr.cloud.ChaosMonkeyNothingIsSafeTest_DAEC39BD6416377F-001/shard-1-001/cores}
   [junit4]   2> 67245 INFO  (TEST-ChaosMonkeyNothingIsSafeTest.test-seed#[DAEC39BD6416377F]) [    ] o.a.s.s.SolrDispatchFilter SolrDispatchFilter.init(): sun.misc.Launcher$AppClassLoader@73d16e93
   [junit4]   2> 67245 INFO  (TEST-ChaosMonkeyNothingIsSafeTest.test-seed#[DAEC39BD6416377F]) [    ] o.a.s.c.SolrResourceLoader new SolrResourceLoader for directory: '/home/jenkins/workspace/Lucene-Solr-6.2-Linux/solr/build/solr-core/test/J1/temp/solr.cloud.ChaosMonkeyNothingIsSafeTest_DAEC39BD6416377F-001/shard-1-001'
   [junit4]   2> 67245 INFO  (TEST-ChaosMonkeyNothingIsSafeTest.test-seed#[DAEC39BD6416377F]) [    ] o.a.s.c.SolrResourceLoader JNDI not configured for solr (NoInitialContextEx)
   [junit4]   2> 67245 INFO  (TEST-ChaosMonkeyNothingIsSafeTest.test-seed#[DAEC39BD6416377F]) [    ] o.a.s.c.SolrResourceLoader solr home defaulted to 'solr/' (could not find system property or JNDI)
   [junit4]   2> 67245 INFO  (TEST-ChaosMonkeyNothingIsSafeTest.test-seed#[DAEC39BD6416377F]) [    ] o.a.s.c.c.SolrZkClient Using default ZkCredentialsProvider
   [junit4]   2> 67246 INFO  (TEST-ChaosMonkeyNothingIsSafeTest.test-seed#[DAEC39BD6416377F]) [    ] o.a.s.c.c.ConnectionManager Waiting for client to connect to ZooKeeper
   [junit4]   2> 67246 INFO  (zkCallback-179-thread-1) [    ] o.a.s.c.c.ConnectionManager Watcher org.apache.solr.common.cloud.ConnectionManager@3f9926e2 name:ZooKeeperConnection Watcher:127.0.0.1:35379/solr got event WatchedEvent state:SyncConnected type:None path:null path:null type:None
   [junit4]   2> 67247 INFO  (TEST-ChaosMonkeyNothingIsSafeTest.test-seed#[DAEC39BD6416377F]) [    ] o.a.s.c.c.ConnectionManager Client is connected to ZooKeeper
   [junit4]   2> 67247 INFO  (TEST-ChaosMonkeyNothingIsSafeTest.test-seed#[DAEC39BD6416377F]) [    ] o.a.s.c.c.SolrZkClient Using default ZkACLProvider
   [junit4]   2> 67247 INFO  (TEST-ChaosMonkeyNothingIsSafeTest.test-seed#[DAEC39BD6416377F]) [    ] o.a.s.s.SolrDispatchFilter Loading solr.xml from SolrHome (not found in ZooKeeper)
   [junit4]   2> 67247 INFO  (TEST-ChaosMonkeyNothingIsSafeTest.test-seed#[DAEC39BD6416377F]) [    ] o.a.s.c.SolrXmlConfig Loading container configuration from /home/jenkins/workspace/Lucene-Solr-6.2-Linux/solr/build/solr-core/test/J1/temp/solr.cloud.ChaosMonkeyNothingIsSafeTest_DAEC39BD6416377F-001/shard-1-001/solr.xml
   [junit4]   2> 67252 INFO  (TEST-ChaosMonkeyNothingIsSafeTest.test-seed#[DAEC39BD6416377F]) [    ] o.a.s.c.CorePropertiesLocator Config-defined core root directory: /home/jenkins/workspace/Lucene-Solr-6.2-Linux/solr/build/solr-core/test/J1/temp/solr.cloud.ChaosMonkeyNothingIsSafeTest_DAEC39BD6416377F-001/shard-1-001/cores
   [junit4]   2> 67252 INFO  (TEST-ChaosMonkeyNothingIsSafeTest.test-seed#[DAEC39BD6416377F]) [    ] o.a.s.c.CoreContainer New CoreContainer 1521436839
   [junit4]   2> 67252 INFO  (TEST-ChaosMonkeyNothingIsSafeTest.test-seed#[DAEC39BD6416377F]) [    ] o.a.s.c.CoreContainer Loading cores into CoreContainer [instanceDir=/home/jenkins/workspace/Lucene-Solr-6.2-Linux/solr/build/solr-core/test/J1/temp/solr.cloud.ChaosMonkeyNothingIsSafeTest_DAEC39BD6416377F-001/shard-1-001]
   [junit4]   2> 67252 WARN  (TEST-ChaosMonkeyNothingIsSafeTest.test-seed#[DAEC39BD6416377F]) [    ] o.a.s.c.CoreContainer Couldn't add files from /home/jenkins/workspace/Lucene-Solr-6.2-Linux/solr/build/solr-core/test/J1/temp/solr.cloud.ChaosMonkeyNothingIsSafeTest_DAEC39BD6416377F-001/shard-1-001/lib to classpath: /home/jenkins/workspace/Lucene-Solr-6.2-Linux/solr/build/solr-core/test/J1/temp/solr.cloud.ChaosMonkeyNothingIsSafeTest_DAEC39BD6416377F-001/shard-1-001/lib
   [junit4]   2> 67252 INFO  (TEST-ChaosMonkeyNothingIsSafeTest.test-seed#[DAEC39BD6416377F]) [    ] o.a.s.h.c.HttpShardHandlerFactory created with socketTimeout : 90000,urlScheme : ,connTimeout : 15000,maxConnectionsPerHost : 20,maxConnections : 10000,corePoolSize : 0,maximumPoolSize : 2147483647,maxThreadIdleTime : 5,sizeOfQueue : -1,fairnessPolicy : false,useRetries : false,connectionsEvictorSleepDelay : 5000,maxConnectionIdleTime : 40000,
   [junit4]   2> 67253 INFO  (TEST-ChaosMonkeyNothingIsSafeTest.test-seed#[DAEC39BD6416377F]) [    ] o.a.s.u.UpdateShardHandler Creating UpdateShardHandler HTTP client with params: socketTimeout=340000&connTimeout=45000&retry=true
   [junit4]   2> 67254 INFO  (TEST-ChaosMonkeyNothingIsSafeTest.test-seed#[DAEC39BD6416377F]) [    ] o.a.s.l.LogWatcher SLF4J impl is org.slf4j.impl.Log4jLoggerFactory
   [junit4]   2> 67254 INFO  (TEST-ChaosMonkeyNothingIsSafeTest.test-seed#[DAEC39BD6416377F]) [    ] o.a.s.l.LogWatcher Registering Log Listener [Log4j (org.slf4j.impl.Log4jLoggerFactory)]
   [junit4]   2> 67254 INFO  (TEST-ChaosMonkeyNothingIsSafeTest.test-seed#[DAEC39BD6416377F]) [    ] o.a.s.c.ZkContainer Zookeeper client=127.0.0.1:35379/solr
   [junit4]   2> 67254 INFO  (TEST-ChaosMonkeyNothingIsSafeTest.test-seed#[DAEC39BD6416377F]) [    ] o.a.s.c.ZkController zkHost includes chroot
   [junit4]   2> 67254 INFO  (TEST-ChaosMonkeyNothingIsSafeTest.test-seed#[DAEC39BD6416377F]) [    ] o.a.s.c.c.SolrZkClient Using default ZkCredentialsProvider
   [junit4]   2> 67254 INFO  (TEST-ChaosMonkeyNothingIsSafeTest.test-seed#[DAEC39BD6416377F]) [    ] o.a.s.c.c.ConnectionManager Waiting for client to connect to ZooKeeper
   [junit4]   2> 67255 INFO  (zkCallback-182-thread-1) [    ] o.a.s.c.c.ConnectionManager Watcher org.apache.solr.common.cloud.ConnectionManager@78e56ec1 name:ZooKeeperConnection Watcher:127.0.0.1:35379 got event WatchedEvent state:SyncConnected type:None path:null path:null type:None
   [junit4]   2> 67255 INFO  (TEST-ChaosMonkeyNothingIsSafeTest.test-seed#[DAEC39BD6416377F]) [    ] o.a.s.c.c.ConnectionManager Client is connected to ZooKeeper
   [junit4]   2> 67255 INFO  (TEST-ChaosMonkeyNothingIsSafeTest.test-seed#[DAEC39BD6416377F]) [    ] o.a.s.c.c.SolrZkClient Using default ZkACLProvider
   [junit4]   2> 67256 INFO  (TEST-ChaosMonkeyNothingIsSafeTest.test-seed#[DAEC39BD6416377F]) [n:127.0.0.1:36465_    ] o.a.s.c.ZkController Added new OnReconnect listener org.apache.solr.cloud.ZkController$$Lambda$74/2079091424@9e22d9c
   [junit4]   2> 67256 INFO  (TEST-ChaosMonkeyNothingIsSafeTest.test-seed#[DAEC39BD6416377F]) [n:127.0.0.1:36465_    ] o.a.s.c.c.ConnectionManager Waiting for client to connect to ZooKeeper
   [junit4]   2> 67257 INFO  (zkCallback-183-thread-1-processing-n:127.0.0.1:36465_) [n:127.0.0.1:36465_    ] o.a.s.c.c.ConnectionManager Watcher org.apache.solr.common.cloud.ConnectionManager@55fb0e80 name:ZooKeeperConnection Watcher:127.0.0.1:35379/solr got event WatchedEvent state:SyncConnected type:None path:null path:null type:None
   [junit4]   2> 67257 INFO  (TEST-ChaosMonkeyNothingIsSafeTest.test-seed#[DAEC39BD6416377F]) [n:127.0.0.1:36465_    ] o.a.s.c.c.ConnectionManager Client is connected to ZooKeeper
   [junit4]   2> 67259 INFO  (TEST-ChaosMonkeyNothingIsSafeTest.test-seed#[DAEC39BD6416377F]) [n:127.0.0.1:36465_    ] o.a.s.c.c.ZkStateReader Updating cluster state from ZooKeeper... 
   [junit4]   2> 67259 INFO  (TEST-ChaosMonkeyNothingIsSafeTest.test-seed#[DAEC39BD6416377F]) [n:127.0.0.1:36465_    ] o.a.s.c.c.ZkStateReader Loaded empty cluster properties
   [junit4]   2> 67259 INFO  (TEST-ChaosMonkeyNothingIsSafeTest.test-seed#[DAEC39BD6416377F]) [n:127.0.0.1:36465_    ] o.a.s.c.c.ZkStateReader Updated live nodes from ZooKeeper... (0) -> (1)
   [junit4]   2> 67260 INFO  (TEST-ChaosMonkeyNothingIsSafeTest.test-seed#[DAEC39BD6416377F]) [n:127.0.0.1:36465_    ] o.a.s.c.Overseer Overseer (id=null) closing
   [junit4]   2> 67261 INFO  (TEST-ChaosMonkeyNothingIsSafeTest.test-seed#[DAEC39BD6416377F]) [n:127.0.0.1:36465_    ] o.a.s.c.LeaderElector Joined leadership election with path: /overseer_elect/election/96615563600461833-127.0.0.1:36465_-n_0000000001
   [junit4]   2> 67261 INFO  (TEST-ChaosMonkeyNothingIsSafeTest.test-seed#[DAEC39BD6416377F]) [n:127.0.0.1:36465_    ] o.a.s.c.LeaderElector Watching path /overseer_elect/election/96615563600461828-127.0.0.1:44143_-n_0000000000 to know if I could be the leader
   [junit4]   2> 67262 INFO  (TEST-ChaosMonkeyNothingIsSafeTest.test-seed#[DAEC39BD6416377F]) [n:127.0.0.1:36465_    ] o.a.s.c.ZkController Publish node=127.0.0.1:36465_ as DOWN
   [junit4]   2> 67262 INFO  (TEST-ChaosMonkeyNothingIsSafeTest.test-seed#[DAEC39BD6416377F]) [n:127.0.0.1:36465_    ] o.a.s.c.ZkController Register node as live in ZooKeeper:/live_nodes/127.0.0.1:36465_
   [junit4]   2> 67262 INFO  (TEST-ChaosMonkeyNothingIsSafeTest.test-seed#[DAEC39BD6416377F]) [n:127.0.0.1:36465_    ] o.a.s.c.c.SolrZkClient makePath: /live_nodes/127.0.0.1:36465_
   [junit4]   2> 67263 INFO  (OverseerStateUpdate-96615563600461828-127.0.0.1:44143_-n_0000000000) [n:127.0.0.1:44143_    ] o.a.s.c.Overseer processMessage: queueSize: 1, message = {
   [junit4]   2>   "operation":"downnode",
   [junit4]   2>   "node_name":"127.0.0.1:36465_"} current state version: 3
   [junit4]   2> 67263 INFO  (OverseerStateUpdate-96615563600461828-127.0.0.1:44143_-n_0000000000) [n:127.0.0.1:44143_    ] o.a.s.c.o.NodeMutator DownNode state invoked for node: 127.0.0.1:36465_
   [junit4]   2> 67263 INFO  (zkCallback-183-thread-1-processing-n:127.0.0.1:36465_) [n:127.0.0.1:36465_    ] o.a.s.c.c.ZkStateReader A live node change: [WatchedEvent state:SyncConnected type:NodeChildrenChanged path:/live_nodes], has occurred - updating... (live nodes size: [1])
   [junit4]   2> 67263 INFO  (zkCallback-177-thread-1) [    ] o.a.s.c.c.ZkStateReader A live node change: [WatchedEvent state:SyncConnected type:NodeChildrenChanged path:/live_nodes], has occurred - updating... (live nodes size: [1])
   [junit4]   2> 67263 INFO  (zkCallback-173-thread-2-processing-n:127.0.0.1:44143_) [n:127.0.0.1:44143_    ] o.a.s.c.c.ZkStateReader A live node change: [WatchedEvent state:SyncConnected type:NodeChildrenChanged path:/live_nodes], has occurred - updating... (live nodes size: [1])
   [junit4]   2> 67263 INFO  (OverseerStateUpdate-96615563600461828-127.0.0.1:44143_-n_0000000000) [n:127.0.0.1:44143_    ] o.a.s.c.o.ZkStateWriter going to create_collection /collections/collection1/state.json
   [junit4]   2> 67263 INFO  (zkCallback-183-thread-1-processing-n:127.0.0.1:36465_) [n:127.0.0.1:36465_    ] o.a.s.c.c.ZkStateReader Updated live nodes from ZooKeeper... (1) -> (2)
   [junit4]   2> 67263 INFO  (zkCallback-177-thread-1) [    ] o.a.s.c.c.ZkStateReader Updated live nodes from ZooKeeper... (1) -> (2)
   [junit4]   2> 67263 INFO  (zkCallback-173-thread-2-processing-n:127.0.0.1:44143_) [n:127.0.0.1:44143_    ] o.a.s.c.c.ZkStateReader Updated live nodes from ZooKeeper... (1) -> (2)
   [junit4]   2> 67264 INFO  (zkCallback-177-thread-1) [    ] o.a.s.c.c.ZkStateReader A cluster state change: [WatchedEvent state:SyncConnected type:NodeDataChanged path:/clusterstate.json], has occurred - updating... (live nodes size: [2])
   [junit4]   2> 67264 INFO  (zkCallback-183-thread-1-processing-n:127.0.0.1:36465_) [n:127.0.0.1:36465_    ] o.a.s.c.c.ZkStateReader A cluster state change: [WatchedEvent state:SyncConnected type:NodeDataChanged path:/clusterstate.json], has occurred - updating... (live nodes size: [2])
   [junit4]   2> 67264 INFO  (zkCallback-173-thread-2-processing-n:127.0.0.1:44143_) [n:127.0.0.1:44143_    ] o.a.s.c.c.ZkStateReader A cluster state change: [WatchedEvent state:SyncConnected type:NodeDataChanged path:/clusterstate.json], has occurred - updating... (live nodes size: [2])
   [junit4]   2> 67274 INFO  (TEST-ChaosMonkeyNothingIsSafeTest.test-seed#[DAEC39BD6416377F]) [n:127.0.0.1:36465_    ] o.a.s.c.CoreContainer Security conf doesn't exist. Skipping setup for authorization module.
   [junit4]   2> 67274 INFO  (TEST-ChaosMonkeyNothingIsSafeTest.test-seed#[DAEC39BD6416377F]) [n:127.0.0.1:36465_    ] o.a.s.c.CoreContainer No authentication plugin used.
   [junit4]   2> 67274 INFO  (TEST-ChaosMonkeyNothingIsSafeTest.test-seed#[DAEC39BD6416377F]) [n:127.0.0.1:36465_    ] o.a.s.c.CorePropertiesLocator Looking for core definitions underneath /home/jenkins/workspace/Lucene-Solr-6.2-Linux/solr/build/solr-core/test/J1/temp/solr.cloud.ChaosMonkeyNothingIsSafeTest_DAEC39BD6416377F-001/shard-1-001/cores
   [junit4]   2> 67275 INFO  (TEST-ChaosMonkeyNothingIsSafeTest.test-seed#[DAEC39BD6416377F]) [n:127.0.0.1:36465_    ] o.a.s.c.CoreDescriptor Created CoreDescriptor: {name=collection1, config=solrconfig.xml, transient=false, schema=schema.xml, loadOnStartup=true, configSetProperties=configsetprops.json, collection=collection1, coreNodeName=, dataDir=data/, shard=}
   [junit4]   2> 67275 INFO  (TEST-ChaosMonkeyNothingIsSafeTest.test-seed#[DAEC39BD6416377F]) [n:127.0.0.1:36465_    ] o.a.s.c.CorePropertiesLocator Found core collection1 in /home/jenkins/workspace/Lucene-Solr-6.2-Linux/solr/build/solr-core/test/J1/temp/solr.cloud.ChaosMonkeyNothingIsSafeTest_DAEC39BD6416377F-001/shard-1-001/cores/collection1
   [junit4]   2> 67275 INFO  (TEST-ChaosMonkeyNothingIsSafeTest.test-seed#[DAEC39BD6416377F]) [n:127.0.0.1:36465_    ] o.a.s.c.CorePropertiesLocator Found 1 core definitions
   [junit4]   2> 67275 INFO  (TEST-ChaosMonkeyNothingIsSafeTest.test-seed#[DAEC39BD6416377F]) [n:127.0.0.1:36465_    ] o.a.s.s.SolrDispatchFilter user.dir=/home/jenkins/workspace/Lucene-Solr-6.2-Linux/solr/build/solr-core/test/J1
   [junit4]   2> 67275 INFO  (TEST-ChaosMonkeyNothingIsSafeTest.test-seed#[DAEC39BD6416377F]) [n:127.0.0.1:36465_    ] o.a.s.s.SolrDispatchFilter SolrDispatchFilter.init() done
   [junit4]   2> 67276 INFO  (coreLoadExecutor-204-thread-1-processing-n:127.0.0.1:36465_) [n:127.0.0.1:36465_ c:collection1   x:collection1] o.a.s.c.ZkController publishing state=down
   [junit4]   2> 67276 INFO  (coreLoadExecutor-204-thread-1-processing-n:127.0.0.1:36465_) [n:127.0.0.1:36465_ c:collection1   x:collection1] o.a.s.c.ZkController numShards not found on descriptor - reading it from system property
   [junit4]   2> 67276 INFO  (coreLoadExecutor-204-thread-1-processing-n:127.0.0.1:36465_) [n:127.0.0.1:36465_ c:collection1   x:collection1] o.a.s.c.ZkController Registering watch for collection collection1
   [junit4]   2> 67276 INFO  (coreLoadExecutor-204-thread-1-processing-n:127.0.0.1:36465_) [n:127.0.0.1:36465_ c:collection1   x:collection1] o.a.s.c.c.ZkStateReader Add data for [collection1] ver [0]
   [junit4]   2> 67276 INFO  (OverseerStateUpdate-96615563600461828-127.0.0.1:44143_-n_0000000000) [n:127.0.0.1:44143_    ] o.a.s.c.Overseer processMessage: queueSize: 1, message = {
   [junit4]   2>   "core":"collection1",
   [junit4]   2>   "roles":null,
   [junit4]   2>   "base_url":"http://127.0.0.1:36465",
   [junit4]   2>   "node_name":"127.0.0.1:36465_",
   [junit4]   2>   "numShards":"1",
   [junit4]   2>   "state":"down",
   [junit4]   2>   "shard":null,
   [junit4]   2>   "collection":"collection1",
   [junit4]   2>   "operation":"state"} current state version: 4
   [junit4]   2> 67276 INFO  (coreLoadExecutor-204-thread-1-processing-n:127.0.0.1:36465_) [n:127.0.0.1:36465_ c:collection1   x:collection1] o.a.s.c.ZkController look for our core node name
   [junit4]   2> 67277 INFO  (OverseerStateUpdate-96615563600461828-127.0.0.1:44143_-n_0000000000) [n:127.0.0.1:44143_    ] o.a.s.c.o.ReplicaMutator Update state numShards=1 message={
   [junit4]   2>   "core":"collection1",
   [junit4]   2>   "roles":null,
   [junit4]   2>   "base_url":"http://127.0.0.1:36465",
   [junit4]   2>   "node_name":"127.0.0.1:36465_",
   [junit4]   2>   "numShards":"1",
   [junit4]   2>   "state":"down",
   [junit4]   2>   "shard":null,
   [junit4]   2>   "collection":"collection1",
   [junit4]   2>   "operation":"state"}
   [junit4]   2> 67277 INFO  (OverseerStateUpdate-96615563600461828-127.0.0.1:44143_-n_0000000000) [n:127.0.0.1:44143_    ] o.a.s.c.o.ReplicaMutator Collection already exists with numShards=1
   [junit4]   2> 67277 INFO  (OverseerStateUpdate-96615563600461828-127.0.0.1:44143_-n_0000000000) [n:127.0.0.1:44143_    ] o.a.s.c.o.ReplicaMutator Assigning new node to shard shard=shard1
   [junit4]   2> 67378 INFO  (OverseerStateUpdate-96615563600461828-127.0.0.1:44143_-n_0000000000) [n:127.0.0.1:44143_    ] o.a.s.c.o.ZkStateWriter going to update_collection /collections/collection1/state.json version: 2147483647
   [junit4]   2> 67378 WARN  (OverseerStateUpdate-96615563600461828-127.0.0.1:44143_-n_0000000000) [n:127.0.0.1:44143_    ] o.a.s.c.Overseer Bad version writing to ZK using compare-and-set, will force refresh cluster state
   [junit4]   2> org.apache.zookeeper.KeeperException$BadVersionException: KeeperErrorCode = BadVersion for /collections/collection1/state.json
   [junit4]   2> 	at org.apache.zookeeper.KeeperException.create(KeeperException.java:115)
   [junit4]   2> 	at org.apache.zookeeper.KeeperException.create(KeeperException.java:51)
   [junit4]   2> 	at org.apache.zookeeper.ZooKeeper.setData(ZooKeeper.java:1270)
   [junit4]   2> 	at org.apache.solr.common.cloud.SolrZkClient$8.execute(SolrZkClient.java:365)
   [junit4]   2> 	at org.apache.solr.common.cloud.SolrZkClient$8.execute(SolrZkClient.java:362)
   [junit4]   2> 	at org.apache.solr.common.cloud.ZkCmdExecutor.retryOperation(ZkCmdExecutor.java:60)
   [junit4]   2> 	at org.apache.solr.common.cloud.SolrZkClient.setData(SolrZkClient.java:362)
   [junit4]   2> 	at org.apache.solr.cloud.overseer.ZkStateWriter.writePendingUpdates(ZkStateWriter.java:230)
   [junit4]   2> 	at org.apache.solr.cloud.Overseer$ClusterStateUpdater.run(Overseer.java:240)
   [junit4]   2> 	at java.lang.Thread.run(Thread.java:745)
   [junit4]   2> 67379 INFO  (OverseerStateUpdate-96615563600461828-127.0.0.1:44143_-n_0000000000) [n:127.0.0.1:44143_    ] o.a.s.c.c.ZkStateReader Updated live nodes from ZooKeeper... (2) -> (2)
   [junit4]   2> 67379 INFO  (OverseerStateUpdate-96615563600461828-127.0.0.1:44143_-n_0000000000) [n:127.0.0.1:44143_    ] o.a.s.c.Overseer processMessage: workQueueSize: 2, message = {
   [junit4]   2>   "operation":"downnode",
   [junit4]   2>   "node_name":"127.0.0.1:36465_"}
   [junit4]   2> 67379 INFO  (OverseerStateUpdate-96615563600461828-127.0.0.1:44143_-n_0000000000) [n:127.0.0.1:44143_    ] o.a.s.c.o.NodeMutator DownNode state invoked for node: 127.0.0.1:36465_
   [junit4]   2> 67380 INFO  (zkCallback-173-thread-2-processing-n:127.0.0.1:44143_) [n:127.0.0.1:44143_    ] o.a.s.c.c.ZkStateReader A cluster state change: [WatchedEvent state:SyncConnected type:NodeDataChanged path:/clusterstate.json], has occurred - updating... (live nodes size: [2])
   [junit4]   2> 67380 INFO  (zkCallback-177-thread-1) [    ] o.a.s.c.c.ZkStateReader A cluster state change: [WatchedEvent state:SyncConnected type:NodeDataChanged path:/clusterstate.json], has occurred - updating... (live nodes size: [2])
   [junit4]   2> 67380 INFO  (zkCallback-183-thread-1-processing-n:127.0.0.1:36465_) [n:127.0.0.1:36465_    ] o.a.s.c.c.ZkStateReader A cluster state change: [WatchedEvent state:SyncConnected type:NodeDataChanged path:/clusterstate.json], has occurred - updating... (live nodes size: [2])
   [junit4]   2> 67380 INFO  (OverseerStateUpdate-96615563600461828-127.0.0.1:44143_-n_0000000000) [n:127.0.0.1:44143_    ] o.a.s.c.o.ZkStateWriter going to update_collection /collections/collection1/state.json version: 0
   [junit4]   2> 67380 INFO  (zkCallback-183-thread-1-processing-n:127.0.0.1:36465_) [n:127.0.0.1:36465_    ] o.a.s.c.c.ZkStateReader A cluster state change: [WatchedEvent state:SyncConnected type:NodeDataChanged path:/collections/collection1/state.json] for collection [collection1] has occurred - updating... (live nodes size: [2])
   [junit4]   2> 67380 INFO  (zkCallback-183-thread-1-processing-n:127.0.0.1:36465_) [n:127.0.0.1:36465_    ] o.a.s.c.c.ZkStateReader Updating data for [collection1] from [0] to [1]
   [junit4]   2> 67381 INFO  (OverseerStateUpdate-96615563600461828-127.0.0.1:44143_-n_0000000000) [n:127.0.0.1:44143_    ] o.a.s.c.Overseer processMessage: workQueueSize: 1, message = {
   [junit4]   2>   "core":"collection1",
   [junit4]   2>   "roles":null,
   [junit4]   2>   "base_url":"http://127.0.0.1:36465",
   [junit4]   2>   "node_name":"127.0.0.1:36465_",
   [junit4]   2>   "numShards":"1",
   [junit4]   2>   "state":"down",
   [junit4]   2>   "shard":null,
   [junit4]   2>   "collection":"collection1",
   [junit4]   2>   "operation":"state"}
   [junit4]   2> 67381 INFO  (OverseerStateUpdate-96615563600461828-127.0.0.1:44143_-n_0000000000) [n:127.0.0.1:44143_    ] o.a.s.c.o.ReplicaMutator Update state numShards=1 message={
   [junit4]   2>   "core":"collection1",
   [junit4]   2>   "roles":null,
   [junit4]   2>   "base_url":"http://127.0.0.1:36465",
   [junit4]   2>   "node_name":"127.0.0.1:36465_",
   [junit4]   2>   "numShards":"1",
   [junit4]   2>   "state":"down",
   [junit4]   2>   "shard":null,
   [junit4]   2>   "collection":"collection1",
   [junit4]   2>   "operation":"state"}
   [junit4]   2> 67381 INFO  (OverseerStateUpdate-96615563600461828-127.0.0.1:44143_-n_0000000000) [n:127.0.0.1:44143_    ] o.a.s.c.o.ReplicaMutator Collection already exists with numShards=1
   [junit4]   2> 67381 INFO  (OverseerStateUpdate-96615563600461828-127.0.0.1:44143_-n_0000000000) [n:127.0.0.1:44143_    ] o.a.s.c.o.ReplicaMutator Assigning new node to shard shard=shard1
   [junit4]   2> 67381 INFO  (OverseerStateUpdate-96615563600461828-127.0.0.1:44143_-n_0000000000) [n:127.0.0.1:44143_    ] o.a.s.c.o.ZkStateWriter going to update_collection /collections/collection1/state.json version: 1
   [junit4]   2> 67382 INFO  (zkCallback-183-thread-1-processing-n:127.0.0.1:36465_) [n:127.0.0.1:36465_    ] o.a.s.c.c.ZkStateReader A cluster state change: [WatchedEvent state:SyncConnected type:NodeDataChanged path:/collections/collection1/state.json] for collection [collection1] has occurred - updating... (live nodes size: [2])
   [junit4]   2> 67382 INFO  (zkCallback-183-thread-1-processing-n:127.0.0.1:36465_) [n:127.0.0.1:36465_    ] o.a.s.c.c.ZkStateReader Updating data for [collection1] from [1] to [2]
   [junit4]   2> 68277 INFO  (coreLoadExecutor-204-thread-1-processing-n:127.0.0.1:36465_) [n:127.0.0.1:36465_ c:collection1   x:collection1] o.a.s.c.ZkController waiting to find shard id in clusterstate for collection1
   [junit4]   2> 68277 INFO  (coreLoadExecutor-204-thread-1-processing-n:127.0.0.1:36465_) [n:127.0.0.1:36465_ c:collection1   x:collection1] o.a.s.c.ZkController Check for collection zkNode:collection1
   [junit4]   2> 68277 INFO  (coreLoadExecutor-204-thread-1-processing-n:127.0.0.1:36465_) [n:127.0.0.1:36465_ c:collection1   x:collection1] o.a.s.c.ZkController Collection zkNode exists
   [junit4]   2> 68277 INFO  (coreLoadExecutor-204-thread-1-processing-n:127.0.0.1:36465_) [n:127.0.0.1:36465

[...truncated too long message...]

thread-2-processing-n:127.0.0.1:42677_) [n:127.0.0.1:42677_ c:collection1 s:shard1 r:core_node3 x:collection1] o.a.s.c.SolrCore [collection1]  CLOSING SolrCore org.apache.solr.core.SolrCore@c0a1bff
   [junit4]   2> 112814 INFO  (zkCallback-196-thread-2-processing-n:127.0.0.1:42677_) [n:127.0.0.1:42677_ c:collection1 s:shard1 r:core_node3 x:collection1] o.a.s.c.ZkController removed listener for config directory [/configs/conf1]
   [junit4]   2> 112814 INFO  (zkCallback-196-thread-2-processing-n:127.0.0.1:42677_) [n:127.0.0.1:42677_ c:collection1 s:shard1 r:core_node3 x:collection1] o.a.s.c.ZkController No more listeners for config directory [/configs/conf1]
   [junit4]   2> 112814 INFO  (zkCallback-196-thread-2-processing-n:127.0.0.1:42677_) [n:127.0.0.1:42677_ c:collection1 s:shard1 r:core_node3 x:collection1] o.a.s.u.DirectUpdateHandler2 closing DirectUpdateHandler2{commits=3,autocommit maxTime=15000ms,autocommits=1,soft autocommits=0,optimizes=0,rollbacks=0,expungeDeletes=0,docsPending=0,adds=0,deletesById=0,deletesByQuery=0,errors=0,cumulative_adds=1194,cumulative_deletesById=592,cumulative_deletesByQuery=1,cumulative_errors=0,transaction_logs_total_size=138597,transaction_logs_total_number=2}
   [junit4]   2> 112814 INFO  (zkCallback-196-thread-2-processing-n:127.0.0.1:42677_) [n:127.0.0.1:42677_ c:collection1 s:shard1 r:core_node3 x:collection1] o.a.s.u.SolrCoreState Closing SolrCoreState
   [junit4]   2> 112814 WARN  (zkCallback-196-thread-2-processing-n:127.0.0.1:42677_) [n:127.0.0.1:42677_ c:collection1 s:shard1 r:core_node3 x:collection1] o.a.s.c.RecoveryStrategy Stopping recovery for core=[collection1] coreNodeName=[core_node3]
   [junit4]   2> 112814 INFO  (zkCallback-196-thread-2-processing-n:127.0.0.1:42677_) [n:127.0.0.1:42677_ c:collection1 s:shard1 r:core_node3 x:collection1] o.a.s.u.DefaultSolrCoreState SolrCoreState ref count has reached 0 - closing IndexWriter
   [junit4]   2> 112814 INFO  (zkCallback-196-thread-2-processing-n:127.0.0.1:42677_) [n:127.0.0.1:42677_ c:collection1 s:shard1 r:core_node3 x:collection1] o.a.s.u.DefaultSolrCoreState closing IndexWriter with IndexWriterCloser
   [junit4]   2> 112815 INFO  (zkCallback-196-thread-2-processing-n:127.0.0.1:42677_) [n:127.0.0.1:42677_ c:collection1 s:shard1 r:core_node3 x:collection1] o.a.s.c.SolrCore [collection1] Closing main searcher on request.
   [junit4]   2> 112825 INFO  (zkCallback-196-thread-2-processing-n:127.0.0.1:42677_) [n:127.0.0.1:42677_ c:collection1 s:shard1 r:core_node3 x:collection1] o.a.s.c.CachingDirectoryFactory Closing StandardDirectoryFactory - 3 directories currently being tracked
   [junit4]   2> 112825 INFO  (zkCallback-196-thread-2-processing-n:127.0.0.1:42677_) [n:127.0.0.1:42677_ c:collection1 s:shard1 r:core_node3 x:collection1] o.a.s.c.CachingDirectoryFactory looking to close /home/jenkins/workspace/Lucene-Solr-6.2-Linux/solr/build/solr-core/test/J1/temp/solr.cloud.ChaosMonkeyNothingIsSafeTest_DAEC39BD6416377F-001/shard-3-001/cores/collection1/data [CachedDir<<refCount=0;path=/home/jenkins/workspace/Lucene-Solr-6.2-Linux/solr/build/solr-core/test/J1/temp/solr.cloud.ChaosMonkeyNothingIsSafeTest_DAEC39BD6416377F-001/shard-3-001/cores/collection1/data;done=false>>]
   [junit4]   2> 112825 INFO  (zkCallback-196-thread-2-processing-n:127.0.0.1:42677_) [n:127.0.0.1:42677_ c:collection1 s:shard1 r:core_node3 x:collection1] o.a.s.c.CachingDirectoryFactory Closing directory, CoreContainer#isShutdown=true
   [junit4]   2> 112825 INFO  (zkCallback-196-thread-2-processing-n:127.0.0.1:42677_) [n:127.0.0.1:42677_ c:collection1 s:shard1 r:core_node3 x:collection1] o.a.s.c.CachingDirectoryFactory Closing directory: /home/jenkins/workspace/Lucene-Solr-6.2-Linux/solr/build/solr-core/test/J1/temp/solr.cloud.ChaosMonkeyNothingIsSafeTest_DAEC39BD6416377F-001/shard-3-001/cores/collection1/data
   [junit4]   2> 112825 INFO  (zkCallback-196-thread-2-processing-n:127.0.0.1:42677_) [n:127.0.0.1:42677_ c:collection1 s:shard1 r:core_node3 x:collection1] o.a.s.c.CachingDirectoryFactory looking to close /home/jenkins/workspace/Lucene-Solr-6.2-Linux/solr/build/solr-core/test/J1/temp/solr.cloud.ChaosMonkeyNothingIsSafeTest_DAEC39BD6416377F-001/shard-3-001/cores/collection1/data/index [CachedDir<<refCount=0;path=/home/jenkins/workspace/Lucene-Solr-6.2-Linux/solr/build/solr-core/test/J1/temp/solr.cloud.ChaosMonkeyNothingIsSafeTest_DAEC39BD6416377F-001/shard-3-001/cores/collection1/data/index;done=false>>]
   [junit4]   2> 112826 INFO  (zkCallback-196-thread-2-processing-n:127.0.0.1:42677_) [n:127.0.0.1:42677_ c:collection1 s:shard1 r:core_node3 x:collection1] o.a.s.c.CachingDirectoryFactory Closing directory, CoreContainer#isShutdown=true
   [junit4]   2> 112826 INFO  (zkCallback-196-thread-2-processing-n:127.0.0.1:42677_) [n:127.0.0.1:42677_ c:collection1 s:shard1 r:core_node3 x:collection1] o.a.s.c.CachingDirectoryFactory Closing directory: /home/jenkins/workspace/Lucene-Solr-6.2-Linux/solr/build/solr-core/test/J1/temp/solr.cloud.ChaosMonkeyNothingIsSafeTest_DAEC39BD6416377F-001/shard-3-001/cores/collection1/data/index
   [junit4]   2> 112826 INFO  (zkCallback-196-thread-2-processing-n:127.0.0.1:42677_) [n:127.0.0.1:42677_ c:collection1 s:shard1 r:core_node3 x:collection1] o.a.s.c.CachingDirectoryFactory looking to close /home/jenkins/workspace/Lucene-Solr-6.2-Linux/solr/build/solr-core/test/J1/temp/solr.cloud.ChaosMonkeyNothingIsSafeTest_DAEC39BD6416377F-001/shard-3-001/cores/collection1/data/snapshot_metadata [CachedDir<<refCount=0;path=/home/jenkins/workspace/Lucene-Solr-6.2-Linux/solr/build/solr-core/test/J1/temp/solr.cloud.ChaosMonkeyNothingIsSafeTest_DAEC39BD6416377F-001/shard-3-001/cores/collection1/data/snapshot_metadata;done=false>>]
   [junit4]   2> 112826 INFO  (zkCallback-196-thread-2-processing-n:127.0.0.1:42677_) [n:127.0.0.1:42677_ c:collection1 s:shard1 r:core_node3 x:collection1] o.a.s.c.CachingDirectoryFactory Closing directory, CoreContainer#isShutdown=true
   [junit4]   2> 112826 INFO  (zkCallback-196-thread-2-processing-n:127.0.0.1:42677_) [n:127.0.0.1:42677_ c:collection1 s:shard1 r:core_node3 x:collection1] o.a.s.c.CachingDirectoryFactory Closing directory: /home/jenkins/workspace/Lucene-Solr-6.2-Linux/solr/build/solr-core/test/J1/temp/solr.cloud.ChaosMonkeyNothingIsSafeTest_DAEC39BD6416377F-001/shard-3-001/cores/collection1/data/snapshot_metadata
   [junit4]   2> 112827 INFO  (TEST-ChaosMonkeyNothingIsSafeTest.test-seed#[DAEC39BD6416377F]) [    ] o.e.j.s.ServerConnector Stopped ServerConnector@c523140{HTTP/1.1,[http/1.1]}{127.0.0.1:0}
   [junit4]   2> 112827 INFO  (TEST-ChaosMonkeyNothingIsSafeTest.test-seed#[DAEC39BD6416377F]) [    ] o.e.j.s.h.ContextHandler Stopped o.e.j.s.ServletContextHandler@6bbcb1d{/,null,UNAVAILABLE}
   [junit4]   2> 112828 INFO  (TEST-ChaosMonkeyNothingIsSafeTest.test-seed#[DAEC39BD6416377F]) [    ] o.a.s.c.ZkTestServer connecting to 127.0.0.1:35379 35379
   [junit4]   2> 112830 INFO  (Thread-156) [    ] o.a.s.c.ZkTestServer connecting to 127.0.0.1:35379 35379
   [junit4]   2> 112830 WARN  (Thread-156) [    ] o.a.s.c.ZkTestServer Watch limit violations: 
   [junit4]   2> Maximum concurrent children watches above limit:
   [junit4]   2> 
   [junit4]   2> 	11	/solr/overseer/collection-queue-work
   [junit4]   2> 	4	/solr/overseer/queue
   [junit4]   2> 	4	/solr/overseer/queue-work
   [junit4]   2> 
   [junit4]   2> NOTE: reproduce with: ant test  -Dtestcase=ChaosMonkeyNothingIsSafeTest -Dtests.method=test -Dtests.seed=DAEC39BD6416377F -Dtests.multiplier=3 -Dtests.slow=true -Dtests.locale=it -Dtests.timezone=Etc/GMT-5 -Dtests.asserts=true -Dtests.file.encoding=ISO-8859-1
   [junit4] FAILURE 47.4s J1 | ChaosMonkeyNothingIsSafeTest.test <<<
   [junit4]    > Throwable #1: java.lang.AssertionError: document count mismatch.  control=601 sum(shards)=600 cloudClient=600
   [junit4]    > 	at __randomizedtesting.SeedInfo.seed([DAEC39BD6416377F:52B80667CAEA5A87]:0)
   [junit4]    > 	at org.apache.solr.cloud.AbstractFullDistribZkTestBase.checkShardConsistency(AbstractFullDistribZkTestBase.java:1323)
   [junit4]    > 	at org.apache.solr.cloud.ChaosMonkeyNothingIsSafeTest.test(ChaosMonkeyNothingIsSafeTest.java:228)
   [junit4]    > 	at org.apache.solr.BaseDistributedSearchTestCase$ShardsRepeatRule$ShardsFixedStatement.callStatement(BaseDistributedSearchTestCase.java:992)
   [junit4]    > 	at org.apache.solr.BaseDistributedSearchTestCase$ShardsRepeatRule$ShardsStatement.evaluate(BaseDistributedSearchTestCase.java:967)
   [junit4]    > 	at java.lang.Thread.run(Thread.java:745)
   [junit4]   2> 112834 INFO  (SUITE-ChaosMonkeyNothingIsSafeTest-seed#[DAEC39BD6416377F]-worker) [    ] o.a.s.SolrTestCaseJ4 ###deleteCore
   [junit4]   2> NOTE: leaving temporary files on disk at: /home/jenkins/workspace/Lucene-Solr-6.2-Linux/solr/build/solr-core/test/J1/temp/solr.cloud.ChaosMonkeyNothingIsSafeTest_DAEC39BD6416377F-001
   [junit4]   2> Sep 18, 2016 10:09:12 PM com.carrotsearch.randomizedtesting.ThreadLeakControl checkThreadLeaks
   [junit4]   2> WARNING: Will linger awaiting termination of 1 leaked thread(s).
   [junit4]   2> NOTE: test params are: codec=Asserting(Lucene62): {rnd_b=BlockTreeOrds(blocksize=128), _version_=PostingsFormat(name=Memory doPackFST= false), a_t=PostingsFormat(name=Memory doPackFST= false), a_i=BlockTreeOrds(blocksize=128), id=BlockTreeOrds(blocksize=128)}, docValues:{}, maxPointsInLeafNode=1849, maxMBSortInHeap=7.21007421945322, sim=RandomSimilarity(queryNorm=true,coord=yes): {}, locale=it, timezone=Etc/GMT-5
   [junit4]   2> NOTE: Linux 4.4.0-36-generic amd64/Oracle Corporation 1.8.0_102 (64-bit)/cpus=12,threads=1,free=144698264,total=408420352
   [junit4]   2> NOTE: All tests run in this JVM: [FastVectorHighlighterTest, TestSQLHandler, IndexBasedSpellCheckerTest, IgnoreCommitOptimizeUpdateProcessorFactoryTest, TestTolerantUpdateProcessorCloud, ChaosMonkeyNothingIsSafeTest]
   [junit4] Completed [42/629 (1!)] on J1 in 47.90s, 1 test, 1 failure <<< FAILURES!

[...truncated 62043 lines...]