You are viewing a plain text version of this content. The canonical link for it is here.
Posted to dev@sling.apache.org by Apache Jenkins Server <je...@builds.apache.org> on 2022/03/28 11:22:34 UTC
[Jenkins] Sling » Modules » sling-org-apache-sling-launchpad-testing » master #999 is BROKEN
Please see https://ci-builds.apache.org/job/Sling/job/modules/job/sling-org-apache-sling-launchpad-testing/job/master/999/ for details.
No further emails will be sent until the status of the build is changed.
Build log follows below:
[...truncated 595 lines...]
at junit.framework.Assert.fail(Assert.java:57)
at junit.framework.Assert.failNotEquals(Assert.java:329)
at junit.framework.Assert.assertEquals(Assert.java:78)
at junit.framework.Assert.assertEquals(Assert.java:234)
at junit.framework.TestCase.assertEquals(TestCase.java:377)
at org.apache.sling.commons.testing.integration.HttpTestBase.getContent(HttpTestBase.java:457)
at org.apache.sling.launchpad.webapp.integrationtest.servlets.post.PostSendErrorTest.testNotSuccessfulWithHtmlResponseAndSendError(PostSendErrorTest.java:48)
at sun.reflect.NativeMethodAccessorImpl.invoke0(Native Method)
at sun.reflect.NativeMethodAccessorImpl.invoke(NativeMethodAccessorImpl.java:62)
at sun.reflect.DelegatingMethodAccessorImpl.invoke(DelegatingMethodAccessorImpl.java:43)
at java.lang.reflect.Method.invoke(Method.java:498)
at junit.framework.TestCase.runTest(TestCase.java:177)
at junit.framework.TestCase.runBare(TestCase.java:142)
at junit.framework.TestResult$1.protect(TestResult.java:122)
at junit.framework.TestResult.runProtected(TestResult.java:142)
at junit.framework.TestResult.run(TestResult.java:125)
at junit.framework.TestCase.run(TestCase.java:130)
at junit.framework.TestSuite.runTest(TestSuite.java:241)
at junit.framework.TestSuite.run(TestSuite.java:236)
at org.junit.internal.runners.JUnit38ClassRunner.run(JUnit38ClassRunner.java:90)
at org.apache.maven.surefire.junit4.JUnit4Provider.execute(JUnit4Provider.java:365)
at org.apache.maven.surefire.junit4.JUnit4Provider.executeWithRerun(JUnit4Provider.java:273)
at org.apache.maven.surefire.junit4.JUnit4Provider.executeTestSet(JUnit4Provider.java:238)
at org.apache.maven.surefire.junit4.JUnit4Provider.invoke(JUnit4Provider.java:159)
at org.apache.maven.surefire.booter.ForkedBooter.invokeProviderInSameClassLoader(ForkedBooter.java:379)
at org.apache.maven.surefire.booter.ForkedBooter.runSuitesInProcess(ForkedBooter.java:340)
at org.apache.maven.surefire.booter.ForkedBooter.execute(ForkedBooter.java:125)
at org.apache.maven.surefire.booter.ForkedBooter.main(ForkedBooter.java:413)
[INFO] Running org.apache.sling.launchpad.webapp.integrationtest.teleporter.ServicesPresentTest
[INFO] Tests run: 1, Failures: 0, Errors: 0, Skipped: 0, Time elapsed: 0.144 s - in org.apache.sling.launchpad.webapp.integrationtest.teleporter.ServicesPresentTest
[INFO] Running org.apache.sling.launchpad.webapp.integrationtest.FiltersTest
[INFO] Tests run: 1, Failures: 0, Errors: 0, Skipped: 0, Time elapsed: 0.006 s - in org.apache.sling.launchpad.webapp.integrationtest.FiltersTest
[INFO] Running org.apache.sling.launchpad.webapp.integrationtest.xml.XPathTest
[INFO] Tests run: 1, Failures: 0, Errors: 0, Skipped: 0, Time elapsed: 0.036 s - in org.apache.sling.launchpad.webapp.integrationtest.xml.XPathTest
[INFO] Running org.apache.sling.launchpad.webapp.integrationtest.PostRedirectTest
[INFO] Tests run: 7, Failures: 0, Errors: 0, Skipped: 0, Time elapsed: 0.072 s - in org.apache.sling.launchpad.webapp.integrationtest.PostRedirectTest
[INFO] Running org.apache.sling.launchpad.webapp.integrationtest.NodeTypeBasedRenderingTest
[INFO] Tests run: 7, Failures: 0, Errors: 0, Skipped: 0, Time elapsed: 0.943 s - in org.apache.sling.launchpad.webapp.integrationtest.NodeTypeBasedRenderingTest
[INFO] Running org.apache.sling.launchpad.webapp.integrationtest.xml.SaxTest
[INFO] Tests run: 1, Failures: 0, Errors: 0, Skipped: 0, Time elapsed: 0.006 s - in org.apache.sling.launchpad.webapp.integrationtest.xml.SaxTest
[INFO] Running org.apache.sling.launchpad.webapp.jsp.TagFileTest
[INFO] Tests run: 1, Failures: 0, Errors: 0, Skipped: 0, Time elapsed: 0.224 s - in org.apache.sling.launchpad.webapp.jsp.TagFileTest
[INFO] Running org.apache.sling.launchpad.webapp.integrationtest.servlets.post.PostServletMoveTest
[INFO] Tests run: 15, Failures: 0, Errors: 0, Skipped: 0, Time elapsed: 1.297 s - in org.apache.sling.launchpad.webapp.integrationtest.servlets.post.PostServletMoveTest
[INFO] Running org.apache.sling.launchpad.webapp.integrationtest.servlets.post.PostServletOutputContentTypeTest
[INFO] Tests run: 6, Failures: 0, Errors: 0, Skipped: 0, Time elapsed: 0.096 s - in org.apache.sling.launchpad.webapp.integrationtest.servlets.post.PostServletOutputContentTypeTest
[INFO] Running org.apache.sling.launchpad.webapp.integrationtest.EspLoadTest
[INFO] Tests run: 2, Failures: 0, Errors: 0, Skipped: 0, Time elapsed: 0.254 s - in org.apache.sling.launchpad.webapp.integrationtest.EspLoadTest
[INFO] Running org.apache.sling.launchpad.webapp.integrationtest.SyntheticResourceTest
[INFO] Tests run: 1, Failures: 0, Errors: 0, Skipped: 0, Time elapsed: 0.057 s - in org.apache.sling.launchpad.webapp.integrationtest.SyntheticResourceTest
[INFO] Running org.apache.sling.launchpad.webapp.integrationtest.RangeStreamingTest
[INFO] Tests run: 4, Failures: 0, Errors: 0, Skipped: 0, Time elapsed: 0.299 s - in org.apache.sling.launchpad.webapp.integrationtest.RangeStreamingTest
[INFO] Running org.apache.sling.launchpad.webapp.integrationtest.servlets.resolver.errorhandler.ErrorHandlingTest
[INFO] Tests run: 11, Failures: 0, Errors: 0, Skipped: 0, Time elapsed: 3.628 s - in org.apache.sling.launchpad.webapp.integrationtest.servlets.resolver.errorhandler.ErrorHandlingTest
[INFO] Running org.apache.sling.launchpad.webapp.integrationtest.servlets.post.PostServletPatchTest
[INFO] Tests run: 4, Failures: 0, Errors: 0, Skipped: 0, Time elapsed: 0.14 s - in org.apache.sling.launchpad.webapp.integrationtest.servlets.post.PostServletPatchTest
[INFO] Running org.apache.sling.launchpad.webapp.integrationtest.NodetypeRenderingTest
[INFO] Tests run: 7, Failures: 0, Errors: 0, Skipped: 0, Time elapsed: 0.477 s - in org.apache.sling.launchpad.webapp.integrationtest.NodetypeRenderingTest
[INFO] Running org.apache.sling.launchpad.webapp.integrationtest.teleporter.TeleporterOptionsTest
[INFO] Tests run: 1, Failures: 0, Errors: 0, Skipped: 0, Time elapsed: 0 s - in org.apache.sling.launchpad.webapp.integrationtest.teleporter.TeleporterOptionsTest
[INFO] Running org.apache.sling.launchpad.webapp.integrationtest.WebDavDoubleSlashTest
[INFO] Tests run: 2, Failures: 0, Errors: 0, Skipped: 0, Time elapsed: 0.078 s - in org.apache.sling.launchpad.webapp.integrationtest.WebDavDoubleSlashTest
[INFO] Running org.apache.sling.launchpad.webapp.integrationtest.GeneratedNodeNameTest
[INFO] Tests run: 6, Failures: 0, Errors: 0, Skipped: 0, Time elapsed: 0.186 s - in org.apache.sling.launchpad.webapp.integrationtest.GeneratedNodeNameTest
[INFO] Running org.apache.sling.launchpad.webapp.integrationtest.MkdirTest
[INFO] Tests run: 2, Failures: 0, Errors: 0, Skipped: 0, Time elapsed: 0.132 s - in org.apache.sling.launchpad.webapp.integrationtest.MkdirTest
[INFO] Running org.apache.sling.launchpad.webapp.integrationtest.ServerSideScriptsTest
[INFO] Tests run: 1, Failures: 0, Errors: 0, Skipped: 0, Time elapsed: 2.326 s - in org.apache.sling.launchpad.webapp.integrationtest.ServerSideScriptsTest
[INFO] Running org.apache.sling.launchpad.webapp.integrationtest.servlets.R6WhiteboardServletTest
[INFO] Tests run: 1, Failures: 0, Errors: 0, Skipped: 0, Time elapsed: 0.004 s - in org.apache.sling.launchpad.webapp.integrationtest.servlets.R6WhiteboardServletTest
[INFO] Running org.apache.sling.launchpad.webapp.integrationtest.servlets.post.PostServletCopyTest
[INFO] Tests run: 16, Failures: 0, Errors: 0, Skipped: 0, Time elapsed: 1.064 s - in org.apache.sling.launchpad.webapp.integrationtest.servlets.post.PostServletCopyTest
[INFO] Running org.apache.sling.launchpad.webapp.integrationtest.ExportedPackagesTest
[INFO] Tests run: 3, Failures: 0, Errors: 0, Skipped: 0, Time elapsed: 0.02 s - in org.apache.sling.launchpad.webapp.integrationtest.ExportedPackagesTest
[INFO] Running org.apache.sling.launchpad.webapp.integrationtest.repository.RepositoryInitializersTest
[INFO] Tests run: 1, Failures: 0, Errors: 0, Skipped: 0, Time elapsed: 0.007 s - in org.apache.sling.launchpad.webapp.integrationtest.repository.RepositoryInitializersTest
[INFO] Running org.apache.sling.launchpad.webapp.integrationtest.ValueFromTest
[INFO] Tests run: 3, Failures: 0, Errors: 0, Skipped: 0, Time elapsed: 0.073 s - in org.apache.sling.launchpad.webapp.integrationtest.ValueFromTest
[INFO] Running org.apache.sling.launchpad.webapp.integrationtest.MiscUnsafeTest
[INFO] Tests run: 1, Failures: 0, Errors: 0, Skipped: 0, Time elapsed: 0.012 s - in org.apache.sling.launchpad.webapp.integrationtest.MiscUnsafeTest
[INFO] Running org.apache.sling.launchpad.webapp.integrationtest.UploadFileTest
[INFO] Tests run: 4, Failures: 0, Errors: 0, Skipped: 0, Time elapsed: 0.232 s - in org.apache.sling.launchpad.webapp.integrationtest.UploadFileTest
[INFO] Running org.apache.sling.launchpad.webapp.integrationtest.ForwardTest
[INFO] Tests run: 5, Failures: 0, Errors: 0, Skipped: 0, Time elapsed: 1.783 s - in org.apache.sling.launchpad.webapp.integrationtest.ForwardTest
[INFO] Running org.apache.sling.launchpad.webapp.integrationtest.MappingEventsProxyTest
[INFO] Tests run: 1, Failures: 0, Errors: 0, Skipped: 0, Time elapsed: 8.597 s - in org.apache.sling.launchpad.webapp.integrationtest.MappingEventsProxyTest
[INFO] Running org.apache.sling.launchpad.webapp.integrationtest.servlets.HeadServletTest
[INFO] Tests run: 6, Failures: 0, Errors: 0, Skipped: 0, Time elapsed: 0.05 s - in org.apache.sling.launchpad.webapp.integrationtest.servlets.HeadServletTest
[INFO] Running org.apache.sling.launchpad.webapp.integrationtest.servlets.post.PostServletPrivilegesUpdateTest
[WARNING] Tests run: 1, Failures: 0, Errors: 0, Skipped: 1, Time elapsed: 0 s - in org.apache.sling.launchpad.webapp.integrationtest.servlets.post.PostServletPrivilegesUpdateTest
[INFO] Running org.apache.sling.launchpad.webapp.integrationtest.servlets.post.PostResponseCreatorTest
[INFO] Tests run: 1, Failures: 0, Errors: 0, Skipped: 0, Time elapsed: 0.011 s - in org.apache.sling.launchpad.webapp.integrationtest.servlets.post.PostResponseCreatorTest
[INFO] Running org.apache.sling.launchpad.webapp.integrationtest.teleporter.LdapFilterTeleporterTest
[INFO] Tests run: 2, Failures: 0, Errors: 0, Skipped: 0, Time elapsed: 0.371 s - in org.apache.sling.launchpad.webapp.integrationtest.teleporter.LdapFilterTeleporterTest
[INFO] Running org.apache.sling.launchpad.webapp.integrationtest.RequestAttributeTest
[INFO] Tests run: 1, Failures: 0, Errors: 0, Skipped: 0, Time elapsed: 0.179 s - in org.apache.sling.launchpad.webapp.integrationtest.RequestAttributeTest
[INFO] Running org.apache.sling.launchpad.webapp.integrationtest.resourceresolver.ResourceResolverApiTest
[INFO] Tests run: 8, Failures: 0, Errors: 0, Skipped: 0, Time elapsed: 1.375 s - in org.apache.sling.launchpad.webapp.integrationtest.resourceresolver.ResourceResolverApiTest
[INFO] Running org.apache.sling.launchpad.webapp.integrationtest.login.RedirectOnLogoutTest
[ERROR] Tests run: 1, Failures: 1, Errors: 0, Skipped: 0, Time elapsed: 0.016 s <<< FAILURE! - in org.apache.sling.launchpad.webapp.integrationtest.login.RedirectOnLogoutTest
[ERROR] testRedirectToResourceAfterLogout(org.apache.sling.launchpad.webapp.integrationtest.login.RedirectOnLogoutTest) Time elapsed: 0.016 s <<< FAILURE!
java.lang.AssertionError: Expected redirect expected:<302> but was:<401>
at org.junit.Assert.fail(Assert.java:89)
at org.junit.Assert.failNotEquals(Assert.java:835)
at org.junit.Assert.assertEquals(Assert.java:647)
at org.apache.sling.launchpad.webapp.integrationtest.login.RedirectOnLogoutTest.testRedirectToResourceAfterLogout(RedirectOnLogoutTest.java:70)
at sun.reflect.NativeMethodAccessorImpl.invoke0(Native Method)
at sun.reflect.NativeMethodAccessorImpl.invoke(NativeMethodAccessorImpl.java:62)
at sun.reflect.DelegatingMethodAccessorImpl.invoke(DelegatingMethodAccessorImpl.java:43)
at java.lang.reflect.Method.invoke(Method.java:498)
at org.junit.runners.model.FrameworkMethod$1.runReflectiveCall(FrameworkMethod.java:59)
at org.junit.internal.runners.model.ReflectiveCallable.run(ReflectiveCallable.java:12)
at org.junit.runners.model.FrameworkMethod.invokeExplosively(FrameworkMethod.java:56)
at org.junit.internal.runners.statements.InvokeMethod.evaluate(InvokeMethod.java:17)
at org.junit.internal.runners.statements.RunBefores.evaluate(RunBefores.java:26)
at org.junit.internal.runners.statements.RunAfters.evaluate(RunAfters.java:27)
at org.junit.runners.ParentRunner$3.evaluate(ParentRunner.java:306)
at org.junit.runners.BlockJUnit4ClassRunner$1.evaluate(BlockJUnit4ClassRunner.java:100)
at org.junit.runners.ParentRunner.runLeaf(ParentRunner.java:366)
at org.junit.runners.BlockJUnit4ClassRunner.runChild(BlockJUnit4ClassRunner.java:103)
at org.junit.runners.BlockJUnit4ClassRunner.runChild(BlockJUnit4ClassRunner.java:63)
at org.junit.runners.ParentRunner$4.run(ParentRunner.java:331)
at org.junit.runners.ParentRunner$1.schedule(ParentRunner.java:79)
at org.junit.runners.ParentRunner.runChildren(ParentRunner.java:329)
at org.junit.runners.ParentRunner.access$100(ParentRunner.java:66)
at org.junit.runners.ParentRunner$2.evaluate(ParentRunner.java:293)
at org.junit.runners.ParentRunner$3.evaluate(ParentRunner.java:306)
at org.junit.runners.ParentRunner.run(ParentRunner.java:413)
at org.apache.maven.surefire.junit4.JUnit4Provider.execute(JUnit4Provider.java:365)
at org.apache.maven.surefire.junit4.JUnit4Provider.executeWithRerun(JUnit4Provider.java:273)
at org.apache.maven.surefire.junit4.JUnit4Provider.executeTestSet(JUnit4Provider.java:238)
at org.apache.maven.surefire.junit4.JUnit4Provider.invoke(JUnit4Provider.java:159)
at org.apache.maven.surefire.booter.ForkedBooter.invokeProviderInSameClassLoader(ForkedBooter.java:379)
at org.apache.maven.surefire.booter.ForkedBooter.runSuitesInProcess(ForkedBooter.java:340)
at org.apache.maven.surefire.booter.ForkedBooter.execute(ForkedBooter.java:125)
at org.apache.maven.surefire.booter.ForkedBooter.main(ForkedBooter.java:413)
[INFO] Running org.apache.sling.launchpad.webapp.integrationtest.SlingWebDavServletTest
[INFO] Tests run: 2, Failures: 0, Errors: 0, Skipped: 0, Time elapsed: 0.175 s - in org.apache.sling.launchpad.webapp.integrationtest.SlingWebDavServletTest
[INFO] Running org.apache.sling.launchpad.webapp.integrationtest.servlets.post.PostServletCreateTest
[INFO] Tests run: 16, Failures: 0, Errors: 0, Skipped: 0, Time elapsed: 0.301 s - in org.apache.sling.launchpad.webapp.integrationtest.servlets.post.PostServletCreateTest
[INFO] Running org.apache.sling.launchpad.webapp.integrationtest.servlets.post.PostServletVersionableTest
[INFO] Tests run: 26, Failures: 0, Errors: 0, Skipped: 0, Time elapsed: 2.155 s - in org.apache.sling.launchpad.webapp.integrationtest.servlets.post.PostServletVersionableTest
[INFO] Running org.apache.sling.launchpad.webapp.integrationtest.servlets.post.SlingSessionInfoTest
[INFO] Tests run: 2, Failures: 0, Errors: 0, Skipped: 0, Time elapsed: 0.016 s - in org.apache.sling.launchpad.webapp.integrationtest.servlets.post.SlingSessionInfoTest
[INFO] Running org.apache.sling.launchpad.webapp.integrationtest.servlets.resolution.RequestUriOptingServletTest
[INFO] Tests run: 4, Failures: 0, Errors: 0, Skipped: 0, Time elapsed: 0.444 s - in org.apache.sling.launchpad.webapp.integrationtest.servlets.resolution.RequestUriOptingServletTest
[INFO] Running org.apache.sling.launchpad.webapp.integrationtest.JspForwardTest
[INFO] Tests run: 6, Failures: 0, Errors: 0, Skipped: 0, Time elapsed: 1.665 s - in org.apache.sling.launchpad.webapp.integrationtest.JspForwardTest
[INFO] Running org.apache.sling.launchpad.webapp.integrationtest.xml.DomTest
[INFO] Tests run: 1, Failures: 0, Errors: 0, Skipped: 0, Time elapsed: 0.006 s - in org.apache.sling.launchpad.webapp.integrationtest.xml.DomTest
[INFO] Running org.apache.sling.launchpad.webapp.integrationtest.VersionInfoServletTest
[INFO] Tests run: 3, Failures: 0, Errors: 0, Skipped: 0, Time elapsed: 3.202 s - in org.apache.sling.launchpad.webapp.integrationtest.VersionInfoServletTest
[INFO] Running org.apache.sling.launchpad.webapp.integrationtest.servlets.post.PostStatusTest
[INFO] Tests run: 4, Failures: 0, Errors: 0, Skipped: 0, Time elapsed: 0.045 s - in org.apache.sling.launchpad.webapp.integrationtest.servlets.post.PostStatusTest
[INFO] Running org.apache.sling.launchpad.webapp.integrationtest.servlets.post.PostServletAtMoveTest
[INFO] Tests run: 9, Failures: 0, Errors: 0, Skipped: 0, Time elapsed: 0.42 s - in org.apache.sling.launchpad.webapp.integrationtest.servlets.post.PostServletAtMoveTest
[INFO] Running org.apache.sling.launchpad.webapp.integrationtest.RedirectTest
[INFO] Tests run: 6, Failures: 0, Errors: 0, Skipped: 0, Time elapsed: 0.146 s - in org.apache.sling.launchpad.webapp.integrationtest.RedirectTest
[INFO] Running org.apache.sling.launchpad.webapp.integrationtest.BundleContentTest
[INFO] Tests run: 4, Failures: 0, Errors: 0, Skipped: 0, Time elapsed: 0.035 s - in org.apache.sling.launchpad.webapp.integrationtest.BundleContentTest
[INFO] Running org.apache.sling.launchpad.webapp.integrationtest.StreamServletTest
[INFO] Tests run: 4, Failures: 0, Errors: 0, Skipped: 0, Time elapsed: 0.242 s - in org.apache.sling.launchpad.webapp.integrationtest.StreamServletTest
[INFO] Running org.apache.sling.launchpad.webapp.integrationtest.issues.SLING457Test
[INFO] Tests run: 2, Failures: 0, Errors: 0, Skipped: 0, Time elapsed: 0.276 s - in org.apache.sling.launchpad.webapp.integrationtest.issues.SLING457Test
[INFO] Running org.apache.sling.launchpad.webapp.integrationtest.servlets.resolution.ExtensionServletTest
[INFO] Tests run: 3, Failures: 0, Errors: 0, Skipped: 0, Time elapsed: 0.258 s - in org.apache.sling.launchpad.webapp.integrationtest.servlets.resolution.ExtensionServletTest
[INFO] Running org.apache.sling.launchpad.webapp.integrationtest.indexing.FullTextIndexingTest
[INFO] Tests run: 3, Failures: 0, Errors: 0, Skipped: 0, Time elapsed: 15.179 s - in org.apache.sling.launchpad.webapp.integrationtest.indexing.FullTextIndexingTest
[INFO] Running org.apache.sling.launchpad.webapp.integrationtest.login.RedirectOnLoginErrorTest
[INFO] Tests run: 2, Failures: 0, Errors: 0, Skipped: 0, Time elapsed: 0.009 s - in org.apache.sling.launchpad.webapp.integrationtest.login.RedirectOnLoginErrorTest
[INFO]
[INFO] Results:
[INFO]
[ERROR] Failures:
[ERROR] AnonymousAccessTest.testAnonymousContent:99->assertContent:85 Expected status 200 for http://localhost:41000/ANON_CAN_READ/AnonymousAccessTest/d75bf49f-ba51-45d2-a249-80cfe0d7fab7/test_text_d75bf49f_b.txt (content=) expected:<200> but was:<401>
[ERROR] AnonymousAccessTest.testAnonymousContent:101 Expecting status 404 when testing outside of anonymous access subtree expected:<404> but was:<401>
[ERROR] AuthRequestLoginTest.testForcedLogin:40->HttpTestBase.getContent:419->HttpTestBase.getContent:424->HttpTestBase.getContent:432->HttpTestBase.getContent:457 Expected status 200 for http://localhost:41000/system/sling/info.sessionInfo.json (content=) expected:<200> but was:<401>
[ERROR] RedirectOnLogoutTest.testRedirectToResourceAfterLogout:70 Expected redirect expected:<302> but was:<401>
[ERROR] PostSendErrorTest.testNotSuccessfulWithHtmlResponseAndSendError:48->HttpTestBase.getContent:457 Expected status 500 for http://localhost:41000/PostSendErrorTest/1648466389603 (content=) expected:<500> but was:<401>
[ERROR] PostSendErrorTest.testNotSuccessfulWithJsonResponseAndSendError:88->HttpTestBase.getContent:457 Expected status 500 for http://localhost:41000/PostSendErrorTest/1648466389603 (content=) expected:<500> but was:<401>
[INFO]
[ERROR] Tests run: 566, Failures: 6, Errors: 0, Skipped: 1
[INFO]
[INFO]
[INFO] --- feature-launcher-maven-plugin:0.1.2:stop (default) @ org.apache.sling.launchpad.testing ---
[INFO] Stopping launch with id sling-12-oak-tar
[DEBUG] [ServiceReference 1273 from bundle 117 : org.apache.sling.jcr.davex:1.3.10 ref=[javax.servlet.Servlet] properties={objectClass=[javax.servlet.Servlet], osgi.http.whiteboard.context.select=(osgi.http.whiteboard.context.name=DavExAuthHttpContext), osgi.http.whiteboard.servlet.pattern=/server/*, service.bundleid=117, service.description=Sling JcrRemoting Servlet, service.id=1273, service.scope=singleton, service.vendor=The Apache Software Foundation, servlet.init.createAbsoluteURI=true, servlet.init.csrf-protection=disabled, servlet.init.protectedhandlers-config=org.apache.jackrabbit.server.remoting.davex.AclRemoveHandler, servlet.init.resource-path-prefix=/server, sling.auth.requirements=-/server}] Ignoring unmatching Servlet service
[DEBUG] [ServiceReference 521 from bundle 133 : org.apache.sling.engine:2.8.0 ref=[javax.servlet.Filter] properties={component.id=227, component.name=org.apache.sling.engine.impl.log.RequestLoggerFilter, objectClass=[javax.servlet.Filter], osgi.ds.satisfying.condition.target=(osgi.condition.id=true), osgi.http.whiteboard.context.select=(osgi.http.whiteboard.context.name=org.apache.sling), osgi.http.whiteboard.filter.pattern=[/], service.bundleid=133, service.description=Request Logger Filter, service.id=521, service.ranking=32768, service.scope=bundle, service.vendor=The Apache Software Foundation}] Ignoring unmatching Filter service
[DEBUG] [ServiceReference 507 from bundle 133 : org.apache.sling.engine:2.8.0 ref=[javax.servlet.Servlet] properties={objectClass=[javax.servlet.Servlet], osgi.http.whiteboard.context.select=(osgi.http.whiteboard.context.name=org.apache.sling), osgi.http.whiteboard.servlet.name=ApacheSling/2.8, osgi.http.whiteboard.servlet.pattern=/, service.bundleid=133, service.description=Apache Sling Engine Main Servlet, service.id=507, service.scope=singleton, service.vendor=The Apache Software Foundation}] Ignoring unmatching Servlet service
[DEBUG] [ServiceReference 526 from bundle 133 : org.apache.sling.engine:2.8.0 ref=[javax.servlet.Filter] properties={component.id=228, component.name=org.apache.sling.engine.parameters, file.max=-1, file.threshold=256000, objectClass=[javax.servlet.Filter], osgi.ds.satisfying.condition.target=(osgi.condition.id=true), osgi.http.whiteboard.context.select=(osgi.http.whiteboard.context.name=org.apache.sling), osgi.http.whiteboard.filter.pattern=[/], request.max=-1, service.bundleid=133, service.description=Filter for request parameter support, service.id=526, service.ranking=2147483647, service.scope=bundle, service.vendor=The Apache Software Foundation, sling.default.max.parameters=10000, sling.default.parameter.checkForAdditionalContainerParameters=false, sling.default.parameter.encoding=ISO-8859-1}] Ignoring unmatching Filter service
[DEBUG] [ServiceReference 95 from bundle 39 : org.apache.sling.launchpad.test-services:13.0.0.SNAPSHOT ref=[javax.servlet.Servlet] properties={component.id=64, component.name=org.apache.sling.launchpad.testservices.servlets.R6WhiteboardServlet, objectClass=[javax.servlet.Servlet], osgi.ds.satisfying.condition.target=(osgi.condition.id=true), osgi.http.whiteboard.context.select=(osgi.http.whiteboard.context.name=org.apache.sling), osgi.http.whiteboard.servlet.pattern=/whiteboard_r6, service.bundleid=39, service.id=95, service.scope=bundle}] Ignoring unmatching Servlet service
[INFO] Apachde Felix Http Whiteboard Service stopped
[INFO] Stopped Jetty.
[INFO]
[INFO] --- tools-maven-plugin:1.4:verify-legal-files (verify-legal-files) @ org.apache.sling.launchpad.testing ---
[INFO] Checking legal files in: org.apache.sling.launchpad.testing-13-SNAPSHOT.jar
[INFO] Checking legal files in: org.apache.sling.launchpad.testing-13-SNAPSHOT-sources.jar
[INFO]
[INFO] --- apache-rat-plugin:0.13:check (rat-check) @ org.apache.sling.launchpad.testing ---
[INFO] Enabled default license matchers.
[INFO] Will parse SCM ignores for exclusions...
[INFO] Parsing exclusions from /home/jenkins/workspace/e-sling-launchpad-testing_master/.gitignore
[INFO] Finished adding exclusions from SCM ignore files.
[INFO] 75 implicit excludes (use -debug for more details).
[INFO] 13 explicit excludes (use -debug for more details).
[INFO] 4 resources included (use -debug for more details)
[INFO] Rat check: Summary over all files. Unapproved: 0, unknown: 0, generated: 0, approved: 3 licenses.
[INFO]
[INFO] --- maven-failsafe-plugin:2.21.0:verify (default) @ org.apache.sling.launchpad.testing ---
[INFO] ------------------------------------------------------------------------
[INFO] BUILD FAILURE
[INFO] ------------------------------------------------------------------------
[INFO] Total time: 03:18 min
[INFO] Finished at: 2022-03-28T11:20:42Z
[INFO] ------------------------------------------------------------------------
[INFO] [jenkins-event-spy] Generated /home/jenkins/workspace/e-sling-launchpad-testing_master@tmp/withMaven500a188a/maven-spy-20220328-111724-541483280533157602245.log
[ERROR] Failed to execute goal org.apache.maven.plugins:maven-failsafe-plugin:2.21.0:verify (default) on project org.apache.sling.launchpad.testing: There are test failures.
[ERROR]
[ERROR] Please refer to /home/jenkins/workspace/e-sling-launchpad-testing_master/target/failsafe-reports for the individual test results.
[ERROR] Please refer to dump files (if any exist) [date]-jvmRun[N].dump, [date].dumpstream and [date]-jvmRun[N].dumpstream.
[ERROR] -> [Help 1]
[ERROR]
[ERROR] To see the full stack trace of the errors, re-run Maven with the -e switch.
[ERROR] Re-run Maven using the -X switch to enable full debug logging.
[ERROR]
[ERROR] For more information about the errors and possible solutions, please read the following articles:
[ERROR] [Help 1] http://cwiki.apache.org/confluence/display/MAVEN/MojoFailureException
[Pipeline] }
[withMaven] junitPublisher - Archive test results for Maven artifact org.apache.sling:org.apache.sling.launchpad.testing:jar:13-SNAPSHOT generated by maven-surefire-plugin:test (default-test): target/surefire-reports/*.xml
Recording test results
None of the test reports contained any result
[withMaven] junitPublisher - Archive test results for Maven artifact org.apache.sling:org.apache.sling.launchpad.testing:jar:13-SNAPSHOT generated by maven-failsafe-plugin:integration-test (default): target/failsafe-reports/*.xml
Recording test results
No test report files were found. Configuration error?
[withMaven] Jenkins Task Scanner Plugin not found, don't display results of source code scanning for 'TODO' and 'FIXME' in pipeline screen.
[DevOpticsMavenPublisher] dependencies consumed: 93, artifacts produced: 0
[withMaven] Publishers: Pipeline Graph Publisher: 2 ms, Generated Artifacts Publisher: 344 ms, Junit Publisher: 72272 ms, Dependencies Fingerprint Publisher: 685 ms, Open Task Scanner Publisher: 2 ms, CloudBees DevOptics Gate Artifact Publisher: 33352 ms
[Pipeline] // withMaven
[Pipeline] }
[Pipeline] // stage
[Pipeline] }
[Pipeline] // timeout
[Pipeline] stage
[Pipeline] { (Notifications)
[Pipeline] echo
Status change is BROKEN, notifications will be sent.
[Pipeline] emailext
[Jenkins] Sling » Modules » sling-org-apache-sling-launchpad-testing » master #1000 is FIXED
Posted by Apache Jenkins Server <je...@builds.apache.org>.
Please see https://ci-builds.apache.org/job/Sling/job/modules/job/sling-org-apache-sling-launchpad-testing/job/master/1000/ for details.
No further emails will be sent until the status of the build is changed.