You are viewing a plain text version of this content. The canonical link for it is here.
Posted to builds@beam.apache.org by Apache Jenkins Server <je...@builds.apache.org> on 2020/12/01 07:22:22 UTC

Build failed in Jenkins: beam_PostCommit_Python38 #592

See <https://ci-beam.apache.org/job/beam_PostCommit_Python38/592/display/redirect?page=changes>

Changes:

[Boyuan Zhang] Revert "Add use_unified_worker to pipeline options."


------------------------------------------
[...truncated 37.82 MB...]
        "parallel_input": {
          "@type": "OutputReference",
          "output_name": "out",
          "step_name": "s1"
        },
        "serialized_fn": "ref_AppliedPTransform_ReadFromPubSub/Map(_from_proto_str)_4",
        "user_name": "ReadFromPubSub/Map(_from_proto_str)"
      }
    },
    {
      "kind": "ParallelDo",
      "name": "s3",
      "properties": {
        "display_data": [
          {
            "key": "fn",
            "label": "Transform Function",
            "namespace": "apache_beam.transforms.core.ParDo",
            "shortValue": "CallableWrapperDoFn",
            "type": "STRING",
            "value": "apache_beam.transforms.core.CallableWrapperDoFn"
          },
          {
            "key": "fn",
            "label": "Transform Function",
            "namespace": "apache_beam.transforms.core.CallableWrapperDoFn",
            "type": "STRING",
            "value": "add_attribute"
          }
        ],
        "non_parallel_inputs": {},
        "output_info": [
          {
            "encoding": {
              "@type": "kind:windowed_value",
              "component_encodings": [
                {
                  "@type": "FastPrimitivesCoder$eNprYJmaxgABPZKJBYnJGanxSamJuXrJ+SmpRcVQakqPsFticUlAUWZuZklmWWqxM0h4yuQpmo1Taqf08MenJebkJCUmZ8eD1U/JYOjhDshMzs5JRVGYVJykBwDOUCqY",
                  "component_encodings": [
                    {
                      "@type": "FastPrimitivesCoder$eNprYJmaxgABPZKJBYnJGanxSamJuXrJ+SmpRcVQakqPsFticUlAUWZuZklmWWqxM0h4yuQpmo1Taqf08MenJebkJCUmZ8eD1U/JYOjhDshMzs5JRVGYVJykBwDOUCqY",
                      "component_encodings": [],
                      "pipeline_proto_coder_id": "ref_Coder_FastPrimitivesCoder_3"
                    },
                    {
                      "@type": "FastPrimitivesCoder$eNprYJmaxgABPZKJBYnJGanxSamJuXrJ+SmpRcVQakqPsFticUlAUWZuZklmWWqxM0h4yuQpmo1Taqf08MenJebkJCUmZ8eD1U/JYOjhDshMzs5JRVGYVJykBwDOUCqY",
                      "component_encodings": [],
                      "pipeline_proto_coder_id": "ref_Coder_FastPrimitivesCoder_3"
                    }
                  ],
                  "is_pair_like": true,
                  "pipeline_proto_coder_id": "ref_Coder_FastPrimitivesCoder_3"
                },
                {
                  "@type": "kind:global_window"
                }
              ],
              "is_wrapper": true
            },
            "output_name": "None",
            "user_name": "add_attribute.out"
          }
        ],
        "parallel_input": {
          "@type": "OutputReference",
          "output_name": "None",
          "step_name": "s2"
        },
        "serialized_fn": "ref_AppliedPTransform_add_attribute_5",
        "user_name": "add_attribute"
      }
    },
    {
      "kind": "ParallelDo",
      "name": "s4",
      "properties": {
        "display_data": [
          {
            "key": "fn",
            "label": "Transform Function",
            "namespace": "apache_beam.transforms.core.ParDo",
            "shortValue": "CallableWrapperDoFn",
            "type": "STRING",
            "value": "apache_beam.transforms.core.CallableWrapperDoFn"
          },
          {
            "key": "fn",
            "label": "Transform Function",
            "namespace": "apache_beam.transforms.core.CallableWrapperDoFn",
            "type": "STRING",
            "value": "message_to_proto_str"
          }
        ],
        "non_parallel_inputs": {},
        "output_info": [
          {
            "encoding": {
              "@type": "kind:windowed_value",
              "component_encodings": [
                {
                  "@type": "kind:bytes"
                },
                {
                  "@type": "kind:global_window"
                }
              ],
              "is_wrapper": true
            },
            "output_name": "None",
            "user_name": "WriteToPubSub/ToProtobuf.out"
          }
        ],
        "parallel_input": {
          "@type": "OutputReference",
          "output_name": "None",
          "step_name": "s3"
        },
        "serialized_fn": "ref_AppliedPTransform_WriteToPubSub/ToProtobuf_7",
        "user_name": "WriteToPubSub/ToProtobuf"
      }
    },
    {
      "kind": "ParallelWrite",
      "name": "s5",
      "properties": {
        "display_data": [],
        "encoding": {
          "@type": "kind:windowed_value",
          "component_encodings": [
            {
              "@type": "kind:bytes"
            },
            {
              "@type": "kind:global_window"
            }
          ],
          "is_wrapper": true
        },
        "format": "pubsub",
        "parallel_input": {
          "@type": "OutputReference",
          "output_name": "None",
          "step_name": "s4"
        },
        "pubsub_id_label": "id",
        "pubsub_serialized_attributes_fn": "",
        "pubsub_timestamp_label": "timestamp",
        "pubsub_topic": "projects/apache-beam-testing/topics/psit_topic_output39268dac-e262-4a31-b589-da1f9906a4a7",
        "user_name": "WriteToPubSub/Write/NativeWrite"
      }
    }
  ],
  "type": "JOB_TYPE_STREAMING"
}
apache_beam.runners.dataflow.internal.apiclient: INFO: Create job: <Job
 createTime: '2020-12-01T06:59:33.195568Z'
 currentStateTime: '1970-01-01T00:00:00Z'
 id: '2020-11-30_22_59_32-13692024441556286584'
 location: 'us-central1'
 name: 'beamapp-jenkins-1201065922-293270'
 projectId: 'apache-beam-testing'
 stageStates: []
 startTime: '2020-12-01T06:59:33.195568Z'
 steps: []
 tempFiles: []
 type: TypeValueValuesEnum(JOB_TYPE_STREAMING, 2)>
apache_beam.runners.dataflow.internal.apiclient: INFO: Created job with id: [2020-11-30_22_59_32-13692024441556286584]
apache_beam.runners.dataflow.internal.apiclient: INFO: Submitted job: 2020-11-30_22_59_32-13692024441556286584
apache_beam.runners.dataflow.internal.apiclient: INFO: To access the Dataflow monitoring console, please navigate to https://console.cloud.google.com/dataflow/jobs/us-central1/2020-11-30_22_59_32-13692024441556286584?project=apache-beam-testing
apache_beam.runners.dataflow.dataflow_runner: INFO: Job 2020-11-30_22_59_32-13692024441556286584 is in state JOB_STATE_RUNNING
apache_beam.runners.dataflow.dataflow_runner: INFO: 2020-12-01T06:59:36.040Z: JOB_MESSAGE_BASIC: Worker configuration: n1-standard-4 in us-central1-b.
apache_beam.runners.dataflow.dataflow_runner: INFO: 2020-12-01T06:59:37.930Z: JOB_MESSAGE_DETAILED: Expanding SplittableParDo operations into optimizable parts.
apache_beam.runners.dataflow.dataflow_runner: INFO: 2020-12-01T06:59:37.943Z: JOB_MESSAGE_DETAILED: Expanding CollectionToSingleton operations into optimizable parts.
apache_beam.runners.dataflow.dataflow_runner: INFO: 2020-12-01T06:59:37.978Z: JOB_MESSAGE_DETAILED: Expanding CoGroupByKey operations into optimizable parts.
apache_beam.runners.dataflow.dataflow_runner: INFO: 2020-12-01T06:59:38.049Z: JOB_MESSAGE_DETAILED: Expanding SplittableProcessKeyed operations into optimizable parts.
apache_beam.runners.dataflow.dataflow_runner: INFO: 2020-12-01T06:59:38.052Z: JOB_MESSAGE_DETAILED: Expanding GroupByKey operations into streaming Read/Write steps
apache_beam.runners.dataflow.dataflow_runner: INFO: 2020-12-01T06:59:38.066Z: JOB_MESSAGE_DEBUG: Annotating graph with Autotuner information.
apache_beam.runners.dataflow.dataflow_runner: INFO: 2020-12-01T06:59:38.103Z: JOB_MESSAGE_DETAILED: Fusing adjacent ParDo, Read, Write, and Flatten operations
apache_beam.runners.dataflow.dataflow_runner: INFO: 2020-12-01T06:59:38.108Z: JOB_MESSAGE_DETAILED: Fusing consumer ReadFromPubSub/Map(_from_proto_str) into ReadFromPubSub/Read
apache_beam.runners.dataflow.dataflow_runner: INFO: 2020-12-01T06:59:38.115Z: JOB_MESSAGE_DETAILED: Fusing consumer add_attribute into ReadFromPubSub/Map(_from_proto_str)
apache_beam.runners.dataflow.dataflow_runner: INFO: 2020-12-01T06:59:38.125Z: JOB_MESSAGE_DETAILED: Fusing consumer WriteToPubSub/ToProtobuf into add_attribute
apache_beam.runners.dataflow.dataflow_runner: INFO: 2020-12-01T06:59:38.133Z: JOB_MESSAGE_DETAILED: Fusing consumer WriteToPubSub/Write/NativeWrite into WriteToPubSub/ToProtobuf
apache_beam.runners.dataflow.dataflow_runner: INFO: 2020-12-01T06:59:38.144Z: JOB_MESSAGE_BASIC: The pubsub read for: projects/apache-beam-testing/subscriptions/psit_subscription_input39268dac-e262-4a31-b589-da1f9906a4a7 is configured to compute input data watermarks based on custom timestamp attribute timestamp. Cloud Dataflow has created an additional tracking subscription to do this, which will be cleaned up automatically. For details, see: https://cloud.google.com/dataflow/model/pubsub-io#timestamps-ids
apache_beam.runners.dataflow.dataflow_runner: INFO: 2020-12-01T06:59:38.154Z: JOB_MESSAGE_DEBUG: Adding StepResource setup and teardown to workflow graph.
apache_beam.runners.dataflow.dataflow_runner: INFO: 2020-12-01T06:59:38.180Z: JOB_MESSAGE_DEBUG: Adding workflow start and stop steps.
apache_beam.runners.dataflow.dataflow_runner: INFO: 2020-12-01T06:59:38.200Z: JOB_MESSAGE_DEBUG: Assigning stage ids.
apache_beam.runners.dataflow.dataflow_runner: INFO: 2020-12-01T06:59:38.352Z: JOB_MESSAGE_DEBUG: Executing wait step start2
apache_beam.runners.dataflow.dataflow_runner: INFO: 2020-12-01T06:59:38.364Z: JOB_MESSAGE_DEBUG: Starting worker pool setup.
apache_beam.runners.dataflow.dataflow_runner: INFO: 2020-12-01T06:59:38.369Z: JOB_MESSAGE_BASIC: Starting 1 workers...
apache_beam.runners.dataflow.dataflow_runner: INFO: 2020-12-01T06:59:39.434Z: JOB_MESSAGE_DETAILED: Pub/Sub resources set up for topic 'projects/apache-beam-testing/topics/psit_topic_input39268dac-e262-4a31-b589-da1f9906a4a7'.
apache_beam.runners.dataflow.dataflow_runner: INFO: 2020-12-01T06:59:41.940Z: JOB_MESSAGE_BASIC: Executing operation ReadFromPubSub/Read+ReadFromPubSub/Map(_from_proto_str)+add_attribute+WriteToPubSub/ToProtobuf+WriteToPubSub/Write/NativeWrite
apache_beam.runners.dataflow.dataflow_runner: INFO: 2020-12-01T07:00:07.832Z: JOB_MESSAGE_BASIC: Your project already contains 100 Dataflow-created metric descriptors, so new user metrics of the form custom.googleapis.com/* will not be created. However, all user metrics are also available in the metric dataflow.googleapis.com/job/user_counter. If you rely on the custom metrics, you can delete old / unused metric descriptors. See https://developers.google.com/apis-explorer/#p/monitoring/v3/monitoring.projects.metricDescriptors.list and https://developers.google.com/apis-explorer/#p/monitoring/v3/monitoring.projects.metricDescriptors.delete
apache_beam.runners.dataflow.dataflow_runner: INFO: 2020-12-01T07:00:11.174Z: JOB_MESSAGE_DEBUG: Executing input step topology_init_attach_disk_input_step
apache_beam.runners.dataflow.dataflow_runner: INFO: 2020-12-01T07:00:11.643Z: JOB_MESSAGE_BASIC: Worker configuration: n1-standard-4 in us-central1-b.
apache_beam.runners.dataflow.dataflow_runner: INFO: 2020-12-01T07:00:34.030Z: JOB_MESSAGE_DETAILED: Workers have started successfully.
apache_beam.runners.dataflow.dataflow_runner: WARNING: Timing out on waiting for job 2020-11-30_22_59_32-13692024441556286584 after 182 seconds
google.auth._default: DEBUG: Checking None for explicit credentials as part of auth process...
google.auth._default: DEBUG: Checking Cloud SDK credentials as part of auth process...
google.auth._default: DEBUG: Cloud SDK credentials not found on disk; not using them
google.auth._default: DEBUG: Checking for App Engine runtime as part of auth process...
google.auth._default: DEBUG: No App Engine library was found so cannot authentication via App Engine Identity Credentials.
google.auth.transport._http_client: DEBUG: Making request: GET http://169.254.169.254
google.auth.transport._http_client: DEBUG: Making request: GET http://metadata.google.internal/computeMetadata/v1/project/project-id
google.auth.transport.requests: DEBUG: Making request: GET http://metadata.google.internal/computeMetadata/v1/instance/service-accounts/default/?recursive=true
urllib3.connectionpool: DEBUG: Starting new HTTP connection (1): metadata.google.internal:80
urllib3.connectionpool: DEBUG: http://metadata.google.internal:80 "GET /computeMetadata/v1/instance/service-accounts/default/?recursive=true HTTP/1.1" 200 144
google.auth.transport.requests: DEBUG: Making request: GET http://metadata.google.internal/computeMetadata/v1/instance/service-accounts/844138762903-compute@developer.gserviceaccount.com/token?scopes=https%3A%2F%2Fwww.googleapis.com%2Fauth%2Fcloud-platform%2Chttps%3A%2F%2Fwww.googleapis.com%2Fauth%2Fpubsub
urllib3.connectionpool: DEBUG: http://metadata.google.internal:80 "GET /computeMetadata/v1/instance/service-accounts/844138762903-compute@developer.gserviceaccount.com/token?scopes=https%3A%2F%2Fwww.googleapis.com%2Fauth%2Fcloud-platform%2Chttps%3A%2F%2Fwww.googleapis.com%2Fauth%2Fpubsub HTTP/1.1" 200 241
apache_beam.io.gcp.tests.pubsub_matcher: ERROR: Timeout after 300 sec. Received 0 messages from projects/apache-beam-testing/subscriptions/psit_subscription_output39268dac-e262-4a31-b589-da1f9906a4a7.
--------------------- >> end captured logging << ---------------------

----------------------------------------------------------------------
XML: nosetests-postCommitIT-df-py38.xml
----------------------------------------------------------------------
XML: <https://ci-beam.apache.org/job/beam_PostCommit_Python38/ws/src/sdks/python/nosetests.xml>
----------------------------------------------------------------------
Ran 68 tests in 4690.235s

FAILED (SKIP=7, failures=1)

> Task :sdks:python:test-suites:dataflow:py38:postCommitIT FAILED

FAILURE: Build failed with an exception.

* Where:
Script '<https://ci-beam.apache.org/job/beam_PostCommit_Python38/ws/src/sdks/python/test-suites/dataflow/common.gradle'> line: 118

* What went wrong:
Execution failed for task ':sdks:python:test-suites:dataflow:py38:postCommitIT'.
> Process 'command 'sh'' finished with non-zero exit value 1

* Try:
Run with --stacktrace option to get the stack trace. Run with --info or --debug option to get more log output. Run with --scan to get full insights.

* Get more help at https://help.gradle.org

Deprecated Gradle features were used in this build, making it incompatible with Gradle 7.0.
Use '--warning-mode all' to show the individual deprecation warnings.
See https://docs.gradle.org/6.7/userguide/command_line_interface.html#sec:command_line_warnings

BUILD FAILED in 1h 21m 51s
209 actionable tasks: 165 executed, 40 from cache, 4 up-to-date
Gradle was unable to watch the file system for changes. The inotify watches limit is too low.

Publishing build scan...
https://gradle.com/s/tmj5xxm3w2bym

Build step 'Invoke Gradle script' changed build result to FAILURE
Build step 'Invoke Gradle script' marked build as failure

---------------------------------------------------------------------
To unsubscribe, e-mail: builds-unsubscribe@beam.apache.org
For additional commands, e-mail: builds-help@beam.apache.org


Jenkins build is back to normal : beam_PostCommit_Python38 #599

Posted by Apache Jenkins Server <je...@builds.apache.org>.
See <https://ci-beam.apache.org/job/beam_PostCommit_Python38/599/display/redirect?page=changes>


---------------------------------------------------------------------
To unsubscribe, e-mail: builds-unsubscribe@beam.apache.org
For additional commands, e-mail: builds-help@beam.apache.org


Build failed in Jenkins: beam_PostCommit_Python38 #598

Posted by Apache Jenkins Server <je...@builds.apache.org>.
See <https://ci-beam.apache.org/job/beam_PostCommit_Python38/598/display/redirect?page=changes>

Changes:

[dennisylyung] [BEAM-11331] Change region flag to awsRegion in io.aws2

[zhaohaizhou940527] [BEAM-11365] Direct Runner: Handle pipeline option string quotes under

[ajamato] Add start_times to MonitoringInfos and populate them in the python SDK

[piotr.szuberski] [BEAM-11375] Downgrade Kafka clients dependency to fix Spark postcommit

[noreply] [BEAM-9980] use ALL_SUPPORTED_VERSIONS for constant

[noreply] [BEAM-11376] Ignoring DicomIOReadIT  (#13450)


------------------------------------------
[...truncated 36.77 MB...]
INFO:apache_beam.runners.dataflow.dataflow_runner:2020-12-02T19:10:41.342Z: JOB_MESSAGE_BASIC: Executing operation Type matches/Group/GroupByKey/Read+Type matches/Group/GroupByKey/GroupByWindow+Type matches/Group/Map(_merge_tagged_vals_under_key)+Type matches/Unkey+Type matches/Match
INFO:apache_beam.runners.dataflow.dataflow_runner:2020-12-02T19:10:50.662Z: JOB_MESSAGE_BASIC: Finished operation Type matches/Group/GroupByKey/Read+Type matches/Group/GroupByKey/GroupByWindow+Type matches/Group/Map(_merge_tagged_vals_under_key)+Type matches/Unkey+Type matches/Match
INFO:apache_beam.runners.dataflow.dataflow_runner:2020-12-02T19:10:50.741Z: JOB_MESSAGE_DEBUG: Executing success step success19
INFO:apache_beam.runners.dataflow.dataflow_runner:2020-12-02T19:10:50.832Z: JOB_MESSAGE_DETAILED: Cleaning up.
INFO:apache_beam.runners.dataflow.dataflow_runner:2020-12-02T19:10:50.875Z: JOB_MESSAGE_DEBUG: Starting worker pool teardown.
INFO:apache_beam.runners.dataflow.dataflow_runner:2020-12-02T19:10:50.914Z: JOB_MESSAGE_BASIC: Stopping worker pool...
INFO:apache_beam.runners.dataflow.dataflow_runner:2020-12-02T19:10:50.343Z: JOB_MESSAGE_BASIC: Finished operation read/ReadFromBigQuery/FilesToRemoveImpulse/Read+read/ReadFromBigQuery/MapFilesToRemove
INFO:apache_beam.runners.dataflow.dataflow_runner:2020-12-02T19:10:50.826Z: JOB_MESSAGE_DEBUG: Value "read/ReadFromBigQuery/MapFilesToRemove.out" materialized.
INFO:apache_beam.runners.dataflow.dataflow_runner:2020-12-02T19:10:51.374Z: JOB_MESSAGE_BASIC: Executing operation read/ReadFromBigQuery/_PassThroughThenCleanup/ParDo(RemoveExtractedFiles)/_UnpickledSideInput(MapFilesToRemove.out.0)
INFO:apache_beam.runners.dataflow.dataflow_runner:2020-12-02T19:10:51.559Z: JOB_MESSAGE_BASIC: Finished operation read/ReadFromBigQuery/_PassThroughThenCleanup/ParDo(RemoveExtractedFiles)/_UnpickledSideInput(MapFilesToRemove.out.0)
INFO:apache_beam.runners.dataflow.dataflow_runner:2020-12-02T19:10:51.886Z: JOB_MESSAGE_DEBUG: Value "read/ReadFromBigQuery/_PassThroughThenCleanup/ParDo(RemoveExtractedFiles)/_UnpickledSideInput(MapFilesToRemove.out.0).output" materialized.
INFO:apache_beam.runners.dataflow.dataflow_runner:2020-12-02T19:10:53.152Z: JOB_MESSAGE_BASIC: Executing BigQuery import job "dataflow_job_8076733569964926206". You can check its status with the bq tool: "bq show -j --project_id=apache-beam-testing dataflow_job_8076733569964926206".
INFO:apache_beam.runners.dataflow.dataflow_runner:2020-12-02T19:11:03.818Z: JOB_MESSAGE_BASIC: BigQuery import job "dataflow_job_8076733569964926206" done.
INFO:apache_beam.runners.dataflow.dataflow_runner:2020-12-02T19:11:04.607Z: JOB_MESSAGE_BASIC: Finished operation read/ReadFromBigQuery/Read+read/ReadFromBigQuery/_PassThroughThenCleanup/ParDo(PassThrough)/ParDo(PassThrough)+write/Write/NativeWrite
INFO:apache_beam.runners.dataflow.dataflow_runner:2020-12-02T19:11:04.694Z: JOB_MESSAGE_DEBUG: Value "read/ReadFromBigQuery/_PassThroughThenCleanup/ParDo(PassThrough)/ParDo(PassThrough).cleanup_signal" materialized.
INFO:apache_beam.runners.dataflow.dataflow_runner:2020-12-02T19:11:04.756Z: JOB_MESSAGE_BASIC: Executing operation read/ReadFromBigQuery/_PassThroughThenCleanup/ParDo(RemoveExtractedFiles)/_UnpickledSideInput(ParDo(PassThrough).cleanup_signal.0)
INFO:apache_beam.runners.dataflow.dataflow_runner:2020-12-02T19:11:04.813Z: JOB_MESSAGE_BASIC: Finished operation read/ReadFromBigQuery/_PassThroughThenCleanup/ParDo(RemoveExtractedFiles)/_UnpickledSideInput(ParDo(PassThrough).cleanup_signal.0)
INFO:apache_beam.runners.dataflow.dataflow_runner:2020-12-02T19:11:04.878Z: JOB_MESSAGE_DEBUG: Value "read/ReadFromBigQuery/_PassThroughThenCleanup/ParDo(RemoveExtractedFiles)/_UnpickledSideInput(ParDo(PassThrough).cleanup_signal.0).output" materialized.
INFO:apache_beam.runners.dataflow.dataflow_runner:2020-12-02T19:11:04.929Z: JOB_MESSAGE_BASIC: Executing operation read/ReadFromBigQuery/_PassThroughThenCleanup/Create/Read+read/ReadFromBigQuery/_PassThroughThenCleanup/ParDo(RemoveExtractedFiles)/ParDo(RemoveExtractedFiles)
INFO:apache_beam.runners.dataflow.dataflow_runner:2020-12-02T19:11:11.247Z: JOB_MESSAGE_BASIC: Finished operation read/ReadFromBigQuery/_PassThroughThenCleanup/Create/Read+read/ReadFromBigQuery/_PassThroughThenCleanup/ParDo(RemoveExtractedFiles)/ParDo(RemoveExtractedFiles)
INFO:apache_beam.runners.dataflow.dataflow_runner:2020-12-02T19:11:11.318Z: JOB_MESSAGE_DEBUG: Executing success step success3
INFO:apache_beam.runners.dataflow.dataflow_runner:2020-12-02T19:11:11.393Z: JOB_MESSAGE_DETAILED: Cleaning up.
INFO:apache_beam.runners.dataflow.dataflow_runner:2020-12-02T19:11:11.493Z: JOB_MESSAGE_DEBUG: Starting worker pool teardown.
INFO:apache_beam.runners.dataflow.dataflow_runner:2020-12-02T19:11:11.518Z: JOB_MESSAGE_BASIC: Stopping worker pool...
INFO:apache_beam.runners.dataflow.dataflow_runner:2020-12-02T19:11:23.222Z: JOB_MESSAGE_DETAILED: Autoscaling: Resized worker pool from 1 to 0.
INFO:apache_beam.runners.dataflow.dataflow_runner:2020-12-02T19:11:23.278Z: JOB_MESSAGE_BASIC: Worker pool stopped.
INFO:apache_beam.runners.dataflow.dataflow_runner:2020-12-02T19:11:23.309Z: JOB_MESSAGE_DEBUG: Tearing down pending resources...
INFO:apache_beam.runners.dataflow.dataflow_runner:Job 2020-12-02_11_03_57-15402641730293657996 is in state JOB_STATE_DONE
INFO:apache_beam.runners.dataflow.dataflow_runner:2020-12-02T19:11:43.496Z: JOB_MESSAGE_DETAILED: Autoscaling: Resized worker pool from 1 to 0.
INFO:apache_beam.runners.dataflow.dataflow_runner:2020-12-02T19:11:43.539Z: JOB_MESSAGE_BASIC: Worker pool stopped.
INFO:apache_beam.runners.dataflow.dataflow_runner:2020-12-02T19:11:43.576Z: JOB_MESSAGE_DEBUG: Tearing down pending resources...
INFO:apache_beam.runners.dataflow.dataflow_runner:Job 2020-12-02_11_04_05-9679646478128589707 is in state JOB_STATE_DONE
INFO:apache_beam.runners.dataflow.dataflow_runner:2020-12-02T19:11:53.777Z: JOB_MESSAGE_DETAILED: Autoscaling: Resized worker pool from 1 to 0.
INFO:apache_beam.runners.dataflow.dataflow_runner:2020-12-02T19:11:53.830Z: JOB_MESSAGE_BASIC: Worker pool stopped.
INFO:apache_beam.runners.dataflow.dataflow_runner:2020-12-02T19:11:53.851Z: JOB_MESSAGE_DEBUG: Tearing down pending resources...
INFO:apache_beam.runners.dataflow.dataflow_runner:Job 2020-12-02_11_04_14-11198382933040884627 is in state JOB_STATE_DONE
INFO:apache_beam.io.gcp.tests.bigquery_matcher:Attempting to perform query SELECT fruit from `python_query_to_table_16069358393295.output_table`; to BQ
DEBUG:google.auth._default:Checking None for explicit credentials as part of auth process...
DEBUG:google.auth._default:Checking Cloud SDK credentials as part of auth process...
DEBUG:google.auth._default:Cloud SDK credentials not found on disk; not using them
DEBUG:google.auth._default:Checking for App Engine runtime as part of auth process...
DEBUG:google.auth._default:No App Engine library was found so cannot authentication via App Engine Identity Credentials.
DEBUG:google.auth.transport._http_client:Making request: GET http://169.254.169.254
DEBUG:google.auth.transport._http_client:Making request: GET http://metadata.google.internal/computeMetadata/v1/project/project-id
DEBUG:urllib3.util.retry:Converted retries value: 3 -> Retry(total=3, connect=None, read=None, redirect=None, status=None)
DEBUG:google.auth.transport.requests:Making request: GET http://metadata.google.internal/computeMetadata/v1/instance/service-accounts/default/?recursive=true
DEBUG:urllib3.connectionpool:Starting new HTTP connection (1): metadata.google.internal:80
DEBUG:urllib3.connectionpool:http://metadata.google.internal:80 "GET /computeMetadata/v1/instance/service-accounts/default/?recursive=true HTTP/1.1" 200 144
DEBUG:google.auth.transport.requests:Making request: GET http://metadata.google.internal/computeMetadata/v1/instance/service-accounts/844138762903-compute@developer.gserviceaccount.com/token?scopes=https%3A%2F%2Fwww.googleapis.com%2Fauth%2Fbigquery%2Chttps%3A%2F%2Fwww.googleapis.com%2Fauth%2Fcloud-platform
DEBUG:urllib3.connectionpool:http://metadata.google.internal:80 "GET /computeMetadata/v1/instance/service-accounts/844138762903-compute@developer.gserviceaccount.com/token?scopes=https%3A%2F%2Fwww.googleapis.com%2Fauth%2Fbigquery%2Chttps%3A%2F%2Fwww.googleapis.com%2Fauth%2Fcloud-platform HTTP/1.1" 200 241
DEBUG:urllib3.connectionpool:Starting new HTTPS connection (1): bigquery.googleapis.com:443
DEBUG:urllib3.connectionpool:https://bigquery.googleapis.com:443 "POST /bigquery/v2/projects/apache-beam-testing/jobs?prettyPrint=false HTTP/1.1" 200 None
DEBUG:urllib3.connectionpool:https://bigquery.googleapis.com:443 "GET /bigquery/v2/projects/apache-beam-testing/queries/61279f66-78a0-4e5d-ae81-cd0d004446f1?maxResults=0&location=US&prettyPrint=false HTTP/1.1" 200 None
DEBUG:urllib3.connectionpool:https://bigquery.googleapis.com:443 "GET /bigquery/v2/projects/apache-beam-testing/datasets/_7357fab0f784d2a7327ddbe81cdd1f4ca7e429cd/tables/anone9f64fad38757c267954b6a1e0727914129ff8f5/data?prettyPrint=false HTTP/1.1" 200 None
INFO:apache_beam.io.gcp.tests.bigquery_matcher:Read from given query (SELECT fruit from `python_query_to_table_16069358393295.output_table`;), total rows 2
INFO:apache_beam.io.gcp.tests.bigquery_matcher:Generate checksum: 158a8ea1c254fcf40d4ed3e7c0242c3ea0a29e72
INFO:apache_beam.runners.dataflow.dataflow_runner:2020-12-02T19:12:32.487Z: JOB_MESSAGE_BASIC: Finished operation Create/Read+metrics+map_to_common_key+GroupByKey/Reify+GroupByKey/Write
INFO:apache_beam.runners.dataflow.dataflow_runner:2020-12-02T19:12:32.552Z: JOB_MESSAGE_BASIC: Executing operation GroupByKey/Close
INFO:apache_beam.runners.dataflow.dataflow_runner:2020-12-02T19:12:32.599Z: JOB_MESSAGE_BASIC: Finished operation GroupByKey/Close
INFO:apache_beam.runners.dataflow.dataflow_runner:2020-12-02T19:12:32.668Z: JOB_MESSAGE_BASIC: Executing operation GroupByKey/Read+GroupByKey/GroupByWindow+m_out
INFO:apache_beam.runners.dataflow.dataflow_runner:2020-12-02T19:12:41.824Z: JOB_MESSAGE_BASIC: Finished operation GroupByKey/Read+GroupByKey/GroupByWindow+m_out
INFO:apache_beam.runners.dataflow.dataflow_runner:2020-12-02T19:12:41.894Z: JOB_MESSAGE_DEBUG: Executing success step success11
INFO:apache_beam.runners.dataflow.dataflow_runner:2020-12-02T19:12:41.997Z: JOB_MESSAGE_DETAILED: Cleaning up.
INFO:apache_beam.runners.dataflow.dataflow_runner:2020-12-02T19:12:42.045Z: JOB_MESSAGE_DEBUG: Starting worker pool teardown.
INFO:apache_beam.runners.dataflow.dataflow_runner:2020-12-02T19:12:42.079Z: JOB_MESSAGE_BASIC: Stopping worker pool...
INFO:apache_beam.runners.dataflow.dataflow_runner:2020-12-02T19:13:23.887Z: JOB_MESSAGE_DETAILED: Autoscaling: Resized worker pool from 1 to 0.
INFO:apache_beam.runners.dataflow.dataflow_runner:2020-12-02T19:13:23.931Z: JOB_MESSAGE_BASIC: Worker pool stopped.
INFO:apache_beam.runners.dataflow.dataflow_runner:2020-12-02T19:13:23.960Z: JOB_MESSAGE_DEBUG: Tearing down pending resources...
INFO:apache_beam.runners.dataflow.dataflow_runner:Job 2020-12-02_11_06_20-861341779782219450 is in state JOB_STATE_DONE
test_autocomplete_it (apache_beam.examples.complete.autocomplete_test.AutocompleteTest) ... ok
test_bigquery_tornadoes_it (apache_beam.examples.cookbook.bigquery_tornadoes_it_test.BigqueryTornadoesIT) ... ok
test_streaming_wordcount_debugging_it (apache_beam.examples.streaming_wordcount_debugging_it_test.StreamingWordcountDebuggingIT) ... SKIP: Skipped due to [BEAM-3377]: assert_that not working for streaming
test_datastore_wordcount_it (apache_beam.examples.cookbook.datastore_wordcount_it_test.DatastoreWordCountIT) ... ok
test_leader_board_it (apache_beam.examples.complete.game.leader_board_it_test.LeaderBoardIT) ... ok
test_run_example_with_setup_file (apache_beam.examples.complete.juliaset.juliaset.juliaset_test_it.JuliaSetTestIT) ... ok
test_game_stats_it (apache_beam.examples.complete.game.game_stats_it_test.GameStatsIT) ... ok
test_streaming_wordcount_it (apache_beam.examples.streaming_wordcount_it_test.StreamingWordCountIT) ... ok
ERROR
test_wordcount_fnapi_it (apache_beam.examples.wordcount_it_test.WordCountIT) ... ok
test_hourly_team_score_it (apache_beam.examples.complete.game.hourly_team_score_it_test.HourlyTeamScoreIT) ... ok
test_user_score_it (apache_beam.examples.complete.game.user_score_it_test.UserScoreIT) ... ok
test_wordcount_it (apache_beam.examples.wordcount_it_test.WordCountIT) ... ok
test_avro_it (apache_beam.examples.fastavro_it_test.FastavroIT) ... ok
test_read_queries (apache_beam.io.gcp.bigquery_read_it_test.ReadAllBQTests) ... ok
test_read_via_sql (apache_beam.io.gcp.experimental.spannerio_read_it_test.SpannerReadIntegrationTest) ... ok
test_read_via_table (apache_beam.io.gcp.experimental.spannerio_read_it_test.SpannerReadIntegrationTest) ... ok
test_bigquery_read_1M_python (apache_beam.io.gcp.bigquery_io_read_it_test.BigqueryIOReadIT) ... ok
test_bigquery_read_custom_1M_python (apache_beam.io.gcp.bigquery_io_read_it_test.BigqueryIOReadIT) ... ok
test_bqfl_streaming (apache_beam.io.gcp.bigquery_file_loads_test.BigQueryFileLoadsIT) ... SKIP: TestStream is not supported on TestDataflowRunner
test_multiple_destinations_transform (apache_beam.io.gcp.bigquery_file_loads_test.BigQueryFileLoadsIT) ... ok
test_one_job_fails_all_jobs_fail (apache_beam.io.gcp.bigquery_file_loads_test.BigQueryFileLoadsIT) ... ok
test_iobase_source (apache_beam.io.gcp.bigquery_read_it_test.ReadNewTypesTests) ... ok
test_native_source (apache_beam.io.gcp.bigquery_read_it_test.ReadNewTypesTests) ... ok
test_avro_file_load (apache_beam.io.gcp.bigquery_test.BigQueryFileLoadsIntegrationTests) ... ok
test_multiple_destinations_transform (apache_beam.io.gcp.bigquery_test.BigQueryStreamingInsertTransformIntegrationTests) ... ok
test_copy (apache_beam.io.gcp.gcsio_integration_test.GcsIOIntegrationTest) ... ok
test_copy_batch (apache_beam.io.gcp.gcsio_integration_test.GcsIOIntegrationTest) ... ok
test_copy_batch_kms (apache_beam.io.gcp.gcsio_integration_test.GcsIOIntegrationTest) ... ok
test_copy_batch_rewrite_token (apache_beam.io.gcp.gcsio_integration_test.GcsIOIntegrationTest) ... ok
test_copy_kms (apache_beam.io.gcp.gcsio_integration_test.GcsIOIntegrationTest) ... ok
test_copy_rewrite_token (apache_beam.io.gcp.gcsio_integration_test.GcsIOIntegrationTest) ... ok
test_value_provider_transform (apache_beam.io.gcp.bigquery_test.BigQueryStreamingInsertTransformIntegrationTests) ... ok
test_iobase_source (apache_beam.io.gcp.bigquery_read_it_test.ReadTests) ... ok
test_native_source (apache_beam.io.gcp.bigquery_read_it_test.ReadTests) ... ok
test_transform_on_gcs (apache_beam.io.fileio_test.MatchIntegrationTest) ... ok
test_dicom_search_instances (apache_beam.io.gcp.dicomio_integration_test.DICOMIoIntegrationTest) ... ok
test_dicom_store_instance_from_gcs (apache_beam.io.gcp.dicomio_integration_test.DICOMIoIntegrationTest) ... ok
test_datastore_write_limit (apache_beam.io.gcp.datastore.v1new.datastore_write_it_test.DatastoreWriteIT) ... ok
test_parquetio_it (apache_beam.io.parquetio_it_test.TestParquetIT) ... ok
test_streaming_data_only (apache_beam.io.gcp.pubsub_integration_test.PubSubIntegrationTest) ... ok
test_streaming_with_attributes (apache_beam.io.gcp.pubsub_integration_test.PubSubIntegrationTest) ... ok
test_file_loads (apache_beam.io.gcp.bigquery_test.PubSubBigQueryIT) ... SKIP: https://issuetracker.google.com/issues/118375066
test_streaming_inserts (apache_beam.io.gcp.bigquery_test.PubSubBigQueryIT) ... ok
test_text_detection_with_language_hint (apache_beam.ml.gcp.visionml_test_it.VisionMlTestIT) ... ok
test_big_query_write (apache_beam.io.gcp.bigquery_write_it_test.BigQueryWriteIntegrationTests) ... ok
test_big_query_write_new_types (apache_beam.io.gcp.bigquery_write_it_test.BigQueryWriteIntegrationTests) ... ok
test_big_query_write_schema_autodetect (apache_beam.io.gcp.bigquery_write_it_test.BigQueryWriteIntegrationTests) ... SKIP: DataflowRunner does not support schema autodetection
test_big_query_write_without_schema (apache_beam.io.gcp.bigquery_write_it_test.BigQueryWriteIntegrationTests) ... ok
test_basic_execution (apache_beam.testing.test_stream_it_test.TestStreamIntegrationTests) ... SKIP: The "TestDataflowRunner", does not support the TestStream transform. Supported runners: ['DirectRunner', 'SwitchingDirectRunner']
Tests that the TestStream supports emitting to multiple PCollections. ... SKIP: The "TestDataflowRunner", does not support the TestStream transform. Supported runners: ['DirectRunner', 'SwitchingDirectRunner']
Tests that the TestStream can independently control output watermarks. ... SKIP: The "TestDataflowRunner", does not support the TestStream transform. Supported runners: ['DirectRunner', 'SwitchingDirectRunner']
test_analyzing_syntax (apache_beam.ml.gcp.naturallanguageml_test_it.NaturalLanguageMlTestIT) ... ok
test_label_detection_with_video_context (apache_beam.ml.gcp.videointelligenceml_test_it.VideoIntelligenceMlTestIT) ... ok
Runs streaming Dataflow job and verifies that user metrics are reported ... ok
test_job_python_from_python_it (apache_beam.transforms.external_it_test.ExternalTransformIT) ... ok
test_deidentification (apache_beam.ml.gcp.cloud_dlp_it_test.CloudDLPIT) ... ok
test_inspection (apache_beam.ml.gcp.cloud_dlp_it_test.CloudDLPIT) ... ok
test_big_query_legacy_sql (apache_beam.io.gcp.big_query_query_to_table_it_test.BigQueryQueryToTableIT) ... ok
test_big_query_new_types (apache_beam.io.gcp.big_query_query_to_table_it_test.BigQueryQueryToTableIT) ... ok
test_big_query_new_types_avro (apache_beam.io.gcp.big_query_query_to_table_it_test.BigQueryQueryToTableIT) ... ok
test_big_query_new_types_native (apache_beam.io.gcp.big_query_query_to_table_it_test.BigQueryQueryToTableIT) ... ok
test_big_query_standard_sql (apache_beam.io.gcp.big_query_query_to_table_it_test.BigQueryQueryToTableIT) ... ok
test_big_query_standard_sql_kms_key_native (apache_beam.io.gcp.big_query_query_to_table_it_test.BigQueryQueryToTableIT) ... ok
test_metrics_fnapi_it (apache_beam.runners.dataflow.dataflow_exercise_metrics_pipeline_test.ExerciseMetricsPipelineTest) ... ok
test_metrics_it (apache_beam.runners.dataflow.dataflow_exercise_metrics_pipeline_test.ExerciseMetricsPipelineTest) ... ok

======================================================================
ERROR: test suite for <class 'apache_beam.io.gcp.experimental.spannerio_write_it_test.SpannerWriteIntegrationTest'>
----------------------------------------------------------------------
Traceback (most recent call last):
  File "<https://ci-beam.apache.org/job/beam_PostCommit_Python38/ws/src/build/gradleenv/-1734967051/lib/python3.8/site-packages/nose/plugins/multiprocess.py",> line 788, in run
    self.setUp()
  File "<https://ci-beam.apache.org/job/beam_PostCommit_Python38/ws/src/build/gradleenv/-1734967051/lib/python3.8/site-packages/nose/suite.py",> line 293, in setUp
    self.setupContext(ancestor)
  File "<https://ci-beam.apache.org/job/beam_PostCommit_Python38/ws/src/build/gradleenv/-1734967051/lib/python3.8/site-packages/nose/plugins/multiprocess.py",> line 770, in setupContext
    super(NoSharedFixtureContextSuite, self).setupContext(context)
  File "<https://ci-beam.apache.org/job/beam_PostCommit_Python38/ws/src/build/gradleenv/-1734967051/lib/python3.8/site-packages/nose/suite.py",> line 316, in setupContext
    try_run(context, names)
  File "<https://ci-beam.apache.org/job/beam_PostCommit_Python38/ws/src/build/gradleenv/-1734967051/lib/python3.8/site-packages/nose/util.py",> line 471, in try_run
    return func()
  File "<https://ci-beam.apache.org/job/beam_PostCommit_Python38/ws/src/sdks/python/apache_beam/io/gcp/experimental/spannerio_write_it_test.py",> line 105, in setUpClass
    cls._create_database()
  File "<https://ci-beam.apache.org/job/beam_PostCommit_Python38/ws/src/sdks/python/apache_beam/io/gcp/experimental/spannerio_write_it_test.py",> line 73, in _create_database
    operation = database.create()
  File "<https://ci-beam.apache.org/job/beam_PostCommit_Python38/ws/src/build/gradleenv/-1734967051/lib/python3.8/site-packages/google/cloud/spanner_v1/database.py",> line 268, in create
    future = api.create_database(
  File "<https://ci-beam.apache.org/job/beam_PostCommit_Python38/ws/src/build/gradleenv/-1734967051/lib/python3.8/site-packages/google/cloud/spanner_admin_database_v1/gapic/database_admin_client.py",> line 333, in create_database
    operation = self._inner_api_calls["create_database"](
  File "<https://ci-beam.apache.org/job/beam_PostCommit_Python38/ws/src/build/gradleenv/-1734967051/lib/python3.8/site-packages/google/api_core/gapic_v1/method.py",> line 145, in __call__
    return wrapped_func(*args, **kwargs)
  File "<https://ci-beam.apache.org/job/beam_PostCommit_Python38/ws/src/build/gradleenv/-1734967051/lib/python3.8/site-packages/google/api_core/retry.py",> line 281, in retry_wrapped_func
    return retry_target(
  File "<https://ci-beam.apache.org/job/beam_PostCommit_Python38/ws/src/build/gradleenv/-1734967051/lib/python3.8/site-packages/google/api_core/retry.py",> line 184, in retry_target
    return target()
  File "<https://ci-beam.apache.org/job/beam_PostCommit_Python38/ws/src/build/gradleenv/-1734967051/lib/python3.8/site-packages/google/api_core/timeout.py",> line 214, in func_with_timeout
    return func(*args, **kwargs)
  File "<https://ci-beam.apache.org/job/beam_PostCommit_Python38/ws/src/build/gradleenv/-1734967051/lib/python3.8/site-packages/google/api_core/grpc_helpers.py",> line 59, in error_remapped_callable
    six.raise_from(exceptions.from_grpc_error(exc), exc)
  File "<string>", line 3, in raise_from
google.api_core.exceptions.ResourceExhausted: 429 The instance projects/apache-beam-testing/instances/beam-test has too many database splits to complete the operation.  Please add more nodes and try again.
-------------------- >> begin captured logging << --------------------
apache_beam.io.gcp.experimental.spannerio_write_it_test: INFO: .... Setting up!
google.auth._default: DEBUG: Checking None for explicit credentials as part of auth process...
google.auth._default: DEBUG: Checking Cloud SDK credentials as part of auth process...
google.auth._default: DEBUG: Cloud SDK credentials not found on disk; not using them
google.auth._default: DEBUG: Checking for App Engine runtime as part of auth process...
google.auth._default: DEBUG: No App Engine library was found so cannot authentication via App Engine Identity Credentials.
google.auth.transport._http_client: DEBUG: Making request: GET http://169.254.169.254
google.auth.transport._http_client: DEBUG: Making request: GET http://metadata.google.internal/computeMetadata/v1/project/project-id
google.auth._default: DEBUG: Checking None for explicit credentials as part of auth process...
google.auth._default: DEBUG: Checking Cloud SDK credentials as part of auth process...
google.auth._default: DEBUG: Cloud SDK credentials not found on disk; not using them
google.auth._default: DEBUG: Checking for App Engine runtime as part of auth process...
google.auth._default: DEBUG: No App Engine library was found so cannot authentication via App Engine Identity Credentials.
google.auth.transport._http_client: DEBUG: Making request: GET http://169.254.169.254
google.auth.transport._http_client: DEBUG: Making request: GET http://metadata.google.internal/computeMetadata/v1/project/project-id
apache_beam.io.gcp.experimental.spannerio_write_it_test: INFO: .... Spanner Client created!
apache_beam.io.gcp.experimental.spannerio_write_it_test: INFO: Creating test database: pybeam-write-bdc3d81a4ab5c7f
google.auth.transport.requests: DEBUG: Making request: GET http://metadata.google.internal/computeMetadata/v1/instance/service-accounts/default/?recursive=true
urllib3.connectionpool: DEBUG: Starting new HTTP connection (1): metadata.google.internal:80
urllib3.connectionpool: DEBUG: http://metadata.google.internal:80 "GET /computeMetadata/v1/instance/service-accounts/default/?recursive=true HTTP/1.1" 200 144
google.auth.transport.requests: DEBUG: Making request: GET http://metadata.google.internal/computeMetadata/v1/instance/service-accounts/844138762903-compute@developer.gserviceaccount.com/token?scopes=https%3A%2F%2Fwww.googleapis.com%2Fauth%2Fspanner.admin
urllib3.connectionpool: DEBUG: http://metadata.google.internal:80 "GET /computeMetadata/v1/instance/service-accounts/844138762903-compute@developer.gserviceaccount.com/token?scopes=https%3A%2F%2Fwww.googleapis.com%2Fauth%2Fspanner.admin HTTP/1.1" 200 241
--------------------- >> end captured logging << ---------------------

----------------------------------------------------------------------
XML: nosetests-postCommitIT-df-py38.xml
----------------------------------------------------------------------
XML: <https://ci-beam.apache.org/job/beam_PostCommit_Python38/ws/src/sdks/python/nosetests.xml>
----------------------------------------------------------------------
Ran 65 tests in 4199.007s

FAILED (SKIP=7, errors=1)

> Task :sdks:python:test-suites:dataflow:py38:postCommitIT FAILED

FAILURE: Build completed with 2 failures.

1: Task failed with an exception.
-----------
* Where:
Script '<https://ci-beam.apache.org/job/beam_PostCommit_Python38/ws/src/sdks/python/test-suites/direct/common.gradle'> line: 55

* What went wrong:
Execution failed for task ':sdks:python:test-suites:direct:py38:postCommitIT'.
> Process 'command 'sh'' finished with non-zero exit value 1

* Try:
Run with --stacktrace option to get the stack trace. Run with --info or --debug option to get more log output. Run with --scan to get full insights.
==============================================================================

2: Task failed with an exception.
-----------
* Where:
Script '<https://ci-beam.apache.org/job/beam_PostCommit_Python38/ws/src/sdks/python/test-suites/dataflow/common.gradle'> line: 118

* What went wrong:
Execution failed for task ':sdks:python:test-suites:dataflow:py38:postCommitIT'.
> Process 'command 'sh'' finished with non-zero exit value 1

* Try:
Run with --stacktrace option to get the stack trace. Run with --info or --debug option to get more log output. Run with --scan to get full insights.
==============================================================================

* Get more help at https://help.gradle.org

Deprecated Gradle features were used in this build, making it incompatible with Gradle 7.0.
Use '--warning-mode all' to show the individual deprecation warnings.
See https://docs.gradle.org/6.7/userguide/command_line_interface.html#sec:command_line_warnings

BUILD FAILED in 1h 13m 16s
209 actionable tasks: 182 executed, 23 from cache, 4 up-to-date
Gradle was unable to watch the file system for changes. The inotify watches limit is too low.

Publishing build scan...
https://gradle.com/s/7mk7gnqlp6xqg

Build step 'Invoke Gradle script' changed build result to FAILURE
Build step 'Invoke Gradle script' marked build as failure

---------------------------------------------------------------------
To unsubscribe, e-mail: builds-unsubscribe@beam.apache.org
For additional commands, e-mail: builds-help@beam.apache.org


Build failed in Jenkins: beam_PostCommit_Python38 #597

Posted by Apache Jenkins Server <je...@builds.apache.org>.
See <https://ci-beam.apache.org/job/beam_PostCommit_Python38/597/display/redirect>

Changes:


------------------------------------------
[...truncated 36.62 MB...]
test_avro_it (apache_beam.examples.fastavro_it_test.FastavroIT) ... ok
test_bigquery_read_1M_python (apache_beam.io.gcp.bigquery_io_read_it_test.BigqueryIOReadIT) ... ok
test_bigquery_read_custom_1M_python (apache_beam.io.gcp.bigquery_io_read_it_test.BigqueryIOReadIT) ... ok
test_bqfl_streaming (apache_beam.io.gcp.bigquery_file_loads_test.BigQueryFileLoadsIT) ... SKIP: TestStream is not supported on TestDataflowRunner
test_multiple_destinations_transform (apache_beam.io.gcp.bigquery_file_loads_test.BigQueryFileLoadsIT) ... ok
test_one_job_fails_all_jobs_fail (apache_beam.io.gcp.bigquery_file_loads_test.BigQueryFileLoadsIT) ... ok
test_iobase_source (apache_beam.io.gcp.bigquery_read_it_test.ReadNewTypesTests) ... ok
test_native_source (apache_beam.io.gcp.bigquery_read_it_test.ReadNewTypesTests) ... ok
test_avro_file_load (apache_beam.io.gcp.bigquery_test.BigQueryFileLoadsIntegrationTests) ... ok
test_multiple_destinations_transform (apache_beam.io.gcp.bigquery_test.BigQueryStreamingInsertTransformIntegrationTests) ... ok
test_iobase_source (apache_beam.io.gcp.bigquery_read_it_test.ReadTests) ... ok
test_native_source (apache_beam.io.gcp.bigquery_read_it_test.ReadTests) ... ok
test_copy (apache_beam.io.gcp.gcsio_integration_test.GcsIOIntegrationTest) ... ok
test_copy_batch (apache_beam.io.gcp.gcsio_integration_test.GcsIOIntegrationTest) ... ok
test_copy_batch_kms (apache_beam.io.gcp.gcsio_integration_test.GcsIOIntegrationTest) ... ok
test_copy_batch_rewrite_token (apache_beam.io.gcp.gcsio_integration_test.GcsIOIntegrationTest) ... ok
test_copy_kms (apache_beam.io.gcp.gcsio_integration_test.GcsIOIntegrationTest) ... ok
test_copy_rewrite_token (apache_beam.io.gcp.gcsio_integration_test.GcsIOIntegrationTest) ... ok
test_value_provider_transform (apache_beam.io.gcp.bigquery_test.BigQueryStreamingInsertTransformIntegrationTests) ... ok
test_transform_on_gcs (apache_beam.io.fileio_test.MatchIntegrationTest) ... ok
test_parquetio_it (apache_beam.io.parquetio_it_test.TestParquetIT) ... ok
test_streaming_data_only (apache_beam.io.gcp.pubsub_integration_test.PubSubIntegrationTest) ... ok
test_streaming_with_attributes (apache_beam.io.gcp.pubsub_integration_test.PubSubIntegrationTest) ... ok
test_dicom_search_instances (apache_beam.io.gcp.dicomio_integration_test.DICOMIoIntegrationTest) ... ok
test_dicom_store_instance_from_gcs (apache_beam.io.gcp.dicomio_integration_test.DICOMIoIntegrationTest) ... ok
test_file_loads (apache_beam.io.gcp.bigquery_test.PubSubBigQueryIT) ... SKIP: https://issuetracker.google.com/issues/118375066
test_streaming_inserts (apache_beam.io.gcp.bigquery_test.PubSubBigQueryIT) ... ok
test_datastore_write_limit (apache_beam.io.gcp.datastore.v1new.datastore_write_it_test.DatastoreWriteIT) ... ok
test_analyzing_syntax (apache_beam.ml.gcp.naturallanguageml_test_it.NaturalLanguageMlTestIT) ... ok
test_text_detection_with_language_hint (apache_beam.ml.gcp.visionml_test_it.VisionMlTestIT) ... ok
test_basic_execution (apache_beam.testing.test_stream_it_test.TestStreamIntegrationTests) ... SKIP: The "TestDataflowRunner", does not support the TestStream transform. Supported runners: ['DirectRunner', 'SwitchingDirectRunner']
Tests that the TestStream supports emitting to multiple PCollections. ... SKIP: The "TestDataflowRunner", does not support the TestStream transform. Supported runners: ['DirectRunner', 'SwitchingDirectRunner']
Tests that the TestStream can independently control output watermarks. ... SKIP: The "TestDataflowRunner", does not support the TestStream transform. Supported runners: ['DirectRunner', 'SwitchingDirectRunner']
test_label_detection_with_video_context (apache_beam.ml.gcp.videointelligenceml_test_it.VideoIntelligenceMlTestIT) ... ok
test_big_query_write (apache_beam.io.gcp.bigquery_write_it_test.BigQueryWriteIntegrationTests) ... ok
test_big_query_write_new_types (apache_beam.io.gcp.bigquery_write_it_test.BigQueryWriteIntegrationTests) ... ok
test_big_query_write_schema_autodetect (apache_beam.io.gcp.bigquery_write_it_test.BigQueryWriteIntegrationTests) ... SKIP: DataflowRunner does not support schema autodetection
test_big_query_write_without_schema (apache_beam.io.gcp.bigquery_write_it_test.BigQueryWriteIntegrationTests) ... ok
Runs streaming Dataflow job and verifies that user metrics are reported ... ok
test_deidentification (apache_beam.ml.gcp.cloud_dlp_it_test.CloudDLPIT) ... ok
test_inspection (apache_beam.ml.gcp.cloud_dlp_it_test.CloudDLPIT) ... ok
test_big_query_legacy_sql (apache_beam.io.gcp.big_query_query_to_table_it_test.BigQueryQueryToTableIT) ... ok
test_big_query_new_types (apache_beam.io.gcp.big_query_query_to_table_it_test.BigQueryQueryToTableIT) ... ok
test_big_query_new_types_avro (apache_beam.io.gcp.big_query_query_to_table_it_test.BigQueryQueryToTableIT) ... ok
test_big_query_new_types_native (apache_beam.io.gcp.big_query_query_to_table_it_test.BigQueryQueryToTableIT) ... ok
test_big_query_standard_sql (apache_beam.io.gcp.big_query_query_to_table_it_test.BigQueryQueryToTableIT) ... ok
test_big_query_standard_sql_kms_key_native (apache_beam.io.gcp.big_query_query_to_table_it_test.BigQueryQueryToTableIT) ... ok
test_job_python_from_python_it (apache_beam.transforms.external_it_test.ExternalTransformIT) ... ok
test_metrics_fnapi_it (apache_beam.runners.dataflow.dataflow_exercise_metrics_pipeline_test.ExerciseMetricsPipelineTest) ... ok
test_metrics_it (apache_beam.runners.dataflow.dataflow_exercise_metrics_pipeline_test.ExerciseMetricsPipelineTest) ... ok

======================================================================
ERROR: test suite for <class 'apache_beam.io.gcp.experimental.spannerio_read_it_test.SpannerReadIntegrationTest'>
----------------------------------------------------------------------
Traceback (most recent call last):
  File "<https://ci-beam.apache.org/job/beam_PostCommit_Python38/ws/src/build/gradleenv/-1734967051/lib/python3.8/site-packages/nose/plugins/multiprocess.py",> line 788, in run
    self.setUp()
  File "<https://ci-beam.apache.org/job/beam_PostCommit_Python38/ws/src/build/gradleenv/-1734967051/lib/python3.8/site-packages/nose/suite.py",> line 293, in setUp
    self.setupContext(ancestor)
  File "<https://ci-beam.apache.org/job/beam_PostCommit_Python38/ws/src/build/gradleenv/-1734967051/lib/python3.8/site-packages/nose/plugins/multiprocess.py",> line 770, in setupContext
    super(NoSharedFixtureContextSuite, self).setupContext(context)
  File "<https://ci-beam.apache.org/job/beam_PostCommit_Python38/ws/src/build/gradleenv/-1734967051/lib/python3.8/site-packages/nose/suite.py",> line 316, in setupContext
    try_run(context, names)
  File "<https://ci-beam.apache.org/job/beam_PostCommit_Python38/ws/src/build/gradleenv/-1734967051/lib/python3.8/site-packages/nose/util.py",> line 471, in try_run
    return func()
  File "<https://ci-beam.apache.org/job/beam_PostCommit_Python38/ws/src/sdks/python/apache_beam/io/gcp/experimental/spannerio_read_it_test.py",> line 102, in setUpClass
    cls._create_database()
  File "<https://ci-beam.apache.org/job/beam_PostCommit_Python38/ws/src/sdks/python/apache_beam/io/gcp/experimental/spannerio_read_it_test.py",> line 76, in _create_database
    operation = database.create()
  File "<https://ci-beam.apache.org/job/beam_PostCommit_Python38/ws/src/build/gradleenv/-1734967051/lib/python3.8/site-packages/google/cloud/spanner_v1/database.py",> line 268, in create
    future = api.create_database(
  File "<https://ci-beam.apache.org/job/beam_PostCommit_Python38/ws/src/build/gradleenv/-1734967051/lib/python3.8/site-packages/google/cloud/spanner_admin_database_v1/gapic/database_admin_client.py",> line 333, in create_database
    operation = self._inner_api_calls["create_database"](
  File "<https://ci-beam.apache.org/job/beam_PostCommit_Python38/ws/src/build/gradleenv/-1734967051/lib/python3.8/site-packages/google/api_core/gapic_v1/method.py",> line 145, in __call__
    return wrapped_func(*args, **kwargs)
  File "<https://ci-beam.apache.org/job/beam_PostCommit_Python38/ws/src/build/gradleenv/-1734967051/lib/python3.8/site-packages/google/api_core/retry.py",> line 281, in retry_wrapped_func
    return retry_target(
  File "<https://ci-beam.apache.org/job/beam_PostCommit_Python38/ws/src/build/gradleenv/-1734967051/lib/python3.8/site-packages/google/api_core/retry.py",> line 184, in retry_target
    return target()
  File "<https://ci-beam.apache.org/job/beam_PostCommit_Python38/ws/src/build/gradleenv/-1734967051/lib/python3.8/site-packages/google/api_core/timeout.py",> line 214, in func_with_timeout
    return func(*args, **kwargs)
  File "<https://ci-beam.apache.org/job/beam_PostCommit_Python38/ws/src/build/gradleenv/-1734967051/lib/python3.8/site-packages/google/api_core/grpc_helpers.py",> line 59, in error_remapped_callable
    six.raise_from(exceptions.from_grpc_error(exc), exc)
  File "<string>", line 3, in raise_from
google.api_core.exceptions.ResourceExhausted: 429 The instance projects/apache-beam-testing/instances/beam-test has too many database splits to complete the operation.  Please add more nodes and try again.
-------------------- >> begin captured logging << --------------------
apache_beam.io.gcp.experimental.spannerio_read_it_test: INFO: .... PyVersion ---> 3.8.5 (default, Jul 20 2020, 19:50:14) 
[GCC 5.4.0 20160609]
apache_beam.io.gcp.experimental.spannerio_read_it_test: INFO: .... Setting up!
google.auth._default: DEBUG: Checking None for explicit credentials as part of auth process...
google.auth._default: DEBUG: Checking Cloud SDK credentials as part of auth process...
google.auth._default: DEBUG: Cloud SDK credentials not found on disk; not using them
google.auth._default: DEBUG: Checking for App Engine runtime as part of auth process...
google.auth._default: DEBUG: No App Engine library was found so cannot authentication via App Engine Identity Credentials.
google.auth.transport._http_client: DEBUG: Making request: GET http://169.254.169.254
google.auth.transport._http_client: DEBUG: Making request: GET http://metadata.google.internal/computeMetadata/v1/project/project-id
google.auth._default: DEBUG: Checking None for explicit credentials as part of auth process...
google.auth._default: DEBUG: Checking Cloud SDK credentials as part of auth process...
google.auth._default: DEBUG: Cloud SDK credentials not found on disk; not using them
google.auth._default: DEBUG: Checking for App Engine runtime as part of auth process...
google.auth._default: DEBUG: No App Engine library was found so cannot authentication via App Engine Identity Credentials.
google.auth.transport._http_client: DEBUG: Making request: GET http://169.254.169.254
google.auth.transport._http_client: DEBUG: Making request: GET http://metadata.google.internal/computeMetadata/v1/project/project-id
apache_beam.io.gcp.experimental.spannerio_read_it_test: INFO: .... Spanner Client created!
apache_beam.io.gcp.experimental.spannerio_read_it_test: INFO: Creating test database: pybeam-read-9d85a8368641e6c
google.auth.transport.requests: DEBUG: Making request: GET http://metadata.google.internal/computeMetadata/v1/instance/service-accounts/default/?recursive=true
urllib3.connectionpool: DEBUG: Starting new HTTP connection (1): metadata.google.internal:80
urllib3.connectionpool: DEBUG: http://metadata.google.internal:80 "GET /computeMetadata/v1/instance/service-accounts/default/?recursive=true HTTP/1.1" 200 144
google.auth.transport.requests: DEBUG: Making request: GET http://metadata.google.internal/computeMetadata/v1/instance/service-accounts/844138762903-compute@developer.gserviceaccount.com/token?scopes=https%3A%2F%2Fwww.googleapis.com%2Fauth%2Fspanner.admin
urllib3.connectionpool: DEBUG: http://metadata.google.internal:80 "GET /computeMetadata/v1/instance/service-accounts/844138762903-compute@developer.gserviceaccount.com/token?scopes=https%3A%2F%2Fwww.googleapis.com%2Fauth%2Fspanner.admin HTTP/1.1" 200 241
--------------------- >> end captured logging << ---------------------

======================================================================
ERROR: test suite for <class 'apache_beam.io.gcp.experimental.spannerio_write_it_test.SpannerWriteIntegrationTest'>
----------------------------------------------------------------------
Traceback (most recent call last):
  File "<https://ci-beam.apache.org/job/beam_PostCommit_Python38/ws/src/build/gradleenv/-1734967051/lib/python3.8/site-packages/nose/plugins/multiprocess.py",> line 788, in run
    self.setUp()
  File "<https://ci-beam.apache.org/job/beam_PostCommit_Python38/ws/src/build/gradleenv/-1734967051/lib/python3.8/site-packages/nose/suite.py",> line 293, in setUp
    self.setupContext(ancestor)
  File "<https://ci-beam.apache.org/job/beam_PostCommit_Python38/ws/src/build/gradleenv/-1734967051/lib/python3.8/site-packages/nose/plugins/multiprocess.py",> line 770, in setupContext
    super(NoSharedFixtureContextSuite, self).setupContext(context)
  File "<https://ci-beam.apache.org/job/beam_PostCommit_Python38/ws/src/build/gradleenv/-1734967051/lib/python3.8/site-packages/nose/suite.py",> line 316, in setupContext
    try_run(context, names)
  File "<https://ci-beam.apache.org/job/beam_PostCommit_Python38/ws/src/build/gradleenv/-1734967051/lib/python3.8/site-packages/nose/util.py",> line 471, in try_run
    return func()
  File "<https://ci-beam.apache.org/job/beam_PostCommit_Python38/ws/src/sdks/python/apache_beam/io/gcp/experimental/spannerio_write_it_test.py",> line 105, in setUpClass
    cls._create_database()
  File "<https://ci-beam.apache.org/job/beam_PostCommit_Python38/ws/src/sdks/python/apache_beam/io/gcp/experimental/spannerio_write_it_test.py",> line 73, in _create_database
    operation = database.create()
  File "<https://ci-beam.apache.org/job/beam_PostCommit_Python38/ws/src/build/gradleenv/-1734967051/lib/python3.8/site-packages/google/cloud/spanner_v1/database.py",> line 268, in create
    future = api.create_database(
  File "<https://ci-beam.apache.org/job/beam_PostCommit_Python38/ws/src/build/gradleenv/-1734967051/lib/python3.8/site-packages/google/cloud/spanner_admin_database_v1/gapic/database_admin_client.py",> line 333, in create_database
    operation = self._inner_api_calls["create_database"](
  File "<https://ci-beam.apache.org/job/beam_PostCommit_Python38/ws/src/build/gradleenv/-1734967051/lib/python3.8/site-packages/google/api_core/gapic_v1/method.py",> line 145, in __call__
    return wrapped_func(*args, **kwargs)
  File "<https://ci-beam.apache.org/job/beam_PostCommit_Python38/ws/src/build/gradleenv/-1734967051/lib/python3.8/site-packages/google/api_core/retry.py",> line 281, in retry_wrapped_func
    return retry_target(
  File "<https://ci-beam.apache.org/job/beam_PostCommit_Python38/ws/src/build/gradleenv/-1734967051/lib/python3.8/site-packages/google/api_core/retry.py",> line 184, in retry_target
    return target()
  File "<https://ci-beam.apache.org/job/beam_PostCommit_Python38/ws/src/build/gradleenv/-1734967051/lib/python3.8/site-packages/google/api_core/timeout.py",> line 214, in func_with_timeout
    return func(*args, **kwargs)
  File "<https://ci-beam.apache.org/job/beam_PostCommit_Python38/ws/src/build/gradleenv/-1734967051/lib/python3.8/site-packages/google/api_core/grpc_helpers.py",> line 59, in error_remapped_callable
    six.raise_from(exceptions.from_grpc_error(exc), exc)
  File "<string>", line 3, in raise_from
google.api_core.exceptions.ResourceExhausted: 429 The instance projects/apache-beam-testing/instances/beam-test has too many database splits to complete the operation.  Please add more nodes and try again.
-------------------- >> begin captured logging << --------------------
apache_beam.io.gcp.experimental.spannerio_read_it_test: INFO: .... PyVersion ---> 3.8.5 (default, Jul 20 2020, 19:50:14) 
[GCC 5.4.0 20160609]
apache_beam.io.gcp.experimental.spannerio_read_it_test: INFO: .... Setting up!
google.auth._default: DEBUG: Checking None for explicit credentials as part of auth process...
google.auth._default: DEBUG: Checking Cloud SDK credentials as part of auth process...
google.auth._default: DEBUG: Cloud SDK credentials not found on disk; not using them
google.auth._default: DEBUG: Checking for App Engine runtime as part of auth process...
google.auth._default: DEBUG: No App Engine library was found so cannot authentication via App Engine Identity Credentials.
google.auth.transport._http_client: DEBUG: Making request: GET http://169.254.169.254
google.auth.transport._http_client: DEBUG: Making request: GET http://metadata.google.internal/computeMetadata/v1/project/project-id
google.auth._default: DEBUG: Checking None for explicit credentials as part of auth process...
google.auth._default: DEBUG: Checking Cloud SDK credentials as part of auth process...
google.auth._default: DEBUG: Cloud SDK credentials not found on disk; not using them
google.auth._default: DEBUG: Checking for App Engine runtime as part of auth process...
google.auth._default: DEBUG: No App Engine library was found so cannot authentication via App Engine Identity Credentials.
google.auth.transport._http_client: DEBUG: Making request: GET http://169.254.169.254
google.auth.transport._http_client: DEBUG: Making request: GET http://metadata.google.internal/computeMetadata/v1/project/project-id
apache_beam.io.gcp.experimental.spannerio_read_it_test: INFO: .... Spanner Client created!
apache_beam.io.gcp.experimental.spannerio_read_it_test: INFO: Creating test database: pybeam-read-9d85a8368641e6c
google.auth.transport.requests: DEBUG: Making request: GET http://metadata.google.internal/computeMetadata/v1/instance/service-accounts/default/?recursive=true
urllib3.connectionpool: DEBUG: Starting new HTTP connection (1): metadata.google.internal:80
urllib3.connectionpool: DEBUG: http://metadata.google.internal:80 "GET /computeMetadata/v1/instance/service-accounts/default/?recursive=true HTTP/1.1" 200 144
google.auth.transport.requests: DEBUG: Making request: GET http://metadata.google.internal/computeMetadata/v1/instance/service-accounts/844138762903-compute@developer.gserviceaccount.com/token?scopes=https%3A%2F%2Fwww.googleapis.com%2Fauth%2Fspanner.admin
urllib3.connectionpool: DEBUG: http://metadata.google.internal:80 "GET /computeMetadata/v1/instance/service-accounts/844138762903-compute@developer.gserviceaccount.com/token?scopes=https%3A%2F%2Fwww.googleapis.com%2Fauth%2Fspanner.admin HTTP/1.1" 200 241
apache_beam.io.gcp.experimental.spannerio_write_it_test: INFO: .... Setting up!
google.auth._default: DEBUG: Checking None for explicit credentials as part of auth process...
google.auth._default: DEBUG: Checking Cloud SDK credentials as part of auth process...
google.auth._default: DEBUG: Cloud SDK credentials not found on disk; not using them
google.auth._default: DEBUG: Checking for App Engine runtime as part of auth process...
google.auth._default: DEBUG: No App Engine library was found so cannot authentication via App Engine Identity Credentials.
google.auth.transport._http_client: DEBUG: Making request: GET http://169.254.169.254
google.auth.transport._http_client: DEBUG: Making request: GET http://metadata.google.internal/computeMetadata/v1/project/project-id
google.auth._default: DEBUG: Checking None for explicit credentials as part of auth process...
google.auth._default: DEBUG: Checking Cloud SDK credentials as part of auth process...
google.auth._default: DEBUG: Cloud SDK credentials not found on disk; not using them
google.auth._default: DEBUG: Checking for App Engine runtime as part of auth process...
google.auth._default: DEBUG: No App Engine library was found so cannot authentication via App Engine Identity Credentials.
google.auth.transport._http_client: DEBUG: Making request: GET http://169.254.169.254
google.auth.transport._http_client: DEBUG: Making request: GET http://metadata.google.internal/computeMetadata/v1/project/project-id
apache_beam.io.gcp.experimental.spannerio_write_it_test: INFO: .... Spanner Client created!
apache_beam.io.gcp.experimental.spannerio_write_it_test: INFO: Creating test database: pybeam-write-8bb488b686ff8bf
google.auth.transport.requests: DEBUG: Making request: GET http://metadata.google.internal/computeMetadata/v1/instance/service-accounts/default/?recursive=true
urllib3.connectionpool: DEBUG: Starting new HTTP connection (1): metadata.google.internal:80
urllib3.connectionpool: DEBUG: http://metadata.google.internal:80 "GET /computeMetadata/v1/instance/service-accounts/default/?recursive=true HTTP/1.1" 200 144
google.auth.transport.requests: DEBUG: Making request: GET http://metadata.google.internal/computeMetadata/v1/instance/service-accounts/844138762903-compute@developer.gserviceaccount.com/token?scopes=https%3A%2F%2Fwww.googleapis.com%2Fauth%2Fspanner.admin
urllib3.connectionpool: DEBUG: http://metadata.google.internal:80 "GET /computeMetadata/v1/instance/service-accounts/844138762903-compute@developer.gserviceaccount.com/token?scopes=https%3A%2F%2Fwww.googleapis.com%2Fauth%2Fspanner.admin HTTP/1.1" 200 241
--------------------- >> end captured logging << ---------------------

----------------------------------------------------------------------
XML: nosetests-postCommitIT-df-py38.xml
----------------------------------------------------------------------
XML: <https://ci-beam.apache.org/job/beam_PostCommit_Python38/ws/src/sdks/python/nosetests.xml>
----------------------------------------------------------------------
Ran 63 tests in 4038.494s

FAILED (SKIP=7, errors=2)

> Task :sdks:python:test-suites:dataflow:py38:postCommitIT FAILED

FAILURE: Build completed with 2 failures.

1: Task failed with an exception.
-----------
* Where:
Script '<https://ci-beam.apache.org/job/beam_PostCommit_Python38/ws/src/sdks/python/test-suites/direct/common.gradle'> line: 55

* What went wrong:
Execution failed for task ':sdks:python:test-suites:direct:py38:postCommitIT'.
> Process 'command 'sh'' finished with non-zero exit value 1

* Try:
Run with --stacktrace option to get the stack trace. Run with --info or --debug option to get more log output. Run with --scan to get full insights.
==============================================================================

2: Task failed with an exception.
-----------
* Where:
Script '<https://ci-beam.apache.org/job/beam_PostCommit_Python38/ws/src/sdks/python/test-suites/dataflow/common.gradle'> line: 118

* What went wrong:
Execution failed for task ':sdks:python:test-suites:dataflow:py38:postCommitIT'.
> Process 'command 'sh'' finished with non-zero exit value 1

* Try:
Run with --stacktrace option to get the stack trace. Run with --info or --debug option to get more log output. Run with --scan to get full insights.
==============================================================================

* Get more help at https://help.gradle.org

Deprecated Gradle features were used in this build, making it incompatible with Gradle 7.0.
Use '--warning-mode all' to show the individual deprecation warnings.
See https://docs.gradle.org/6.7/userguide/command_line_interface.html#sec:command_line_warnings

BUILD FAILED in 1h 16m 39s
209 actionable tasks: 165 executed, 40 from cache, 4 up-to-date
Gradle was unable to watch the file system for changes. The inotify watches limit is too low.

Publishing build scan...
https://gradle.com/s/pxb5ddsni35a6

Build step 'Invoke Gradle script' changed build result to FAILURE
Build step 'Invoke Gradle script' marked build as failure

---------------------------------------------------------------------
To unsubscribe, e-mail: builds-unsubscribe@beam.apache.org
For additional commands, e-mail: builds-help@beam.apache.org


Build failed in Jenkins: beam_PostCommit_Python38 #596

Posted by Apache Jenkins Server <je...@builds.apache.org>.
See <https://ci-beam.apache.org/job/beam_PostCommit_Python38/596/display/redirect>

Changes:


------------------------------------------
[...truncated 36.48 MB...]
test_avro_it (apache_beam.examples.fastavro_it_test.FastavroIT) ... ok
test_bigquery_read_1M_python (apache_beam.io.gcp.bigquery_io_read_it_test.BigqueryIOReadIT) ... ok
test_bigquery_read_custom_1M_python (apache_beam.io.gcp.bigquery_io_read_it_test.BigqueryIOReadIT) ... ok
test_bqfl_streaming (apache_beam.io.gcp.bigquery_file_loads_test.BigQueryFileLoadsIT) ... SKIP: TestStream is not supported on TestDataflowRunner
test_multiple_destinations_transform (apache_beam.io.gcp.bigquery_file_loads_test.BigQueryFileLoadsIT) ... ok
test_one_job_fails_all_jobs_fail (apache_beam.io.gcp.bigquery_file_loads_test.BigQueryFileLoadsIT) ... ok
test_iobase_source (apache_beam.io.gcp.bigquery_read_it_test.ReadNewTypesTests) ... ok
test_native_source (apache_beam.io.gcp.bigquery_read_it_test.ReadNewTypesTests) ... ok
test_avro_file_load (apache_beam.io.gcp.bigquery_test.BigQueryFileLoadsIntegrationTests) ... ok
test_multiple_destinations_transform (apache_beam.io.gcp.bigquery_test.BigQueryStreamingInsertTransformIntegrationTests) ... ok
test_iobase_source (apache_beam.io.gcp.bigquery_read_it_test.ReadTests) ... ok
test_native_source (apache_beam.io.gcp.bigquery_read_it_test.ReadTests) ... ok
test_copy (apache_beam.io.gcp.gcsio_integration_test.GcsIOIntegrationTest) ... ok
test_copy_batch (apache_beam.io.gcp.gcsio_integration_test.GcsIOIntegrationTest) ... ok
test_copy_batch_kms (apache_beam.io.gcp.gcsio_integration_test.GcsIOIntegrationTest) ... ok
test_copy_batch_rewrite_token (apache_beam.io.gcp.gcsio_integration_test.GcsIOIntegrationTest) ... ok
test_copy_kms (apache_beam.io.gcp.gcsio_integration_test.GcsIOIntegrationTest) ... ok
test_copy_rewrite_token (apache_beam.io.gcp.gcsio_integration_test.GcsIOIntegrationTest) ... ok
test_value_provider_transform (apache_beam.io.gcp.bigquery_test.BigQueryStreamingInsertTransformIntegrationTests) ... ok
test_transform_on_gcs (apache_beam.io.fileio_test.MatchIntegrationTest) ... ok
test_datastore_write_limit (apache_beam.io.gcp.datastore.v1new.datastore_write_it_test.DatastoreWriteIT) ... ok
test_streaming_data_only (apache_beam.io.gcp.pubsub_integration_test.PubSubIntegrationTest) ... ok
test_streaming_with_attributes (apache_beam.io.gcp.pubsub_integration_test.PubSubIntegrationTest) ... ok
test_dicom_search_instances (apache_beam.io.gcp.dicomio_integration_test.DICOMIoIntegrationTest) ... ok
test_dicom_store_instance_from_gcs (apache_beam.io.gcp.dicomio_integration_test.DICOMIoIntegrationTest) ... ok
test_parquetio_it (apache_beam.io.parquetio_it_test.TestParquetIT) ... ok
test_file_loads (apache_beam.io.gcp.bigquery_test.PubSubBigQueryIT) ... SKIP: https://issuetracker.google.com/issues/118375066
test_streaming_inserts (apache_beam.io.gcp.bigquery_test.PubSubBigQueryIT) ... ok
test_analyzing_syntax (apache_beam.ml.gcp.naturallanguageml_test_it.NaturalLanguageMlTestIT) ... ok
test_label_detection_with_video_context (apache_beam.ml.gcp.videointelligenceml_test_it.VideoIntelligenceMlTestIT) ... ok
test_basic_execution (apache_beam.testing.test_stream_it_test.TestStreamIntegrationTests) ... SKIP: The "TestDataflowRunner", does not support the TestStream transform. Supported runners: ['DirectRunner', 'SwitchingDirectRunner']
Tests that the TestStream supports emitting to multiple PCollections. ... SKIP: The "TestDataflowRunner", does not support the TestStream transform. Supported runners: ['DirectRunner', 'SwitchingDirectRunner']
Tests that the TestStream can independently control output watermarks. ... SKIP: The "TestDataflowRunner", does not support the TestStream transform. Supported runners: ['DirectRunner', 'SwitchingDirectRunner']
test_text_detection_with_language_hint (apache_beam.ml.gcp.visionml_test_it.VisionMlTestIT) ... ok
Runs streaming Dataflow job and verifies that user metrics are reported ... ok
test_deidentification (apache_beam.ml.gcp.cloud_dlp_it_test.CloudDLPIT) ... ok
test_inspection (apache_beam.ml.gcp.cloud_dlp_it_test.CloudDLPIT) ... ok
test_big_query_write (apache_beam.io.gcp.bigquery_write_it_test.BigQueryWriteIntegrationTests) ... ok
test_big_query_write_new_types (apache_beam.io.gcp.bigquery_write_it_test.BigQueryWriteIntegrationTests) ... ok
test_big_query_write_schema_autodetect (apache_beam.io.gcp.bigquery_write_it_test.BigQueryWriteIntegrationTests) ... SKIP: DataflowRunner does not support schema autodetection
test_big_query_write_without_schema (apache_beam.io.gcp.bigquery_write_it_test.BigQueryWriteIntegrationTests) ... ok
test_big_query_legacy_sql (apache_beam.io.gcp.big_query_query_to_table_it_test.BigQueryQueryToTableIT) ... ok
test_big_query_new_types (apache_beam.io.gcp.big_query_query_to_table_it_test.BigQueryQueryToTableIT) ... ok
test_big_query_new_types_avro (apache_beam.io.gcp.big_query_query_to_table_it_test.BigQueryQueryToTableIT) ... ok
test_big_query_new_types_native (apache_beam.io.gcp.big_query_query_to_table_it_test.BigQueryQueryToTableIT) ... ok
test_big_query_standard_sql (apache_beam.io.gcp.big_query_query_to_table_it_test.BigQueryQueryToTableIT) ... ok
test_big_query_standard_sql_kms_key_native (apache_beam.io.gcp.big_query_query_to_table_it_test.BigQueryQueryToTableIT) ... ok
test_job_python_from_python_it (apache_beam.transforms.external_it_test.ExternalTransformIT) ... ok
test_metrics_fnapi_it (apache_beam.runners.dataflow.dataflow_exercise_metrics_pipeline_test.ExerciseMetricsPipelineTest) ... ok
test_metrics_it (apache_beam.runners.dataflow.dataflow_exercise_metrics_pipeline_test.ExerciseMetricsPipelineTest) ... ok

======================================================================
ERROR: test suite for <class 'apache_beam.io.gcp.experimental.spannerio_read_it_test.SpannerReadIntegrationTest'>
----------------------------------------------------------------------
Traceback (most recent call last):
  File "<https://ci-beam.apache.org/job/beam_PostCommit_Python38/ws/src/build/gradleenv/-1734967051/lib/python3.8/site-packages/nose/plugins/multiprocess.py",> line 788, in run
    self.setUp()
  File "<https://ci-beam.apache.org/job/beam_PostCommit_Python38/ws/src/build/gradleenv/-1734967051/lib/python3.8/site-packages/nose/suite.py",> line 293, in setUp
    self.setupContext(ancestor)
  File "<https://ci-beam.apache.org/job/beam_PostCommit_Python38/ws/src/build/gradleenv/-1734967051/lib/python3.8/site-packages/nose/plugins/multiprocess.py",> line 770, in setupContext
    super(NoSharedFixtureContextSuite, self).setupContext(context)
  File "<https://ci-beam.apache.org/job/beam_PostCommit_Python38/ws/src/build/gradleenv/-1734967051/lib/python3.8/site-packages/nose/suite.py",> line 316, in setupContext
    try_run(context, names)
  File "<https://ci-beam.apache.org/job/beam_PostCommit_Python38/ws/src/build/gradleenv/-1734967051/lib/python3.8/site-packages/nose/util.py",> line 471, in try_run
    return func()
  File "<https://ci-beam.apache.org/job/beam_PostCommit_Python38/ws/src/sdks/python/apache_beam/io/gcp/experimental/spannerio_read_it_test.py",> line 102, in setUpClass
    cls._create_database()
  File "<https://ci-beam.apache.org/job/beam_PostCommit_Python38/ws/src/sdks/python/apache_beam/io/gcp/experimental/spannerio_read_it_test.py",> line 76, in _create_database
    operation = database.create()
  File "<https://ci-beam.apache.org/job/beam_PostCommit_Python38/ws/src/build/gradleenv/-1734967051/lib/python3.8/site-packages/google/cloud/spanner_v1/database.py",> line 268, in create
    future = api.create_database(
  File "<https://ci-beam.apache.org/job/beam_PostCommit_Python38/ws/src/build/gradleenv/-1734967051/lib/python3.8/site-packages/google/cloud/spanner_admin_database_v1/gapic/database_admin_client.py",> line 333, in create_database
    operation = self._inner_api_calls["create_database"](
  File "<https://ci-beam.apache.org/job/beam_PostCommit_Python38/ws/src/build/gradleenv/-1734967051/lib/python3.8/site-packages/google/api_core/gapic_v1/method.py",> line 145, in __call__
    return wrapped_func(*args, **kwargs)
  File "<https://ci-beam.apache.org/job/beam_PostCommit_Python38/ws/src/build/gradleenv/-1734967051/lib/python3.8/site-packages/google/api_core/retry.py",> line 281, in retry_wrapped_func
    return retry_target(
  File "<https://ci-beam.apache.org/job/beam_PostCommit_Python38/ws/src/build/gradleenv/-1734967051/lib/python3.8/site-packages/google/api_core/retry.py",> line 184, in retry_target
    return target()
  File "<https://ci-beam.apache.org/job/beam_PostCommit_Python38/ws/src/build/gradleenv/-1734967051/lib/python3.8/site-packages/google/api_core/timeout.py",> line 214, in func_with_timeout
    return func(*args, **kwargs)
  File "<https://ci-beam.apache.org/job/beam_PostCommit_Python38/ws/src/build/gradleenv/-1734967051/lib/python3.8/site-packages/google/api_core/grpc_helpers.py",> line 59, in error_remapped_callable
    six.raise_from(exceptions.from_grpc_error(exc), exc)
  File "<string>", line 3, in raise_from
google.api_core.exceptions.ResourceExhausted: 429 The instance projects/apache-beam-testing/instances/beam-test has too many database splits to complete the operation.  Please add more nodes and try again.
-------------------- >> begin captured logging << --------------------
apache_beam.io.gcp.experimental.spannerio_read_it_test: INFO: .... PyVersion ---> 3.8.5 (default, Jul 20 2020, 19:50:14) 
[GCC 5.4.0 20160609]
apache_beam.io.gcp.experimental.spannerio_read_it_test: INFO: .... Setting up!
google.auth._default: DEBUG: Checking None for explicit credentials as part of auth process...
google.auth._default: DEBUG: Checking Cloud SDK credentials as part of auth process...
google.auth._default: DEBUG: Cloud SDK credentials not found on disk; not using them
google.auth._default: DEBUG: Checking for App Engine runtime as part of auth process...
google.auth._default: DEBUG: No App Engine library was found so cannot authentication via App Engine Identity Credentials.
google.auth.transport._http_client: DEBUG: Making request: GET http://169.254.169.254
google.auth.transport._http_client: DEBUG: Making request: GET http://metadata.google.internal/computeMetadata/v1/project/project-id
google.auth._default: DEBUG: Checking None for explicit credentials as part of auth process...
google.auth._default: DEBUG: Checking Cloud SDK credentials as part of auth process...
google.auth._default: DEBUG: Cloud SDK credentials not found on disk; not using them
google.auth._default: DEBUG: Checking for App Engine runtime as part of auth process...
google.auth._default: DEBUG: No App Engine library was found so cannot authentication via App Engine Identity Credentials.
google.auth.transport._http_client: DEBUG: Making request: GET http://169.254.169.254
google.auth.transport._http_client: DEBUG: Making request: GET http://metadata.google.internal/computeMetadata/v1/project/project-id
apache_beam.io.gcp.experimental.spannerio_read_it_test: INFO: .... Spanner Client created!
apache_beam.io.gcp.experimental.spannerio_read_it_test: INFO: Creating test database: pybeam-read-364aab206ea2efe
google.auth.transport.requests: DEBUG: Making request: GET http://metadata.google.internal/computeMetadata/v1/instance/service-accounts/default/?recursive=true
urllib3.connectionpool: DEBUG: Starting new HTTP connection (1): metadata.google.internal:80
urllib3.connectionpool: DEBUG: http://metadata.google.internal:80 "GET /computeMetadata/v1/instance/service-accounts/default/?recursive=true HTTP/1.1" 200 144
google.auth.transport.requests: DEBUG: Making request: GET http://metadata.google.internal/computeMetadata/v1/instance/service-accounts/844138762903-compute@developer.gserviceaccount.com/token?scopes=https%3A%2F%2Fwww.googleapis.com%2Fauth%2Fspanner.admin
urllib3.connectionpool: DEBUG: http://metadata.google.internal:80 "GET /computeMetadata/v1/instance/service-accounts/844138762903-compute@developer.gserviceaccount.com/token?scopes=https%3A%2F%2Fwww.googleapis.com%2Fauth%2Fspanner.admin HTTP/1.1" 200 241
--------------------- >> end captured logging << ---------------------

======================================================================
ERROR: test suite for <class 'apache_beam.io.gcp.experimental.spannerio_write_it_test.SpannerWriteIntegrationTest'>
----------------------------------------------------------------------
Traceback (most recent call last):
  File "<https://ci-beam.apache.org/job/beam_PostCommit_Python38/ws/src/build/gradleenv/-1734967051/lib/python3.8/site-packages/nose/plugins/multiprocess.py",> line 788, in run
    self.setUp()
  File "<https://ci-beam.apache.org/job/beam_PostCommit_Python38/ws/src/build/gradleenv/-1734967051/lib/python3.8/site-packages/nose/suite.py",> line 293, in setUp
    self.setupContext(ancestor)
  File "<https://ci-beam.apache.org/job/beam_PostCommit_Python38/ws/src/build/gradleenv/-1734967051/lib/python3.8/site-packages/nose/plugins/multiprocess.py",> line 770, in setupContext
    super(NoSharedFixtureContextSuite, self).setupContext(context)
  File "<https://ci-beam.apache.org/job/beam_PostCommit_Python38/ws/src/build/gradleenv/-1734967051/lib/python3.8/site-packages/nose/suite.py",> line 316, in setupContext
    try_run(context, names)
  File "<https://ci-beam.apache.org/job/beam_PostCommit_Python38/ws/src/build/gradleenv/-1734967051/lib/python3.8/site-packages/nose/util.py",> line 471, in try_run
    return func()
  File "<https://ci-beam.apache.org/job/beam_PostCommit_Python38/ws/src/sdks/python/apache_beam/io/gcp/experimental/spannerio_write_it_test.py",> line 105, in setUpClass
    cls._create_database()
  File "<https://ci-beam.apache.org/job/beam_PostCommit_Python38/ws/src/sdks/python/apache_beam/io/gcp/experimental/spannerio_write_it_test.py",> line 73, in _create_database
    operation = database.create()
  File "<https://ci-beam.apache.org/job/beam_PostCommit_Python38/ws/src/build/gradleenv/-1734967051/lib/python3.8/site-packages/google/cloud/spanner_v1/database.py",> line 268, in create
    future = api.create_database(
  File "<https://ci-beam.apache.org/job/beam_PostCommit_Python38/ws/src/build/gradleenv/-1734967051/lib/python3.8/site-packages/google/cloud/spanner_admin_database_v1/gapic/database_admin_client.py",> line 333, in create_database
    operation = self._inner_api_calls["create_database"](
  File "<https://ci-beam.apache.org/job/beam_PostCommit_Python38/ws/src/build/gradleenv/-1734967051/lib/python3.8/site-packages/google/api_core/gapic_v1/method.py",> line 145, in __call__
    return wrapped_func(*args, **kwargs)
  File "<https://ci-beam.apache.org/job/beam_PostCommit_Python38/ws/src/build/gradleenv/-1734967051/lib/python3.8/site-packages/google/api_core/retry.py",> line 281, in retry_wrapped_func
    return retry_target(
  File "<https://ci-beam.apache.org/job/beam_PostCommit_Python38/ws/src/build/gradleenv/-1734967051/lib/python3.8/site-packages/google/api_core/retry.py",> line 184, in retry_target
    return target()
  File "<https://ci-beam.apache.org/job/beam_PostCommit_Python38/ws/src/build/gradleenv/-1734967051/lib/python3.8/site-packages/google/api_core/timeout.py",> line 214, in func_with_timeout
    return func(*args, **kwargs)
  File "<https://ci-beam.apache.org/job/beam_PostCommit_Python38/ws/src/build/gradleenv/-1734967051/lib/python3.8/site-packages/google/api_core/grpc_helpers.py",> line 59, in error_remapped_callable
    six.raise_from(exceptions.from_grpc_error(exc), exc)
  File "<string>", line 3, in raise_from
google.api_core.exceptions.ResourceExhausted: 429 The instance projects/apache-beam-testing/instances/beam-test has too many database splits to complete the operation.  Please add more nodes and try again.
-------------------- >> begin captured logging << --------------------
apache_beam.io.gcp.experimental.spannerio_read_it_test: INFO: .... PyVersion ---> 3.8.5 (default, Jul 20 2020, 19:50:14) 
[GCC 5.4.0 20160609]
apache_beam.io.gcp.experimental.spannerio_read_it_test: INFO: .... Setting up!
google.auth._default: DEBUG: Checking None for explicit credentials as part of auth process...
google.auth._default: DEBUG: Checking Cloud SDK credentials as part of auth process...
google.auth._default: DEBUG: Cloud SDK credentials not found on disk; not using them
google.auth._default: DEBUG: Checking for App Engine runtime as part of auth process...
google.auth._default: DEBUG: No App Engine library was found so cannot authentication via App Engine Identity Credentials.
google.auth.transport._http_client: DEBUG: Making request: GET http://169.254.169.254
google.auth.transport._http_client: DEBUG: Making request: GET http://metadata.google.internal/computeMetadata/v1/project/project-id
google.auth._default: DEBUG: Checking None for explicit credentials as part of auth process...
google.auth._default: DEBUG: Checking Cloud SDK credentials as part of auth process...
google.auth._default: DEBUG: Cloud SDK credentials not found on disk; not using them
google.auth._default: DEBUG: Checking for App Engine runtime as part of auth process...
google.auth._default: DEBUG: No App Engine library was found so cannot authentication via App Engine Identity Credentials.
google.auth.transport._http_client: DEBUG: Making request: GET http://169.254.169.254
google.auth.transport._http_client: DEBUG: Making request: GET http://metadata.google.internal/computeMetadata/v1/project/project-id
apache_beam.io.gcp.experimental.spannerio_read_it_test: INFO: .... Spanner Client created!
apache_beam.io.gcp.experimental.spannerio_read_it_test: INFO: Creating test database: pybeam-read-364aab206ea2efe
google.auth.transport.requests: DEBUG: Making request: GET http://metadata.google.internal/computeMetadata/v1/instance/service-accounts/default/?recursive=true
urllib3.connectionpool: DEBUG: Starting new HTTP connection (1): metadata.google.internal:80
urllib3.connectionpool: DEBUG: http://metadata.google.internal:80 "GET /computeMetadata/v1/instance/service-accounts/default/?recursive=true HTTP/1.1" 200 144
google.auth.transport.requests: DEBUG: Making request: GET http://metadata.google.internal/computeMetadata/v1/instance/service-accounts/844138762903-compute@developer.gserviceaccount.com/token?scopes=https%3A%2F%2Fwww.googleapis.com%2Fauth%2Fspanner.admin
urllib3.connectionpool: DEBUG: http://metadata.google.internal:80 "GET /computeMetadata/v1/instance/service-accounts/844138762903-compute@developer.gserviceaccount.com/token?scopes=https%3A%2F%2Fwww.googleapis.com%2Fauth%2Fspanner.admin HTTP/1.1" 200 241
apache_beam.io.gcp.experimental.spannerio_write_it_test: INFO: .... Setting up!
google.auth._default: DEBUG: Checking None for explicit credentials as part of auth process...
google.auth._default: DEBUG: Checking Cloud SDK credentials as part of auth process...
google.auth._default: DEBUG: Cloud SDK credentials not found on disk; not using them
google.auth._default: DEBUG: Checking for App Engine runtime as part of auth process...
google.auth._default: DEBUG: No App Engine library was found so cannot authentication via App Engine Identity Credentials.
google.auth.transport._http_client: DEBUG: Making request: GET http://169.254.169.254
google.auth.transport._http_client: DEBUG: Making request: GET http://metadata.google.internal/computeMetadata/v1/project/project-id
google.auth._default: DEBUG: Checking None for explicit credentials as part of auth process...
google.auth._default: DEBUG: Checking Cloud SDK credentials as part of auth process...
google.auth._default: DEBUG: Cloud SDK credentials not found on disk; not using them
google.auth._default: DEBUG: Checking for App Engine runtime as part of auth process...
google.auth._default: DEBUG: No App Engine library was found so cannot authentication via App Engine Identity Credentials.
google.auth.transport._http_client: DEBUG: Making request: GET http://169.254.169.254
google.auth.transport._http_client: DEBUG: Making request: GET http://metadata.google.internal/computeMetadata/v1/project/project-id
apache_beam.io.gcp.experimental.spannerio_write_it_test: INFO: .... Spanner Client created!
apache_beam.io.gcp.experimental.spannerio_write_it_test: INFO: Creating test database: pybeam-write-4ebd9d8f2008eb4
google.auth.transport.requests: DEBUG: Making request: GET http://metadata.google.internal/computeMetadata/v1/instance/service-accounts/default/?recursive=true
urllib3.connectionpool: DEBUG: Starting new HTTP connection (1): metadata.google.internal:80
urllib3.connectionpool: DEBUG: http://metadata.google.internal:80 "GET /computeMetadata/v1/instance/service-accounts/default/?recursive=true HTTP/1.1" 200 144
google.auth.transport.requests: DEBUG: Making request: GET http://metadata.google.internal/computeMetadata/v1/instance/service-accounts/844138762903-compute@developer.gserviceaccount.com/token?scopes=https%3A%2F%2Fwww.googleapis.com%2Fauth%2Fspanner.admin
urllib3.connectionpool: DEBUG: http://metadata.google.internal:80 "GET /computeMetadata/v1/instance/service-accounts/844138762903-compute@developer.gserviceaccount.com/token?scopes=https%3A%2F%2Fwww.googleapis.com%2Fauth%2Fspanner.admin HTTP/1.1" 200 241
--------------------- >> end captured logging << ---------------------

----------------------------------------------------------------------
XML: nosetests-postCommitIT-df-py38.xml
----------------------------------------------------------------------
XML: <https://ci-beam.apache.org/job/beam_PostCommit_Python38/ws/src/sdks/python/nosetests.xml>
----------------------------------------------------------------------
Ran 63 tests in 3909.095s

FAILED (SKIP=7, errors=2)

> Task :sdks:python:test-suites:dataflow:py38:postCommitIT FAILED

FAILURE: Build completed with 2 failures.

1: Task failed with an exception.
-----------
* Where:
Script '<https://ci-beam.apache.org/job/beam_PostCommit_Python38/ws/src/sdks/python/test-suites/direct/common.gradle'> line: 55

* What went wrong:
Execution failed for task ':sdks:python:test-suites:direct:py38:postCommitIT'.
> Process 'command 'sh'' finished with non-zero exit value 1

* Try:
Run with --stacktrace option to get the stack trace. Run with --info or --debug option to get more log output. Run with --scan to get full insights.
==============================================================================

2: Task failed with an exception.
-----------
* Where:
Script '<https://ci-beam.apache.org/job/beam_PostCommit_Python38/ws/src/sdks/python/test-suites/dataflow/common.gradle'> line: 118

* What went wrong:
Execution failed for task ':sdks:python:test-suites:dataflow:py38:postCommitIT'.
> Process 'command 'sh'' finished with non-zero exit value 1

* Try:
Run with --stacktrace option to get the stack trace. Run with --info or --debug option to get more log output. Run with --scan to get full insights.
==============================================================================

* Get more help at https://help.gradle.org

Deprecated Gradle features were used in this build, making it incompatible with Gradle 7.0.
Use '--warning-mode all' to show the individual deprecation warnings.
See https://docs.gradle.org/6.7/userguide/command_line_interface.html#sec:command_line_warnings

BUILD FAILED in 1h 8m 31s
209 actionable tasks: 165 executed, 40 from cache, 4 up-to-date
Gradle was unable to watch the file system for changes. The inotify watches limit is too low.

Publishing build scan...
https://gradle.com/s/7mha44vspuj5y

Build step 'Invoke Gradle script' changed build result to FAILURE
Build step 'Invoke Gradle script' marked build as failure

---------------------------------------------------------------------
To unsubscribe, e-mail: builds-unsubscribe@beam.apache.org
For additional commands, e-mail: builds-help@beam.apache.org


Build failed in Jenkins: beam_PostCommit_Python38 #595

Posted by Apache Jenkins Server <je...@builds.apache.org>.
See <https://ci-beam.apache.org/job/beam_PostCommit_Python38/595/display/redirect?page=changes>

Changes:

[Robert Bradshaw] [BEAM-11354] Allow DoFn itself to be used as the restriction provider.

[Robert Bradshaw] [BEAM-11354] Also allow DoFn for WatermarkEstimator.

[Robert Bradshaw] [BEAM-11354] Update docs.

[Robert Bradshaw] Test for watermark tracker.

[Boyuan Zhang] Add splittable dofn as the recommended way of building connectors.

[Robert Bradshaw] Add a note to the programming guide.

[Robert Bradshaw] Skip tests unimplemented for multiple workers.


------------------------------------------
[...truncated 37.37 MB...]
test_avro_it (apache_beam.examples.fastavro_it_test.FastavroIT) ... ok
test_bigquery_read_1M_python (apache_beam.io.gcp.bigquery_io_read_it_test.BigqueryIOReadIT) ... ok
test_bigquery_read_custom_1M_python (apache_beam.io.gcp.bigquery_io_read_it_test.BigqueryIOReadIT) ... ok
test_iobase_source (apache_beam.io.gcp.bigquery_read_it_test.ReadNewTypesTests) ... ok
test_native_source (apache_beam.io.gcp.bigquery_read_it_test.ReadNewTypesTests) ... ok
test_avro_file_load (apache_beam.io.gcp.bigquery_test.BigQueryFileLoadsIntegrationTests) ... ok
test_bqfl_streaming (apache_beam.io.gcp.bigquery_file_loads_test.BigQueryFileLoadsIT) ... SKIP: TestStream is not supported on TestDataflowRunner
test_multiple_destinations_transform (apache_beam.io.gcp.bigquery_file_loads_test.BigQueryFileLoadsIT) ... ok
test_one_job_fails_all_jobs_fail (apache_beam.io.gcp.bigquery_file_loads_test.BigQueryFileLoadsIT) ... ok
test_iobase_source (apache_beam.io.gcp.bigquery_read_it_test.ReadTests) ... ok
test_native_source (apache_beam.io.gcp.bigquery_read_it_test.ReadTests) ... ok
test_copy (apache_beam.io.gcp.gcsio_integration_test.GcsIOIntegrationTest) ... ok
test_copy_batch (apache_beam.io.gcp.gcsio_integration_test.GcsIOIntegrationTest) ... ok
test_copy_batch_kms (apache_beam.io.gcp.gcsio_integration_test.GcsIOIntegrationTest) ... ok
test_copy_batch_rewrite_token (apache_beam.io.gcp.gcsio_integration_test.GcsIOIntegrationTest) ... ok
test_copy_kms (apache_beam.io.gcp.gcsio_integration_test.GcsIOIntegrationTest) ... ok
test_copy_rewrite_token (apache_beam.io.gcp.gcsio_integration_test.GcsIOIntegrationTest) ... ok
test_multiple_destinations_transform (apache_beam.io.gcp.bigquery_test.BigQueryStreamingInsertTransformIntegrationTests) ... ok
test_value_provider_transform (apache_beam.io.gcp.bigquery_test.BigQueryStreamingInsertTransformIntegrationTests) ... ok
test_transform_on_gcs (apache_beam.io.fileio_test.MatchIntegrationTest) ... ok
test_dicom_search_instances (apache_beam.io.gcp.dicomio_integration_test.DICOMIoIntegrationTest) ... ok
test_dicom_store_instance_from_gcs (apache_beam.io.gcp.dicomio_integration_test.DICOMIoIntegrationTest) ... ok
test_streaming_data_only (apache_beam.io.gcp.pubsub_integration_test.PubSubIntegrationTest) ... ok
test_streaming_with_attributes (apache_beam.io.gcp.pubsub_integration_test.PubSubIntegrationTest) ... ok
test_parquetio_it (apache_beam.io.parquetio_it_test.TestParquetIT) ... ok
test_file_loads (apache_beam.io.gcp.bigquery_test.PubSubBigQueryIT) ... SKIP: https://issuetracker.google.com/issues/118375066
test_streaming_inserts (apache_beam.io.gcp.bigquery_test.PubSubBigQueryIT) ... ok
test_datastore_write_limit (apache_beam.io.gcp.datastore.v1new.datastore_write_it_test.DatastoreWriteIT) ... ok
test_text_detection_with_language_hint (apache_beam.ml.gcp.visionml_test_it.VisionMlTestIT) ... ok
Runs streaming Dataflow job and verifies that user metrics are reported ... ok
test_basic_execution (apache_beam.testing.test_stream_it_test.TestStreamIntegrationTests) ... SKIP: The "TestDataflowRunner", does not support the TestStream transform. Supported runners: ['DirectRunner', 'SwitchingDirectRunner']
Tests that the TestStream supports emitting to multiple PCollections. ... SKIP: The "TestDataflowRunner", does not support the TestStream transform. Supported runners: ['DirectRunner', 'SwitchingDirectRunner']
Tests that the TestStream can independently control output watermarks. ... SKIP: The "TestDataflowRunner", does not support the TestStream transform. Supported runners: ['DirectRunner', 'SwitchingDirectRunner']
test_analyzing_syntax (apache_beam.ml.gcp.naturallanguageml_test_it.NaturalLanguageMlTestIT) ... ok
test_big_query_write (apache_beam.io.gcp.bigquery_write_it_test.BigQueryWriteIntegrationTests) ... ok
test_big_query_write_new_types (apache_beam.io.gcp.bigquery_write_it_test.BigQueryWriteIntegrationTests) ... ok
test_big_query_write_schema_autodetect (apache_beam.io.gcp.bigquery_write_it_test.BigQueryWriteIntegrationTests) ... SKIP: DataflowRunner does not support schema autodetection
test_big_query_write_without_schema (apache_beam.io.gcp.bigquery_write_it_test.BigQueryWriteIntegrationTests) ... ok
test_label_detection_with_video_context (apache_beam.ml.gcp.videointelligenceml_test_it.VideoIntelligenceMlTestIT) ... ok
test_deidentification (apache_beam.ml.gcp.cloud_dlp_it_test.CloudDLPIT) ... ok
test_inspection (apache_beam.ml.gcp.cloud_dlp_it_test.CloudDLPIT) ... ok
test_big_query_legacy_sql (apache_beam.io.gcp.big_query_query_to_table_it_test.BigQueryQueryToTableIT) ... ok
test_big_query_new_types (apache_beam.io.gcp.big_query_query_to_table_it_test.BigQueryQueryToTableIT) ... ok
test_big_query_new_types_avro (apache_beam.io.gcp.big_query_query_to_table_it_test.BigQueryQueryToTableIT) ... ok
test_big_query_new_types_native (apache_beam.io.gcp.big_query_query_to_table_it_test.BigQueryQueryToTableIT) ... ok
test_big_query_standard_sql (apache_beam.io.gcp.big_query_query_to_table_it_test.BigQueryQueryToTableIT) ... ok
test_big_query_standard_sql_kms_key_native (apache_beam.io.gcp.big_query_query_to_table_it_test.BigQueryQueryToTableIT) ... ok
test_metrics_fnapi_it (apache_beam.runners.dataflow.dataflow_exercise_metrics_pipeline_test.ExerciseMetricsPipelineTest) ... ok
test_metrics_it (apache_beam.runners.dataflow.dataflow_exercise_metrics_pipeline_test.ExerciseMetricsPipelineTest) ... ok
test_job_python_from_python_it (apache_beam.transforms.external_it_test.ExternalTransformIT) ... ok

======================================================================
ERROR: test suite for <class 'apache_beam.io.gcp.experimental.spannerio_read_it_test.SpannerReadIntegrationTest'>
----------------------------------------------------------------------
Traceback (most recent call last):
  File "<https://ci-beam.apache.org/job/beam_PostCommit_Python38/ws/src/build/gradleenv/-1734967051/lib/python3.8/site-packages/nose/plugins/multiprocess.py",> line 788, in run
    self.setUp()
  File "<https://ci-beam.apache.org/job/beam_PostCommit_Python38/ws/src/build/gradleenv/-1734967051/lib/python3.8/site-packages/nose/suite.py",> line 293, in setUp
    self.setupContext(ancestor)
  File "<https://ci-beam.apache.org/job/beam_PostCommit_Python38/ws/src/build/gradleenv/-1734967051/lib/python3.8/site-packages/nose/plugins/multiprocess.py",> line 770, in setupContext
    super(NoSharedFixtureContextSuite, self).setupContext(context)
  File "<https://ci-beam.apache.org/job/beam_PostCommit_Python38/ws/src/build/gradleenv/-1734967051/lib/python3.8/site-packages/nose/suite.py",> line 316, in setupContext
    try_run(context, names)
  File "<https://ci-beam.apache.org/job/beam_PostCommit_Python38/ws/src/build/gradleenv/-1734967051/lib/python3.8/site-packages/nose/util.py",> line 471, in try_run
    return func()
  File "<https://ci-beam.apache.org/job/beam_PostCommit_Python38/ws/src/sdks/python/apache_beam/io/gcp/experimental/spannerio_read_it_test.py",> line 102, in setUpClass
    cls._create_database()
  File "<https://ci-beam.apache.org/job/beam_PostCommit_Python38/ws/src/sdks/python/apache_beam/io/gcp/experimental/spannerio_read_it_test.py",> line 76, in _create_database
    operation = database.create()
  File "<https://ci-beam.apache.org/job/beam_PostCommit_Python38/ws/src/build/gradleenv/-1734967051/lib/python3.8/site-packages/google/cloud/spanner_v1/database.py",> line 268, in create
    future = api.create_database(
  File "<https://ci-beam.apache.org/job/beam_PostCommit_Python38/ws/src/build/gradleenv/-1734967051/lib/python3.8/site-packages/google/cloud/spanner_admin_database_v1/gapic/database_admin_client.py",> line 333, in create_database
    operation = self._inner_api_calls["create_database"](
  File "<https://ci-beam.apache.org/job/beam_PostCommit_Python38/ws/src/build/gradleenv/-1734967051/lib/python3.8/site-packages/google/api_core/gapic_v1/method.py",> line 145, in __call__
    return wrapped_func(*args, **kwargs)
  File "<https://ci-beam.apache.org/job/beam_PostCommit_Python38/ws/src/build/gradleenv/-1734967051/lib/python3.8/site-packages/google/api_core/retry.py",> line 281, in retry_wrapped_func
    return retry_target(
  File "<https://ci-beam.apache.org/job/beam_PostCommit_Python38/ws/src/build/gradleenv/-1734967051/lib/python3.8/site-packages/google/api_core/retry.py",> line 184, in retry_target
    return target()
  File "<https://ci-beam.apache.org/job/beam_PostCommit_Python38/ws/src/build/gradleenv/-1734967051/lib/python3.8/site-packages/google/api_core/timeout.py",> line 214, in func_with_timeout
    return func(*args, **kwargs)
  File "<https://ci-beam.apache.org/job/beam_PostCommit_Python38/ws/src/build/gradleenv/-1734967051/lib/python3.8/site-packages/google/api_core/grpc_helpers.py",> line 59, in error_remapped_callable
    six.raise_from(exceptions.from_grpc_error(exc), exc)
  File "<string>", line 3, in raise_from
google.api_core.exceptions.ResourceExhausted: 429 The instance projects/apache-beam-testing/instances/beam-test has too many database splits to complete the operation.  Please add more nodes and try again.
-------------------- >> begin captured logging << --------------------
apache_beam.io.gcp.experimental.spannerio_read_it_test: INFO: .... PyVersion ---> 3.8.5 (default, Jul 20 2020, 19:50:14) 
[GCC 5.4.0 20160609]
apache_beam.io.gcp.experimental.spannerio_read_it_test: INFO: .... Setting up!
google.auth._default: DEBUG: Checking None for explicit credentials as part of auth process...
google.auth._default: DEBUG: Checking Cloud SDK credentials as part of auth process...
google.auth._default: DEBUG: Cloud SDK credentials not found on disk; not using them
google.auth._default: DEBUG: Checking for App Engine runtime as part of auth process...
google.auth._default: DEBUG: No App Engine library was found so cannot authentication via App Engine Identity Credentials.
google.auth.transport._http_client: DEBUG: Making request: GET http://169.254.169.254
google.auth.transport._http_client: DEBUG: Making request: GET http://metadata.google.internal/computeMetadata/v1/project/project-id
google.auth._default: DEBUG: Checking None for explicit credentials as part of auth process...
google.auth._default: DEBUG: Checking Cloud SDK credentials as part of auth process...
google.auth._default: DEBUG: Cloud SDK credentials not found on disk; not using them
google.auth._default: DEBUG: Checking for App Engine runtime as part of auth process...
google.auth._default: DEBUG: No App Engine library was found so cannot authentication via App Engine Identity Credentials.
google.auth.transport._http_client: DEBUG: Making request: GET http://169.254.169.254
google.auth.transport._http_client: DEBUG: Making request: GET http://metadata.google.internal/computeMetadata/v1/project/project-id
apache_beam.io.gcp.experimental.spannerio_read_it_test: INFO: .... Spanner Client created!
apache_beam.io.gcp.experimental.spannerio_read_it_test: INFO: Creating test database: pybeam-read-b016170e7de790a
google.auth.transport.requests: DEBUG: Making request: GET http://metadata.google.internal/computeMetadata/v1/instance/service-accounts/default/?recursive=true
urllib3.connectionpool: DEBUG: Starting new HTTP connection (1): metadata.google.internal:80
urllib3.connectionpool: DEBUG: http://metadata.google.internal:80 "GET /computeMetadata/v1/instance/service-accounts/default/?recursive=true HTTP/1.1" 200 144
google.auth.transport.requests: DEBUG: Making request: GET http://metadata.google.internal/computeMetadata/v1/instance/service-accounts/844138762903-compute@developer.gserviceaccount.com/token?scopes=https%3A%2F%2Fwww.googleapis.com%2Fauth%2Fspanner.admin
urllib3.connectionpool: DEBUG: http://metadata.google.internal:80 "GET /computeMetadata/v1/instance/service-accounts/844138762903-compute@developer.gserviceaccount.com/token?scopes=https%3A%2F%2Fwww.googleapis.com%2Fauth%2Fspanner.admin HTTP/1.1" 200 241
--------------------- >> end captured logging << ---------------------

======================================================================
ERROR: test suite for <class 'apache_beam.io.gcp.experimental.spannerio_write_it_test.SpannerWriteIntegrationTest'>
----------------------------------------------------------------------
Traceback (most recent call last):
  File "<https://ci-beam.apache.org/job/beam_PostCommit_Python38/ws/src/build/gradleenv/-1734967051/lib/python3.8/site-packages/nose/plugins/multiprocess.py",> line 788, in run
    self.setUp()
  File "<https://ci-beam.apache.org/job/beam_PostCommit_Python38/ws/src/build/gradleenv/-1734967051/lib/python3.8/site-packages/nose/suite.py",> line 293, in setUp
    self.setupContext(ancestor)
  File "<https://ci-beam.apache.org/job/beam_PostCommit_Python38/ws/src/build/gradleenv/-1734967051/lib/python3.8/site-packages/nose/plugins/multiprocess.py",> line 770, in setupContext
    super(NoSharedFixtureContextSuite, self).setupContext(context)
  File "<https://ci-beam.apache.org/job/beam_PostCommit_Python38/ws/src/build/gradleenv/-1734967051/lib/python3.8/site-packages/nose/suite.py",> line 316, in setupContext
    try_run(context, names)
  File "<https://ci-beam.apache.org/job/beam_PostCommit_Python38/ws/src/build/gradleenv/-1734967051/lib/python3.8/site-packages/nose/util.py",> line 471, in try_run
    return func()
  File "<https://ci-beam.apache.org/job/beam_PostCommit_Python38/ws/src/sdks/python/apache_beam/io/gcp/experimental/spannerio_write_it_test.py",> line 105, in setUpClass
    cls._create_database()
  File "<https://ci-beam.apache.org/job/beam_PostCommit_Python38/ws/src/sdks/python/apache_beam/io/gcp/experimental/spannerio_write_it_test.py",> line 73, in _create_database
    operation = database.create()
  File "<https://ci-beam.apache.org/job/beam_PostCommit_Python38/ws/src/build/gradleenv/-1734967051/lib/python3.8/site-packages/google/cloud/spanner_v1/database.py",> line 268, in create
    future = api.create_database(
  File "<https://ci-beam.apache.org/job/beam_PostCommit_Python38/ws/src/build/gradleenv/-1734967051/lib/python3.8/site-packages/google/cloud/spanner_admin_database_v1/gapic/database_admin_client.py",> line 333, in create_database
    operation = self._inner_api_calls["create_database"](
  File "<https://ci-beam.apache.org/job/beam_PostCommit_Python38/ws/src/build/gradleenv/-1734967051/lib/python3.8/site-packages/google/api_core/gapic_v1/method.py",> line 145, in __call__
    return wrapped_func(*args, **kwargs)
  File "<https://ci-beam.apache.org/job/beam_PostCommit_Python38/ws/src/build/gradleenv/-1734967051/lib/python3.8/site-packages/google/api_core/retry.py",> line 281, in retry_wrapped_func
    return retry_target(
  File "<https://ci-beam.apache.org/job/beam_PostCommit_Python38/ws/src/build/gradleenv/-1734967051/lib/python3.8/site-packages/google/api_core/retry.py",> line 184, in retry_target
    return target()
  File "<https://ci-beam.apache.org/job/beam_PostCommit_Python38/ws/src/build/gradleenv/-1734967051/lib/python3.8/site-packages/google/api_core/timeout.py",> line 214, in func_with_timeout
    return func(*args, **kwargs)
  File "<https://ci-beam.apache.org/job/beam_PostCommit_Python38/ws/src/build/gradleenv/-1734967051/lib/python3.8/site-packages/google/api_core/grpc_helpers.py",> line 59, in error_remapped_callable
    six.raise_from(exceptions.from_grpc_error(exc), exc)
  File "<string>", line 3, in raise_from
google.api_core.exceptions.ResourceExhausted: 429 The instance projects/apache-beam-testing/instances/beam-test has too many database splits to complete the operation.  Please add more nodes and try again.
-------------------- >> begin captured logging << --------------------
apache_beam.io.gcp.experimental.spannerio_read_it_test: INFO: .... PyVersion ---> 3.8.5 (default, Jul 20 2020, 19:50:14) 
[GCC 5.4.0 20160609]
apache_beam.io.gcp.experimental.spannerio_read_it_test: INFO: .... Setting up!
google.auth._default: DEBUG: Checking None for explicit credentials as part of auth process...
google.auth._default: DEBUG: Checking Cloud SDK credentials as part of auth process...
google.auth._default: DEBUG: Cloud SDK credentials not found on disk; not using them
google.auth._default: DEBUG: Checking for App Engine runtime as part of auth process...
google.auth._default: DEBUG: No App Engine library was found so cannot authentication via App Engine Identity Credentials.
google.auth.transport._http_client: DEBUG: Making request: GET http://169.254.169.254
google.auth.transport._http_client: DEBUG: Making request: GET http://metadata.google.internal/computeMetadata/v1/project/project-id
google.auth._default: DEBUG: Checking None for explicit credentials as part of auth process...
google.auth._default: DEBUG: Checking Cloud SDK credentials as part of auth process...
google.auth._default: DEBUG: Cloud SDK credentials not found on disk; not using them
google.auth._default: DEBUG: Checking for App Engine runtime as part of auth process...
google.auth._default: DEBUG: No App Engine library was found so cannot authentication via App Engine Identity Credentials.
google.auth.transport._http_client: DEBUG: Making request: GET http://169.254.169.254
google.auth.transport._http_client: DEBUG: Making request: GET http://metadata.google.internal/computeMetadata/v1/project/project-id
apache_beam.io.gcp.experimental.spannerio_read_it_test: INFO: .... Spanner Client created!
apache_beam.io.gcp.experimental.spannerio_read_it_test: INFO: Creating test database: pybeam-read-b016170e7de790a
google.auth.transport.requests: DEBUG: Making request: GET http://metadata.google.internal/computeMetadata/v1/instance/service-accounts/default/?recursive=true
urllib3.connectionpool: DEBUG: Starting new HTTP connection (1): metadata.google.internal:80
urllib3.connectionpool: DEBUG: http://metadata.google.internal:80 "GET /computeMetadata/v1/instance/service-accounts/default/?recursive=true HTTP/1.1" 200 144
google.auth.transport.requests: DEBUG: Making request: GET http://metadata.google.internal/computeMetadata/v1/instance/service-accounts/844138762903-compute@developer.gserviceaccount.com/token?scopes=https%3A%2F%2Fwww.googleapis.com%2Fauth%2Fspanner.admin
urllib3.connectionpool: DEBUG: http://metadata.google.internal:80 "GET /computeMetadata/v1/instance/service-accounts/844138762903-compute@developer.gserviceaccount.com/token?scopes=https%3A%2F%2Fwww.googleapis.com%2Fauth%2Fspanner.admin HTTP/1.1" 200 241
apache_beam.io.gcp.experimental.spannerio_write_it_test: INFO: .... Setting up!
google.auth._default: DEBUG: Checking None for explicit credentials as part of auth process...
google.auth._default: DEBUG: Checking Cloud SDK credentials as part of auth process...
google.auth._default: DEBUG: Cloud SDK credentials not found on disk; not using them
google.auth._default: DEBUG: Checking for App Engine runtime as part of auth process...
google.auth._default: DEBUG: No App Engine library was found so cannot authentication via App Engine Identity Credentials.
google.auth.transport._http_client: DEBUG: Making request: GET http://169.254.169.254
google.auth.transport._http_client: DEBUG: Making request: GET http://metadata.google.internal/computeMetadata/v1/project/project-id
google.auth._default: DEBUG: Checking None for explicit credentials as part of auth process...
google.auth._default: DEBUG: Checking Cloud SDK credentials as part of auth process...
google.auth._default: DEBUG: Cloud SDK credentials not found on disk; not using them
google.auth._default: DEBUG: Checking for App Engine runtime as part of auth process...
google.auth._default: DEBUG: No App Engine library was found so cannot authentication via App Engine Identity Credentials.
google.auth.transport._http_client: DEBUG: Making request: GET http://169.254.169.254
google.auth.transport._http_client: DEBUG: Making request: GET http://metadata.google.internal/computeMetadata/v1/project/project-id
apache_beam.io.gcp.experimental.spannerio_write_it_test: INFO: .... Spanner Client created!
apache_beam.io.gcp.experimental.spannerio_write_it_test: INFO: Creating test database: pybeam-write-b6dcb0d0199ec52
google.auth.transport.requests: DEBUG: Making request: GET http://metadata.google.internal/computeMetadata/v1/instance/service-accounts/default/?recursive=true
urllib3.connectionpool: DEBUG: Starting new HTTP connection (1): metadata.google.internal:80
urllib3.connectionpool: DEBUG: http://metadata.google.internal:80 "GET /computeMetadata/v1/instance/service-accounts/default/?recursive=true HTTP/1.1" 200 144
google.auth.transport.requests: DEBUG: Making request: GET http://metadata.google.internal/computeMetadata/v1/instance/service-accounts/844138762903-compute@developer.gserviceaccount.com/token?scopes=https%3A%2F%2Fwww.googleapis.com%2Fauth%2Fspanner.admin
urllib3.connectionpool: DEBUG: http://metadata.google.internal:80 "GET /computeMetadata/v1/instance/service-accounts/844138762903-compute@developer.gserviceaccount.com/token?scopes=https%3A%2F%2Fwww.googleapis.com%2Fauth%2Fspanner.admin HTTP/1.1" 200 241
--------------------- >> end captured logging << ---------------------

----------------------------------------------------------------------
XML: nosetests-postCommitIT-df-py38.xml
----------------------------------------------------------------------
XML: <https://ci-beam.apache.org/job/beam_PostCommit_Python38/ws/src/sdks/python/nosetests.xml>
----------------------------------------------------------------------
Ran 63 tests in 3930.827s

FAILED (SKIP=7, errors=2)

> Task :sdks:python:test-suites:dataflow:py38:postCommitIT FAILED

FAILURE: Build completed with 2 failures.

1: Task failed with an exception.
-----------
* Where:
Script '<https://ci-beam.apache.org/job/beam_PostCommit_Python38/ws/src/sdks/python/test-suites/direct/common.gradle'> line: 55

* What went wrong:
Execution failed for task ':sdks:python:test-suites:direct:py38:postCommitIT'.
> Process 'command 'sh'' finished with non-zero exit value 1

* Try:
Run with --stacktrace option to get the stack trace. Run with --info or --debug option to get more log output. Run with --scan to get full insights.
==============================================================================

2: Task failed with an exception.
-----------
* Where:
Script '<https://ci-beam.apache.org/job/beam_PostCommit_Python38/ws/src/sdks/python/test-suites/dataflow/common.gradle'> line: 118

* What went wrong:
Execution failed for task ':sdks:python:test-suites:dataflow:py38:postCommitIT'.
> Process 'command 'sh'' finished with non-zero exit value 1

* Try:
Run with --stacktrace option to get the stack trace. Run with --info or --debug option to get more log output. Run with --scan to get full insights.
==============================================================================

* Get more help at https://help.gradle.org

Deprecated Gradle features were used in this build, making it incompatible with Gradle 7.0.
Use '--warning-mode all' to show the individual deprecation warnings.
See https://docs.gradle.org/6.7/userguide/command_line_interface.html#sec:command_line_warnings

BUILD FAILED in 1h 9m 45s
209 actionable tasks: 165 executed, 40 from cache, 4 up-to-date
Gradle was unable to watch the file system for changes. The inotify watches limit is too low.

Publishing build scan...
https://gradle.com/s/lgdxvg7mf5kys

Build step 'Invoke Gradle script' changed build result to FAILURE
Build step 'Invoke Gradle script' marked build as failure

---------------------------------------------------------------------
To unsubscribe, e-mail: builds-unsubscribe@beam.apache.org
For additional commands, e-mail: builds-help@beam.apache.org


Build failed in Jenkins: beam_PostCommit_Python38 #594

Posted by Apache Jenkins Server <je...@builds.apache.org>.
See <https://ci-beam.apache.org/job/beam_PostCommit_Python38/594/display/redirect?page=changes>

Changes:

[noreply] Merge pull request #12779 from [BEAM-10856] Support for


------------------------------------------
[...truncated 37.34 MB...]
test_read_queries (apache_beam.io.gcp.bigquery_read_it_test.ReadAllBQTests) ... ok
test_bqfl_streaming (apache_beam.io.gcp.bigquery_file_loads_test.BigQueryFileLoadsIT) ... SKIP: TestStream is not supported on TestDataflowRunner
test_multiple_destinations_transform (apache_beam.io.gcp.bigquery_file_loads_test.BigQueryFileLoadsIT) ... ok
test_one_job_fails_all_jobs_fail (apache_beam.io.gcp.bigquery_file_loads_test.BigQueryFileLoadsIT) ... ok
test_bigquery_read_1M_python (apache_beam.io.gcp.bigquery_io_read_it_test.BigqueryIOReadIT) ... ok
test_bigquery_read_custom_1M_python (apache_beam.io.gcp.bigquery_io_read_it_test.BigqueryIOReadIT) ... ok
test_avro_file_load (apache_beam.io.gcp.bigquery_test.BigQueryFileLoadsIntegrationTests) ... ok
test_iobase_source (apache_beam.io.gcp.bigquery_read_it_test.ReadNewTypesTests) ... ok
test_native_source (apache_beam.io.gcp.bigquery_read_it_test.ReadNewTypesTests) ... ok
test_multiple_destinations_transform (apache_beam.io.gcp.bigquery_test.BigQueryStreamingInsertTransformIntegrationTests) ... ok
test_copy (apache_beam.io.gcp.gcsio_integration_test.GcsIOIntegrationTest) ... ok
test_copy_batch (apache_beam.io.gcp.gcsio_integration_test.GcsIOIntegrationTest) ... ok
test_copy_batch_kms (apache_beam.io.gcp.gcsio_integration_test.GcsIOIntegrationTest) ... ok
test_copy_batch_rewrite_token (apache_beam.io.gcp.gcsio_integration_test.GcsIOIntegrationTest) ... ok
test_copy_kms (apache_beam.io.gcp.gcsio_integration_test.GcsIOIntegrationTest) ... ok
test_copy_rewrite_token (apache_beam.io.gcp.gcsio_integration_test.GcsIOIntegrationTest) ... ok
test_iobase_source (apache_beam.io.gcp.bigquery_read_it_test.ReadTests) ... ok
test_native_source (apache_beam.io.gcp.bigquery_read_it_test.ReadTests) ... ok
test_value_provider_transform (apache_beam.io.gcp.bigquery_test.BigQueryStreamingInsertTransformIntegrationTests) ... ok
test_transform_on_gcs (apache_beam.io.fileio_test.MatchIntegrationTest) ... ok
test_datastore_write_limit (apache_beam.io.gcp.datastore.v1new.datastore_write_it_test.DatastoreWriteIT) ... ok
test_streaming_data_only (apache_beam.io.gcp.pubsub_integration_test.PubSubIntegrationTest) ... ok
test_streaming_with_attributes (apache_beam.io.gcp.pubsub_integration_test.PubSubIntegrationTest) ... ok
test_file_loads (apache_beam.io.gcp.bigquery_test.PubSubBigQueryIT) ... SKIP: https://issuetracker.google.com/issues/118375066
test_streaming_inserts (apache_beam.io.gcp.bigquery_test.PubSubBigQueryIT) ... ok
test_parquetio_it (apache_beam.io.parquetio_it_test.TestParquetIT) ... ok
test_dicom_search_instances (apache_beam.io.gcp.dicomio_integration_test.DICOMIoIntegrationTest) ... ok
test_dicom_store_instance_from_gcs (apache_beam.io.gcp.dicomio_integration_test.DICOMIoIntegrationTest) ... ok
test_analyzing_syntax (apache_beam.ml.gcp.naturallanguageml_test_it.NaturalLanguageMlTestIT) ... ok
test_text_detection_with_language_hint (apache_beam.ml.gcp.visionml_test_it.VisionMlTestIT) ... ok
test_basic_execution (apache_beam.testing.test_stream_it_test.TestStreamIntegrationTests) ... SKIP: The "TestDataflowRunner", does not support the TestStream transform. Supported runners: ['DirectRunner', 'SwitchingDirectRunner']
Tests that the TestStream supports emitting to multiple PCollections. ... SKIP: The "TestDataflowRunner", does not support the TestStream transform. Supported runners: ['DirectRunner', 'SwitchingDirectRunner']
Tests that the TestStream can independently control output watermarks. ... SKIP: The "TestDataflowRunner", does not support the TestStream transform. Supported runners: ['DirectRunner', 'SwitchingDirectRunner']
test_big_query_write (apache_beam.io.gcp.bigquery_write_it_test.BigQueryWriteIntegrationTests) ... ok
test_big_query_write_new_types (apache_beam.io.gcp.bigquery_write_it_test.BigQueryWriteIntegrationTests) ... ok
test_big_query_write_schema_autodetect (apache_beam.io.gcp.bigquery_write_it_test.BigQueryWriteIntegrationTests) ... SKIP: DataflowRunner does not support schema autodetection
test_big_query_write_without_schema (apache_beam.io.gcp.bigquery_write_it_test.BigQueryWriteIntegrationTests) ... ok
Runs streaming Dataflow job and verifies that user metrics are reported ... ok
test_label_detection_with_video_context (apache_beam.ml.gcp.videointelligenceml_test_it.VideoIntelligenceMlTestIT) ... ok
test_deidentification (apache_beam.ml.gcp.cloud_dlp_it_test.CloudDLPIT) ... ok
test_inspection (apache_beam.ml.gcp.cloud_dlp_it_test.CloudDLPIT) ... ok
test_big_query_legacy_sql (apache_beam.io.gcp.big_query_query_to_table_it_test.BigQueryQueryToTableIT) ... ok
test_big_query_new_types (apache_beam.io.gcp.big_query_query_to_table_it_test.BigQueryQueryToTableIT) ... ok
test_big_query_new_types_avro (apache_beam.io.gcp.big_query_query_to_table_it_test.BigQueryQueryToTableIT) ... ok
test_big_query_new_types_native (apache_beam.io.gcp.big_query_query_to_table_it_test.BigQueryQueryToTableIT) ... ok
test_big_query_standard_sql (apache_beam.io.gcp.big_query_query_to_table_it_test.BigQueryQueryToTableIT) ... ok
test_big_query_standard_sql_kms_key_native (apache_beam.io.gcp.big_query_query_to_table_it_test.BigQueryQueryToTableIT) ... ok
test_job_python_from_python_it (apache_beam.transforms.external_it_test.ExternalTransformIT) ... ok
test_metrics_fnapi_it (apache_beam.runners.dataflow.dataflow_exercise_metrics_pipeline_test.ExerciseMetricsPipelineTest) ... ok
test_metrics_it (apache_beam.runners.dataflow.dataflow_exercise_metrics_pipeline_test.ExerciseMetricsPipelineTest) ... ok

======================================================================
ERROR: test suite for <class 'apache_beam.io.gcp.experimental.spannerio_read_it_test.SpannerReadIntegrationTest'>
----------------------------------------------------------------------
Traceback (most recent call last):
  File "<https://ci-beam.apache.org/job/beam_PostCommit_Python38/ws/src/build/gradleenv/-1734967051/lib/python3.8/site-packages/nose/plugins/multiprocess.py",> line 788, in run
    self.setUp()
  File "<https://ci-beam.apache.org/job/beam_PostCommit_Python38/ws/src/build/gradleenv/-1734967051/lib/python3.8/site-packages/nose/suite.py",> line 293, in setUp
    self.setupContext(ancestor)
  File "<https://ci-beam.apache.org/job/beam_PostCommit_Python38/ws/src/build/gradleenv/-1734967051/lib/python3.8/site-packages/nose/plugins/multiprocess.py",> line 770, in setupContext
    super(NoSharedFixtureContextSuite, self).setupContext(context)
  File "<https://ci-beam.apache.org/job/beam_PostCommit_Python38/ws/src/build/gradleenv/-1734967051/lib/python3.8/site-packages/nose/suite.py",> line 316, in setupContext
    try_run(context, names)
  File "<https://ci-beam.apache.org/job/beam_PostCommit_Python38/ws/src/build/gradleenv/-1734967051/lib/python3.8/site-packages/nose/util.py",> line 471, in try_run
    return func()
  File "<https://ci-beam.apache.org/job/beam_PostCommit_Python38/ws/src/sdks/python/apache_beam/io/gcp/experimental/spannerio_read_it_test.py",> line 102, in setUpClass
    cls._create_database()
  File "<https://ci-beam.apache.org/job/beam_PostCommit_Python38/ws/src/sdks/python/apache_beam/io/gcp/experimental/spannerio_read_it_test.py",> line 76, in _create_database
    operation = database.create()
  File "<https://ci-beam.apache.org/job/beam_PostCommit_Python38/ws/src/build/gradleenv/-1734967051/lib/python3.8/site-packages/google/cloud/spanner_v1/database.py",> line 268, in create
    future = api.create_database(
  File "<https://ci-beam.apache.org/job/beam_PostCommit_Python38/ws/src/build/gradleenv/-1734967051/lib/python3.8/site-packages/google/cloud/spanner_admin_database_v1/gapic/database_admin_client.py",> line 333, in create_database
    operation = self._inner_api_calls["create_database"](
  File "<https://ci-beam.apache.org/job/beam_PostCommit_Python38/ws/src/build/gradleenv/-1734967051/lib/python3.8/site-packages/google/api_core/gapic_v1/method.py",> line 145, in __call__
    return wrapped_func(*args, **kwargs)
  File "<https://ci-beam.apache.org/job/beam_PostCommit_Python38/ws/src/build/gradleenv/-1734967051/lib/python3.8/site-packages/google/api_core/retry.py",> line 281, in retry_wrapped_func
    return retry_target(
  File "<https://ci-beam.apache.org/job/beam_PostCommit_Python38/ws/src/build/gradleenv/-1734967051/lib/python3.8/site-packages/google/api_core/retry.py",> line 184, in retry_target
    return target()
  File "<https://ci-beam.apache.org/job/beam_PostCommit_Python38/ws/src/build/gradleenv/-1734967051/lib/python3.8/site-packages/google/api_core/timeout.py",> line 214, in func_with_timeout
    return func(*args, **kwargs)
  File "<https://ci-beam.apache.org/job/beam_PostCommit_Python38/ws/src/build/gradleenv/-1734967051/lib/python3.8/site-packages/google/api_core/grpc_helpers.py",> line 59, in error_remapped_callable
    six.raise_from(exceptions.from_grpc_error(exc), exc)
  File "<string>", line 3, in raise_from
google.api_core.exceptions.ResourceExhausted: 429 The instance projects/apache-beam-testing/instances/beam-test has too many database splits to complete the operation.  Please add more nodes and try again.
-------------------- >> begin captured logging << --------------------
apache_beam.io.gcp.experimental.spannerio_read_it_test: INFO: .... PyVersion ---> 3.8.5 (default, Jul 20 2020, 19:50:14) 
[GCC 5.4.0 20160609]
apache_beam.io.gcp.experimental.spannerio_read_it_test: INFO: .... Setting up!
google.auth._default: DEBUG: Checking None for explicit credentials as part of auth process...
google.auth._default: DEBUG: Checking Cloud SDK credentials as part of auth process...
google.auth._default: DEBUG: Cloud SDK credentials not found on disk; not using them
google.auth._default: DEBUG: Checking for App Engine runtime as part of auth process...
google.auth._default: DEBUG: No App Engine library was found so cannot authentication via App Engine Identity Credentials.
google.auth.transport._http_client: DEBUG: Making request: GET http://169.254.169.254
google.auth.transport._http_client: DEBUG: Making request: GET http://metadata.google.internal/computeMetadata/v1/project/project-id
google.auth._default: DEBUG: Checking None for explicit credentials as part of auth process...
google.auth._default: DEBUG: Checking Cloud SDK credentials as part of auth process...
google.auth._default: DEBUG: Cloud SDK credentials not found on disk; not using them
google.auth._default: DEBUG: Checking for App Engine runtime as part of auth process...
google.auth._default: DEBUG: No App Engine library was found so cannot authentication via App Engine Identity Credentials.
google.auth.transport._http_client: DEBUG: Making request: GET http://169.254.169.254
google.auth.transport._http_client: DEBUG: Making request: GET http://metadata.google.internal/computeMetadata/v1/project/project-id
apache_beam.io.gcp.experimental.spannerio_read_it_test: INFO: .... Spanner Client created!
apache_beam.io.gcp.experimental.spannerio_read_it_test: INFO: Creating test database: pybeam-read-6aa176dfff42535
google.auth.transport.requests: DEBUG: Making request: GET http://metadata.google.internal/computeMetadata/v1/instance/service-accounts/default/?recursive=true
urllib3.connectionpool: DEBUG: Starting new HTTP connection (1): metadata.google.internal:80
urllib3.connectionpool: DEBUG: http://metadata.google.internal:80 "GET /computeMetadata/v1/instance/service-accounts/default/?recursive=true HTTP/1.1" 200 144
google.auth.transport.requests: DEBUG: Making request: GET http://metadata.google.internal/computeMetadata/v1/instance/service-accounts/844138762903-compute@developer.gserviceaccount.com/token?scopes=https%3A%2F%2Fwww.googleapis.com%2Fauth%2Fspanner.admin
urllib3.connectionpool: DEBUG: http://metadata.google.internal:80 "GET /computeMetadata/v1/instance/service-accounts/844138762903-compute@developer.gserviceaccount.com/token?scopes=https%3A%2F%2Fwww.googleapis.com%2Fauth%2Fspanner.admin HTTP/1.1" 200 241
--------------------- >> end captured logging << ---------------------

======================================================================
ERROR: test suite for <class 'apache_beam.io.gcp.experimental.spannerio_write_it_test.SpannerWriteIntegrationTest'>
----------------------------------------------------------------------
Traceback (most recent call last):
  File "<https://ci-beam.apache.org/job/beam_PostCommit_Python38/ws/src/build/gradleenv/-1734967051/lib/python3.8/site-packages/nose/plugins/multiprocess.py",> line 788, in run
    self.setUp()
  File "<https://ci-beam.apache.org/job/beam_PostCommit_Python38/ws/src/build/gradleenv/-1734967051/lib/python3.8/site-packages/nose/suite.py",> line 293, in setUp
    self.setupContext(ancestor)
  File "<https://ci-beam.apache.org/job/beam_PostCommit_Python38/ws/src/build/gradleenv/-1734967051/lib/python3.8/site-packages/nose/plugins/multiprocess.py",> line 770, in setupContext
    super(NoSharedFixtureContextSuite, self).setupContext(context)
  File "<https://ci-beam.apache.org/job/beam_PostCommit_Python38/ws/src/build/gradleenv/-1734967051/lib/python3.8/site-packages/nose/suite.py",> line 316, in setupContext
    try_run(context, names)
  File "<https://ci-beam.apache.org/job/beam_PostCommit_Python38/ws/src/build/gradleenv/-1734967051/lib/python3.8/site-packages/nose/util.py",> line 471, in try_run
    return func()
  File "<https://ci-beam.apache.org/job/beam_PostCommit_Python38/ws/src/sdks/python/apache_beam/io/gcp/experimental/spannerio_write_it_test.py",> line 105, in setUpClass
    cls._create_database()
  File "<https://ci-beam.apache.org/job/beam_PostCommit_Python38/ws/src/sdks/python/apache_beam/io/gcp/experimental/spannerio_write_it_test.py",> line 73, in _create_database
    operation = database.create()
  File "<https://ci-beam.apache.org/job/beam_PostCommit_Python38/ws/src/build/gradleenv/-1734967051/lib/python3.8/site-packages/google/cloud/spanner_v1/database.py",> line 268, in create
    future = api.create_database(
  File "<https://ci-beam.apache.org/job/beam_PostCommit_Python38/ws/src/build/gradleenv/-1734967051/lib/python3.8/site-packages/google/cloud/spanner_admin_database_v1/gapic/database_admin_client.py",> line 333, in create_database
    operation = self._inner_api_calls["create_database"](
  File "<https://ci-beam.apache.org/job/beam_PostCommit_Python38/ws/src/build/gradleenv/-1734967051/lib/python3.8/site-packages/google/api_core/gapic_v1/method.py",> line 145, in __call__
    return wrapped_func(*args, **kwargs)
  File "<https://ci-beam.apache.org/job/beam_PostCommit_Python38/ws/src/build/gradleenv/-1734967051/lib/python3.8/site-packages/google/api_core/retry.py",> line 281, in retry_wrapped_func
    return retry_target(
  File "<https://ci-beam.apache.org/job/beam_PostCommit_Python38/ws/src/build/gradleenv/-1734967051/lib/python3.8/site-packages/google/api_core/retry.py",> line 184, in retry_target
    return target()
  File "<https://ci-beam.apache.org/job/beam_PostCommit_Python38/ws/src/build/gradleenv/-1734967051/lib/python3.8/site-packages/google/api_core/timeout.py",> line 214, in func_with_timeout
    return func(*args, **kwargs)
  File "<https://ci-beam.apache.org/job/beam_PostCommit_Python38/ws/src/build/gradleenv/-1734967051/lib/python3.8/site-packages/google/api_core/grpc_helpers.py",> line 59, in error_remapped_callable
    six.raise_from(exceptions.from_grpc_error(exc), exc)
  File "<string>", line 3, in raise_from
google.api_core.exceptions.ResourceExhausted: 429 The instance projects/apache-beam-testing/instances/beam-test has too many database splits to complete the operation.  Please add more nodes and try again.
-------------------- >> begin captured logging << --------------------
apache_beam.io.gcp.experimental.spannerio_read_it_test: INFO: .... PyVersion ---> 3.8.5 (default, Jul 20 2020, 19:50:14) 
[GCC 5.4.0 20160609]
apache_beam.io.gcp.experimental.spannerio_read_it_test: INFO: .... Setting up!
google.auth._default: DEBUG: Checking None for explicit credentials as part of auth process...
google.auth._default: DEBUG: Checking Cloud SDK credentials as part of auth process...
google.auth._default: DEBUG: Cloud SDK credentials not found on disk; not using them
google.auth._default: DEBUG: Checking for App Engine runtime as part of auth process...
google.auth._default: DEBUG: No App Engine library was found so cannot authentication via App Engine Identity Credentials.
google.auth.transport._http_client: DEBUG: Making request: GET http://169.254.169.254
google.auth.transport._http_client: DEBUG: Making request: GET http://metadata.google.internal/computeMetadata/v1/project/project-id
google.auth._default: DEBUG: Checking None for explicit credentials as part of auth process...
google.auth._default: DEBUG: Checking Cloud SDK credentials as part of auth process...
google.auth._default: DEBUG: Cloud SDK credentials not found on disk; not using them
google.auth._default: DEBUG: Checking for App Engine runtime as part of auth process...
google.auth._default: DEBUG: No App Engine library was found so cannot authentication via App Engine Identity Credentials.
google.auth.transport._http_client: DEBUG: Making request: GET http://169.254.169.254
google.auth.transport._http_client: DEBUG: Making request: GET http://metadata.google.internal/computeMetadata/v1/project/project-id
apache_beam.io.gcp.experimental.spannerio_read_it_test: INFO: .... Spanner Client created!
apache_beam.io.gcp.experimental.spannerio_read_it_test: INFO: Creating test database: pybeam-read-6aa176dfff42535
google.auth.transport.requests: DEBUG: Making request: GET http://metadata.google.internal/computeMetadata/v1/instance/service-accounts/default/?recursive=true
urllib3.connectionpool: DEBUG: Starting new HTTP connection (1): metadata.google.internal:80
urllib3.connectionpool: DEBUG: http://metadata.google.internal:80 "GET /computeMetadata/v1/instance/service-accounts/default/?recursive=true HTTP/1.1" 200 144
google.auth.transport.requests: DEBUG: Making request: GET http://metadata.google.internal/computeMetadata/v1/instance/service-accounts/844138762903-compute@developer.gserviceaccount.com/token?scopes=https%3A%2F%2Fwww.googleapis.com%2Fauth%2Fspanner.admin
urllib3.connectionpool: DEBUG: http://metadata.google.internal:80 "GET /computeMetadata/v1/instance/service-accounts/844138762903-compute@developer.gserviceaccount.com/token?scopes=https%3A%2F%2Fwww.googleapis.com%2Fauth%2Fspanner.admin HTTP/1.1" 200 241
apache_beam.io.gcp.experimental.spannerio_write_it_test: INFO: .... Setting up!
google.auth._default: DEBUG: Checking None for explicit credentials as part of auth process...
google.auth._default: DEBUG: Checking Cloud SDK credentials as part of auth process...
google.auth._default: DEBUG: Cloud SDK credentials not found on disk; not using them
google.auth._default: DEBUG: Checking for App Engine runtime as part of auth process...
google.auth._default: DEBUG: No App Engine library was found so cannot authentication via App Engine Identity Credentials.
google.auth.transport._http_client: DEBUG: Making request: GET http://169.254.169.254
google.auth.transport._http_client: DEBUG: Making request: GET http://metadata.google.internal/computeMetadata/v1/project/project-id
google.auth._default: DEBUG: Checking None for explicit credentials as part of auth process...
google.auth._default: DEBUG: Checking Cloud SDK credentials as part of auth process...
google.auth._default: DEBUG: Cloud SDK credentials not found on disk; not using them
google.auth._default: DEBUG: Checking for App Engine runtime as part of auth process...
google.auth._default: DEBUG: No App Engine library was found so cannot authentication via App Engine Identity Credentials.
google.auth.transport._http_client: DEBUG: Making request: GET http://169.254.169.254
google.auth.transport._http_client: DEBUG: Making request: GET http://metadata.google.internal/computeMetadata/v1/project/project-id
apache_beam.io.gcp.experimental.spannerio_write_it_test: INFO: .... Spanner Client created!
apache_beam.io.gcp.experimental.spannerio_write_it_test: INFO: Creating test database: pybeam-write-926396921fa4464
google.auth.transport.requests: DEBUG: Making request: GET http://metadata.google.internal/computeMetadata/v1/instance/service-accounts/default/?recursive=true
urllib3.connectionpool: DEBUG: Starting new HTTP connection (1): metadata.google.internal:80
urllib3.connectionpool: DEBUG: http://metadata.google.internal:80 "GET /computeMetadata/v1/instance/service-accounts/default/?recursive=true HTTP/1.1" 200 144
google.auth.transport.requests: DEBUG: Making request: GET http://metadata.google.internal/computeMetadata/v1/instance/service-accounts/844138762903-compute@developer.gserviceaccount.com/token?scopes=https%3A%2F%2Fwww.googleapis.com%2Fauth%2Fspanner.admin
urllib3.connectionpool: DEBUG: http://metadata.google.internal:80 "GET /computeMetadata/v1/instance/service-accounts/844138762903-compute@developer.gserviceaccount.com/token?scopes=https%3A%2F%2Fwww.googleapis.com%2Fauth%2Fspanner.admin HTTP/1.1" 200 241
--------------------- >> end captured logging << ---------------------

----------------------------------------------------------------------
XML: nosetests-postCommitIT-df-py38.xml
----------------------------------------------------------------------
XML: <https://ci-beam.apache.org/job/beam_PostCommit_Python38/ws/src/sdks/python/nosetests.xml>
----------------------------------------------------------------------
Ran 63 tests in 4009.209s

FAILED (SKIP=7, errors=2)

> Task :sdks:python:test-suites:dataflow:py38:postCommitIT FAILED

FAILURE: Build completed with 2 failures.

1: Task failed with an exception.
-----------
* Where:
Script '<https://ci-beam.apache.org/job/beam_PostCommit_Python38/ws/src/sdks/python/test-suites/direct/common.gradle'> line: 55

* What went wrong:
Execution failed for task ':sdks:python:test-suites:direct:py38:postCommitIT'.
> Process 'command 'sh'' finished with non-zero exit value 1

* Try:
Run with --stacktrace option to get the stack trace. Run with --info or --debug option to get more log output. Run with --scan to get full insights.
==============================================================================

2: Task failed with an exception.
-----------
* Where:
Script '<https://ci-beam.apache.org/job/beam_PostCommit_Python38/ws/src/sdks/python/test-suites/dataflow/common.gradle'> line: 118

* What went wrong:
Execution failed for task ':sdks:python:test-suites:dataflow:py38:postCommitIT'.
> Process 'command 'sh'' finished with non-zero exit value 1

* Try:
Run with --stacktrace option to get the stack trace. Run with --info or --debug option to get more log output. Run with --scan to get full insights.
==============================================================================

* Get more help at https://help.gradle.org

Deprecated Gradle features were used in this build, making it incompatible with Gradle 7.0.
Use '--warning-mode all' to show the individual deprecation warnings.
See https://docs.gradle.org/6.7/userguide/command_line_interface.html#sec:command_line_warnings

BUILD FAILED in 1h 10m 9s
209 actionable tasks: 165 executed, 40 from cache, 4 up-to-date
Gradle was unable to watch the file system for changes. The inotify watches limit is too low.

Publishing build scan...
https://gradle.com/s/q2vfw5pt5k4c6

Build step 'Invoke Gradle script' changed build result to FAILURE
Build step 'Invoke Gradle script' marked build as failure

---------------------------------------------------------------------
To unsubscribe, e-mail: builds-unsubscribe@beam.apache.org
For additional commands, e-mail: builds-help@beam.apache.org


Build failed in Jenkins: beam_PostCommit_Python38 #593

Posted by Apache Jenkins Server <je...@builds.apache.org>.
See <https://ci-beam.apache.org/job/beam_PostCommit_Python38/593/display/redirect?page=changes>

Changes:

[piotr.szuberski] [BEAM-11173] Add Bigtable table with read operation

[noreply] Update python versions in pre-requisites (#13451)


------------------------------------------
[...truncated 37.60 MB...]
          {
            "encoding": {
              "@type": "kind:windowed_value",
              "component_encodings": [
                {
                  "@type": "kind:bytes"
                },
                {
                  "@type": "kind:global_window"
                }
              ],
              "is_wrapper": true
            },
            "output_name": "out",
            "user_name": "ReadFromPubSub/Read.out"
          }
        ],
        "pubsub_id_label": "id",
        "pubsub_subscription": "projects/apache-beam-testing/subscriptions/psit_subscription_inputf823a3e9-1c52-485d-a0ab-0ca15494a7aa",
        "pubsub_timestamp_label": "timestamp",
        "user_name": "ReadFromPubSub/Read"
      }
    },
    {
      "kind": "ParallelDo",
      "name": "s2",
      "properties": {
        "display_data": [
          {
            "key": "fn",
            "label": "Transform Function",
            "namespace": "apache_beam.transforms.core.ParDo",
            "shortValue": "CallableWrapperDoFn",
            "type": "STRING",
            "value": "apache_beam.transforms.core.CallableWrapperDoFn"
          },
          {
            "key": "fn",
            "label": "Transform Function",
            "namespace": "apache_beam.transforms.core.CallableWrapperDoFn",
            "type": "STRING",
            "value": "modify_data"
          }
        ],
        "non_parallel_inputs": {},
        "output_info": [
          {
            "encoding": {
              "@type": "kind:windowed_value",
              "component_encodings": [
                {
                  "@type": "kind:bytes"
                },
                {
                  "@type": "kind:global_window"
                }
              ],
              "is_wrapper": true
            },
            "output_name": "None",
            "user_name": "modify_data.out"
          }
        ],
        "parallel_input": {
          "@type": "OutputReference",
          "output_name": "out",
          "step_name": "s1"
        },
        "serialized_fn": "ref_AppliedPTransform_modify_data_4",
        "user_name": "modify_data"
      }
    },
    {
      "kind": "ParallelDo",
      "name": "s3",
      "properties": {
        "display_data": [
          {
            "key": "fn",
            "label": "Transform Function",
            "namespace": "apache_beam.transforms.core.ParDo",
            "shortValue": "CallableWrapperDoFn",
            "type": "STRING",
            "value": "apache_beam.transforms.core.CallableWrapperDoFn"
          },
          {
            "key": "fn",
            "label": "Transform Function",
            "namespace": "apache_beam.transforms.core.CallableWrapperDoFn",
            "type": "STRING",
            "value": "bytes_to_proto_str"
          }
        ],
        "non_parallel_inputs": {},
        "output_info": [
          {
            "encoding": {
              "@type": "kind:windowed_value",
              "component_encodings": [
                {
                  "@type": "kind:bytes"
                },
                {
                  "@type": "kind:global_window"
                }
              ],
              "is_wrapper": true
            },
            "output_name": "None",
            "user_name": "WriteToPubSub/ToProtobuf.out"
          }
        ],
        "parallel_input": {
          "@type": "OutputReference",
          "output_name": "None",
          "step_name": "s2"
        },
        "serialized_fn": "ref_AppliedPTransform_WriteToPubSub/ToProtobuf_6",
        "user_name": "WriteToPubSub/ToProtobuf"
      }
    },
    {
      "kind": "ParallelWrite",
      "name": "s4",
      "properties": {
        "display_data": [],
        "encoding": {
          "@type": "kind:windowed_value",
          "component_encodings": [
            {
              "@type": "kind:bytes"
            },
            {
              "@type": "kind:global_window"
            }
          ],
          "is_wrapper": true
        },
        "format": "pubsub",
        "parallel_input": {
          "@type": "OutputReference",
          "output_name": "None",
          "step_name": "s3"
        },
        "pubsub_id_label": "id",
        "pubsub_serialized_attributes_fn": "",
        "pubsub_timestamp_label": "timestamp",
        "pubsub_topic": "projects/apache-beam-testing/topics/psit_topic_outputf823a3e9-1c52-485d-a0ab-0ca15494a7aa",
        "user_name": "WriteToPubSub/Write/NativeWrite"
      }
    }
  ],
  "type": "JOB_TYPE_STREAMING"
}
apache_beam.runners.dataflow.internal.apiclient: INFO: Create job: <Job
 createTime: '2020-12-01T12:45:30.052368Z'
 currentStateTime: '1970-01-01T00:00:00Z'
 id: '2020-12-01_04_45_28-2746763265335953092'
 location: 'us-central1'
 name: 'beamapp-jenkins-1201124517-673772'
 projectId: 'apache-beam-testing'
 stageStates: []
 startTime: '2020-12-01T12:45:30.052368Z'
 steps: []
 tempFiles: []
 type: TypeValueValuesEnum(JOB_TYPE_STREAMING, 2)>
apache_beam.runners.dataflow.internal.apiclient: INFO: Created job with id: [2020-12-01_04_45_28-2746763265335953092]
apache_beam.runners.dataflow.internal.apiclient: INFO: Submitted job: 2020-12-01_04_45_28-2746763265335953092
apache_beam.runners.dataflow.internal.apiclient: INFO: To access the Dataflow monitoring console, please navigate to https://console.cloud.google.com/dataflow/jobs/us-central1/2020-12-01_04_45_28-2746763265335953092?project=apache-beam-testing
apache_beam.runners.dataflow.dataflow_runner: INFO: Job 2020-12-01_04_45_28-2746763265335953092 is in state JOB_STATE_RUNNING
apache_beam.runners.dataflow.dataflow_runner: INFO: 2020-12-01T12:45:32.816Z: JOB_MESSAGE_BASIC: Worker configuration: n1-standard-4 in us-central1-b.
apache_beam.runners.dataflow.dataflow_runner: INFO: 2020-12-01T12:45:34.515Z: JOB_MESSAGE_DETAILED: Expanding SplittableParDo operations into optimizable parts.
apache_beam.runners.dataflow.dataflow_runner: INFO: 2020-12-01T12:45:34.517Z: JOB_MESSAGE_DETAILED: Expanding CollectionToSingleton operations into optimizable parts.
apache_beam.runners.dataflow.dataflow_runner: INFO: 2020-12-01T12:45:34.524Z: JOB_MESSAGE_DETAILED: Expanding CoGroupByKey operations into optimizable parts.
apache_beam.runners.dataflow.dataflow_runner: INFO: 2020-12-01T12:45:34.533Z: JOB_MESSAGE_DETAILED: Expanding SplittableProcessKeyed operations into optimizable parts.
apache_beam.runners.dataflow.dataflow_runner: INFO: 2020-12-01T12:45:34.535Z: JOB_MESSAGE_DETAILED: Expanding GroupByKey operations into streaming Read/Write steps
apache_beam.runners.dataflow.dataflow_runner: INFO: 2020-12-01T12:45:34.538Z: JOB_MESSAGE_DEBUG: Annotating graph with Autotuner information.
apache_beam.runners.dataflow.dataflow_runner: INFO: 2020-12-01T12:45:34.546Z: JOB_MESSAGE_DETAILED: Fusing adjacent ParDo, Read, Write, and Flatten operations
apache_beam.runners.dataflow.dataflow_runner: INFO: 2020-12-01T12:45:34.548Z: JOB_MESSAGE_DETAILED: Fusing consumer modify_data into ReadFromPubSub/Read
apache_beam.runners.dataflow.dataflow_runner: INFO: 2020-12-01T12:45:34.551Z: JOB_MESSAGE_DETAILED: Fusing consumer WriteToPubSub/ToProtobuf into modify_data
apache_beam.runners.dataflow.dataflow_runner: INFO: 2020-12-01T12:45:34.553Z: JOB_MESSAGE_DETAILED: Fusing consumer WriteToPubSub/Write/NativeWrite into WriteToPubSub/ToProtobuf
apache_beam.runners.dataflow.dataflow_runner: INFO: 2020-12-01T12:45:34.561Z: JOB_MESSAGE_BASIC: The pubsub read for: projects/apache-beam-testing/subscriptions/psit_subscription_inputf823a3e9-1c52-485d-a0ab-0ca15494a7aa is configured to compute input data watermarks based on custom timestamp attribute timestamp. Cloud Dataflow has created an additional tracking subscription to do this, which will be cleaned up automatically. For details, see: https://cloud.google.com/dataflow/model/pubsub-io#timestamps-ids
apache_beam.runners.dataflow.dataflow_runner: INFO: 2020-12-01T12:45:34.563Z: JOB_MESSAGE_DEBUG: Adding StepResource setup and teardown to workflow graph.
apache_beam.runners.dataflow.dataflow_runner: INFO: 2020-12-01T12:45:34.599Z: JOB_MESSAGE_DEBUG: Adding workflow start and stop steps.
apache_beam.runners.dataflow.dataflow_runner: INFO: 2020-12-01T12:45:34.649Z: JOB_MESSAGE_DEBUG: Assigning stage ids.
apache_beam.runners.dataflow.dataflow_runner: INFO: 2020-12-01T12:45:34.801Z: JOB_MESSAGE_DEBUG: Executing wait step start2
apache_beam.runners.dataflow.dataflow_runner: INFO: 2020-12-01T12:45:34.816Z: JOB_MESSAGE_DEBUG: Starting worker pool setup.
apache_beam.runners.dataflow.dataflow_runner: INFO: 2020-12-01T12:45:34.820Z: JOB_MESSAGE_BASIC: Starting 1 workers...
apache_beam.runners.dataflow.dataflow_runner: INFO: 2020-12-01T12:45:35.615Z: JOB_MESSAGE_DETAILED: Pub/Sub resources set up for topic 'projects/apache-beam-testing/topics/psit_topic_inputf823a3e9-1c52-485d-a0ab-0ca15494a7aa'.
apache_beam.runners.dataflow.dataflow_runner: INFO: 2020-12-01T12:45:38.117Z: JOB_MESSAGE_BASIC: Executing operation ReadFromPubSub/Read+modify_data+WriteToPubSub/ToProtobuf+WriteToPubSub/Write/NativeWrite
apache_beam.runners.dataflow.dataflow_runner: INFO: 2020-12-01T12:46:02.698Z: JOB_MESSAGE_DEBUG: Executing input step topology_init_attach_disk_input_step
apache_beam.runners.dataflow.dataflow_runner: INFO: 2020-12-01T12:46:03.193Z: JOB_MESSAGE_BASIC: Worker configuration: n1-standard-4 in us-central1-b.
apache_beam.runners.dataflow.dataflow_runner: INFO: 2020-12-01T12:46:05.053Z: JOB_MESSAGE_BASIC: Your project already contains 100 Dataflow-created metric descriptors, so new user metrics of the form custom.googleapis.com/* will not be created. However, all user metrics are also available in the metric dataflow.googleapis.com/job/user_counter. If you rely on the custom metrics, you can delete old / unused metric descriptors. See https://developers.google.com/apis-explorer/#p/monitoring/v3/monitoring.projects.metricDescriptors.list and https://developers.google.com/apis-explorer/#p/monitoring/v3/monitoring.projects.metricDescriptors.delete
apache_beam.runners.dataflow.dataflow_runner: INFO: 2020-12-01T12:46:27.083Z: JOB_MESSAGE_DETAILED: Workers have started successfully.
apache_beam.runners.dataflow.dataflow_runner: WARNING: Timing out on waiting for job 2020-12-01_04_45_28-2746763265335953092 after 182 seconds
google.auth._default: DEBUG: Checking None for explicit credentials as part of auth process...
google.auth._default: DEBUG: Checking Cloud SDK credentials as part of auth process...
google.auth._default: DEBUG: Cloud SDK credentials not found on disk; not using them
google.auth._default: DEBUG: Checking for App Engine runtime as part of auth process...
google.auth._default: DEBUG: No App Engine library was found so cannot authentication via App Engine Identity Credentials.
google.auth.transport._http_client: DEBUG: Making request: GET http://169.254.169.254
google.auth.transport._http_client: DEBUG: Making request: GET http://metadata.google.internal/computeMetadata/v1/project/project-id
google.auth.transport.requests: DEBUG: Making request: GET http://metadata.google.internal/computeMetadata/v1/instance/service-accounts/default/?recursive=true
urllib3.connectionpool: DEBUG: Starting new HTTP connection (1): metadata.google.internal:80
urllib3.connectionpool: DEBUG: http://metadata.google.internal:80 "GET /computeMetadata/v1/instance/service-accounts/default/?recursive=true HTTP/1.1" 200 144
google.auth.transport.requests: DEBUG: Making request: GET http://metadata.google.internal/computeMetadata/v1/instance/service-accounts/844138762903-compute@developer.gserviceaccount.com/token?scopes=https%3A%2F%2Fwww.googleapis.com%2Fauth%2Fcloud-platform%2Chttps%3A%2F%2Fwww.googleapis.com%2Fauth%2Fpubsub
urllib3.connectionpool: DEBUG: http://metadata.google.internal:80 "GET /computeMetadata/v1/instance/service-accounts/844138762903-compute@developer.gserviceaccount.com/token?scopes=https%3A%2F%2Fwww.googleapis.com%2Fauth%2Fcloud-platform%2Chttps%3A%2F%2Fwww.googleapis.com%2Fauth%2Fpubsub HTTP/1.1" 200 241
apache_beam.io.gcp.tests.pubsub_matcher: ERROR: Timeout after 300 sec. Received 0 messages from projects/apache-beam-testing/subscriptions/psit_subscription_outputf823a3e9-1c52-485d-a0ab-0ca15494a7aa.
oauth2client.transport: INFO: Refreshing due to a 401 (attempt 1/2)
--------------------- >> end captured logging << ---------------------

----------------------------------------------------------------------
XML: nosetests-postCommitIT-df-py38.xml
----------------------------------------------------------------------
XML: <https://ci-beam.apache.org/job/beam_PostCommit_Python38/ws/src/sdks/python/nosetests.xml>
----------------------------------------------------------------------
Ran 63 tests in 4232.673s

FAILED (SKIP=7, errors=2, failures=1)

> Task :sdks:python:test-suites:dataflow:py38:postCommitIT FAILED

FAILURE: Build failed with an exception.

* Where:
Script '<https://ci-beam.apache.org/job/beam_PostCommit_Python38/ws/src/sdks/python/test-suites/dataflow/common.gradle'> line: 118

* What went wrong:
Execution failed for task ':sdks:python:test-suites:dataflow:py38:postCommitIT'.
> Process 'command 'sh'' finished with non-zero exit value 1

* Try:
Run with --stacktrace option to get the stack trace. Run with --info or --debug option to get more log output. Run with --scan to get full insights.

* Get more help at https://help.gradle.org

Deprecated Gradle features were used in this build, making it incompatible with Gradle 7.0.
Use '--warning-mode all' to show the individual deprecation warnings.
See https://docs.gradle.org/6.7/userguide/command_line_interface.html#sec:command_line_warnings

BUILD FAILED in 1h 15m 54s
209 actionable tasks: 166 executed, 39 from cache, 4 up-to-date
Gradle was unable to watch the file system for changes. The inotify watches limit is too low.

Publishing build scan...
https://gradle.com/s/5ecei5cuv5ejm

Build step 'Invoke Gradle script' changed build result to FAILURE
Build step 'Invoke Gradle script' marked build as failure

---------------------------------------------------------------------
To unsubscribe, e-mail: builds-unsubscribe@beam.apache.org
For additional commands, e-mail: builds-help@beam.apache.org