You are viewing a plain text version of this content. The canonical link for it is here.
Posted to yarn-dev@hadoop.apache.org by Apache Jenkins Server <je...@builds.apache.org> on 2015/05/20 11:32:34 UTC

Failed: YARN-2336 PreCommit Build #8020

Jira: https://issues.apache.org/jira/browse/YARN-2336
Build: https://builds.apache.org/job/PreCommit-YARN-Build/8020/

###################################################################################
########################## LAST 60 LINES OF THE CONSOLE ###########################
[...truncated 280 lines...]
|  +1  |               site  |  2m 57s    | Site still builds. 
|  -1  |         checkstyle  |  0m 45s    | The applied patch generated 1 new 
|      |                     |            | checkstyle issues (total was 8, now
|      |                     |            | 8).
|  +1  |         whitespace  |  0m 1s     | The patch has no lines that end in 
|      |                     |            | whitespace.
|  +1  |            install  |  1m 33s    | mvn install still works. 
|  +1  |    eclipse:eclipse  |  0m 32s    | The patch built with 
|      |                     |            | eclipse:eclipse.
|  +1  |           findbugs  |  1m 14s    | The patch does not introduce any 
|      |                     |            | new Findbugs (version 3.0.0)
|      |                     |            | warnings.
|  +1  |         yarn tests  |  49m 57s   | Tests passed in 
|      |                     |            | hadoop-yarn-server-resourcemanager.
|      |                     |  92m 12s   | 


|| Subsystem || Report/Notes ||
============================================================================
| Patch URL | http://issues.apache.org/jira/secure/attachment/12734018/YARN-2336.009.patch |
| Optional Tests | javadoc javac unit findbugs checkstyle site |
| git revision | trunk / ce53c8e |
| checkstyle |  /home/jenkins/jenkins-slave/workspace/PreCommit-YARN-Build/patchprocess/diffcheckstylehadoop-yarn-server-resourcemanager.txt |
| hadoop-yarn-server-resourcemanager test log | /home/jenkins/jenkins-slave/workspace/PreCommit-YARN-Build/patchprocess/testrun_hadoop-yarn-server-resourcemanager.txt |
| Test Results | https://builds.apache.org/job/PreCommit-YARN-Build/8020/testReport/ |
| Java | 1.7.0_55 |
| uname | Linux asf905.gq1.ygridcore.net 3.13.0-36-lowlatency #63-Ubuntu SMP PREEMPT Wed Sep 3 21:56:12 UTC 2014 x86_64 x86_64 x86_64 GNU/Linux |


============================================================================
============================================================================
                          Adding comment to JIRA
============================================================================
============================================================================


Comment added.
cbc137d1647e616840be79b849a9ca1b49761ddc logged out


============================================================================
============================================================================
                              Finished build.
============================================================================
============================================================================


Build step 'Execute shell' marked build as failure
Archiving artifacts
Sending artifact delta relative to PreCommit-YARN-Build #8019
Archived 27 artifacts
Archive block size is 32768
Received 58 blocks and 11776192 bytes
Compression is 13.9%
Took 3.1 sec
[description-setter] Could not determine description.
Recording test results
Email was triggered for: Failure
Sending email for trigger: Failure



###################################################################################
############################## FAILED TESTS (if any) ##############################
All tests passed

Success: YARN-3646 PreCommit Build #8023

Posted by Apache Jenkins Server <je...@builds.apache.org>.
Jira: https://issues.apache.org/jira/browse/YARN-3646
Build: https://builds.apache.org/job/PreCommit-YARN-Build/8023/

###################################################################################
########################## LAST 60 LINES OF THE CONSOLE ###########################
[...truncated 273 lines...]
|  +1  |      release audit  |  0m 23s    | The applied patch does not increase 
|      |                     |            | the total number of release audit
|      |                     |            | warnings.
|  +1  |         checkstyle  |  0m 38s    | There were no new checkstyle 
|      |                     |            | issues.
|  +1  |         whitespace  |  0m 0s     | The patch has no lines that end in 
|      |                     |            | whitespace.
|  +1  |            install  |  1m 34s    | mvn install still works. 
|  +1  |    eclipse:eclipse  |  0m 33s    | The patch built with 
|      |                     |            | eclipse:eclipse.
|  +1  |           findbugs  |  2m 6s     | The patch does not introduce any 
|      |                     |            | new Findbugs (version 3.0.0)
|      |                     |            | warnings.
|  +1  |         yarn tests  |  6m 51s    | Tests passed in hadoop-yarn-client. 
|  +1  |         yarn tests  |  1m 55s    | Tests passed in hadoop-yarn-common. 
|      |                     |  45m 47s   | 


|| Subsystem || Report/Notes ||
============================================================================
| Patch URL | http://issues.apache.org/jira/secure/attachment/12734115/YARN-3646.002.patch |
| Optional Tests | javac unit findbugs checkstyle javadoc |
| git revision | trunk / 4aa730c |
| hadoop-yarn-client test log | /home/jenkins/jenkins-slave/workspace/PreCommit-YARN-Build/patchprocess/testrun_hadoop-yarn-client.txt |
| hadoop-yarn-common test log | /home/jenkins/jenkins-slave/workspace/PreCommit-YARN-Build/patchprocess/testrun_hadoop-yarn-common.txt |
| Test Results | https://builds.apache.org/job/PreCommit-YARN-Build/8023/testReport/ |
| Java | 1.7.0_55 |
| uname | Linux asf909.gq1.ygridcore.net 3.13.0-36-lowlatency #63-Ubuntu SMP PREEMPT Wed Sep 3 21:56:12 UTC 2014 x86_64 x86_64 x86_64 GNU/Linux |


============================================================================
============================================================================
                          Adding comment to JIRA
============================================================================
============================================================================


Comment added.
35f9d1d71e8fb27b3e454e39459f00345e628566 logged out


============================================================================
============================================================================
                              Finished build.
============================================================================
============================================================================


Archiving artifacts
Sending artifact delta relative to PreCommit-YARN-Build #8019
Archived 33 artifacts
Archive block size is 32768
Received 62 blocks and 7716226 bytes
Compression is 20.8%
Took 4 sec
Description set: YARN-3646
Recording test results
Email was triggered for: Success
Sending email for trigger: Success



###################################################################################
############################## FAILED TESTS (if any) ##############################
All tests passed

Failed: YARN-3344 PreCommit Build #8022

Posted by Apache Jenkins Server <je...@builds.apache.org>.
Jira: https://issues.apache.org/jira/browse/YARN-3344
Build: https://builds.apache.org/job/PreCommit-YARN-Build/8022/

###################################################################################
########################## LAST 60 LINES OF THE CONSOLE ###########################
[...truncated 263 lines...]
|      |                     |            | the total number of release audit
|      |                     |            | warnings.
|  -1  |         checkstyle  |  0m 57s    | The applied patch generated 2 new 
|      |                     |            | checkstyle issues (total was 43, now
|      |                     |            | 42).
|  +1  |         whitespace  |  0m 0s     | The patch has no lines that end in 
|      |                     |            | whitespace.
|  +1  |            install  |  1m 37s    | mvn install still works. 
|  +1  |    eclipse:eclipse  |  0m 33s    | The patch built with 
|      |                     |            | eclipse:eclipse.
|  +1  |           findbugs  |  1m 25s    | The patch does not introduce any 
|      |                     |            | new Findbugs (version 3.0.0)
|      |                     |            | warnings.
|  +1  |         yarn tests  |  2m 4s     | Tests passed in hadoop-yarn-common. 
|      |                     |  39m 39s   | 


|| Subsystem || Report/Notes ||
============================================================================
| Patch URL | http://issues.apache.org/jira/secure/attachment/12734110/YARN-3344-trunk.004.patch |
| Optional Tests | javadoc javac unit findbugs checkstyle |
| git revision | trunk / 4aa730c |
| checkstyle |  /home/jenkins/jenkins-slave/workspace/PreCommit-YARN-Build/patchprocess/diffcheckstylehadoop-yarn-common.txt |
| hadoop-yarn-common test log | /home/jenkins/jenkins-slave/workspace/PreCommit-YARN-Build/patchprocess/testrun_hadoop-yarn-common.txt |
| Test Results | https://builds.apache.org/job/PreCommit-YARN-Build/8022/testReport/ |
| Java | 1.7.0_55 |
| uname | Linux asf903.gq1.ygridcore.net 3.13.0-36-lowlatency #63-Ubuntu SMP PREEMPT Wed Sep 3 21:56:12 UTC 2014 x86_64 x86_64 x86_64 GNU/Linux |


============================================================================
============================================================================
                          Adding comment to JIRA
============================================================================
============================================================================


Comment added.
c35cda975825602f10a378a0f4a90096f00ef847 logged out


============================================================================
============================================================================
                              Finished build.
============================================================================
============================================================================


Build step 'Execute shell' marked build as failure
Archiving artifacts
Sending artifact delta relative to PreCommit-YARN-Build #8019
Archived 25 artifacts
Archive block size is 32768
Received 56 blocks and 9877738 bytes
Compression is 15.7%
Took 3.4 sec
[description-setter] Could not determine description.
Recording test results
Email was triggered for: Failure
Sending email for trigger: Failure



###################################################################################
############################## FAILED TESTS (if any) ##############################
All tests passed

Failed: YARN-3543 PreCommit Build #8021

Posted by Apache Jenkins Server <je...@builds.apache.org>.
Jira: https://issues.apache.org/jira/browse/YARN-3543
Build: https://builds.apache.org/job/PreCommit-YARN-Build/8021/

###################################################################################
########################## LAST 60 LINES OF THE CONSOLE ###########################
[...truncated 502 lines...]
             Reason | Tests
 Failed unit tests  |  hadoop.yarn.client.api.impl.TestAHSClient 
                    |  hadoop.yarn.client.TestApplicationClientProtocolOnHA 
                    |  hadoop.yarn.client.cli.TestYarnCLI 
                    |  hadoop.yarn.client.api.impl.TestYarnClient 
   Timed out tests  |  org.apache.hadoop.mapreduce.TestMRJobClient 
                    |  org.apache.hadoop.mapreduce.TestMapReduceLazyOutput 
      Failed build  |  hadoop-yarn-server-applicationhistoryservice 
                    |  hadoop-yarn-server-resourcemanager 


|| Subsystem || Report/Notes ||
============================================================================
| Patch URL | http://issues.apache.org/jira/secure/attachment/12734085/0004-YARN-3543.patch |
| Optional Tests | javadoc javac unit findbugs checkstyle |
| git revision | trunk / ce53c8e |
| checkstyle |  /home/jenkins/jenkins-slave/workspace/PreCommit-YARN-Build/patchprocess/diffcheckstylehadoop-yarn-api.txt |
| hadoop-mapreduce-client-jobclient test log | /home/jenkins/jenkins-slave/workspace/PreCommit-YARN-Build/patchprocess/testrun_hadoop-mapreduce-client-jobclient.txt |
| hadoop-yarn-api test log | /home/jenkins/jenkins-slave/workspace/PreCommit-YARN-Build/patchprocess/testrun_hadoop-yarn-api.txt |
| hadoop-yarn-client test log | /home/jenkins/jenkins-slave/workspace/PreCommit-YARN-Build/patchprocess/testrun_hadoop-yarn-client.txt |
| hadoop-yarn-common test log | /home/jenkins/jenkins-slave/workspace/PreCommit-YARN-Build/patchprocess/testrun_hadoop-yarn-common.txt |
| hadoop-yarn-server-applicationhistoryservice test log | /home/jenkins/jenkins-slave/workspace/PreCommit-YARN-Build/patchprocess/testrun_hadoop-yarn-server-applicationhistoryservice.txt |
| hadoop-yarn-server-common test log | /home/jenkins/jenkins-slave/workspace/PreCommit-YARN-Build/patchprocess/testrun_hadoop-yarn-server-common.txt |
| hadoop-yarn-server-resourcemanager test log | /home/jenkins/jenkins-slave/workspace/PreCommit-YARN-Build/patchprocess/testrun_hadoop-yarn-server-resourcemanager.txt |
| Test Results | https://builds.apache.org/job/PreCommit-YARN-Build/8021/testReport/ |
| Java | 1.7.0_55 |
| uname | Linux asf903.gq1.ygridcore.net 3.13.0-36-lowlatency #63-Ubuntu SMP PREEMPT Wed Sep 3 21:56:12 UTC 2014 x86_64 x86_64 x86_64 GNU/Linux |


============================================================================
============================================================================
                          Adding comment to JIRA
============================================================================
============================================================================


Comment added.
2381c2c3d6fdfacdc7b9e677aea054706f07a904 logged out


============================================================================
============================================================================
                              Finished build.
============================================================================
============================================================================


Build step 'Execute shell' marked build as failure
Archiving artifacts
Sending artifact delta relative to PreCommit-YARN-Build #8019
Archived 79 artifacts
Archive block size is 32768
Received 57 blocks and 28227369 bytes
Compression is 6.2%
Took 7.8 sec
[description-setter] Could not determine description.
Recording test results
Email was triggered for: Failure
Sending email for trigger: Failure



###################################################################################
############################## FAILED TESTS (if any) ##############################
37 tests failed.
FAILED:  org.apache.hadoop.yarn.client.TestApplicationClientProtocolOnHA.testGetContainersOnHA

Error Message:
Client couldn't connect to the Active RM

Stack Trace:
java.lang.AssertionError: Client couldn't connect to the Active RM
	at org.junit.Assert.fail(Assert.java:88)
	at org.apache.hadoop.yarn.client.ProtocolHATestBase.verifyClientConnection(ProtocolHATestBase.java:259)
	at org.apache.hadoop.yarn.client.ProtocolHATestBase.verifyConnections(ProtocolHATestBase.java:241)
	at org.apache.hadoop.yarn.client.ProtocolHATestBase.startHACluster(ProtocolHATestBase.java:304)
	at org.apache.hadoop.yarn.client.TestApplicationClientProtocolOnHA.initiate(TestApplicationClientProtocolOnHA.java:54)


FAILED:  org.apache.hadoop.yarn.client.TestApplicationClientProtocolOnHA.testGetNewApplicationOnHA

Error Message:
Client couldn't connect to the Active RM

Stack Trace:
java.lang.AssertionError: Client couldn't connect to the Active RM
	at org.junit.Assert.fail(Assert.java:88)
	at org.apache.hadoop.yarn.client.ProtocolHATestBase.verifyClientConnection(ProtocolHATestBase.java:259)
	at org.apache.hadoop.yarn.client.ProtocolHATestBase.verifyConnections(ProtocolHATestBase.java:241)
	at org.apache.hadoop.yarn.client.ProtocolHATestBase.startHACluster(ProtocolHATestBase.java:304)
	at org.apache.hadoop.yarn.client.TestApplicationClientProtocolOnHA.initiate(TestApplicationClientProtocolOnHA.java:54)


FAILED:  org.apache.hadoop.yarn.client.TestApplicationClientProtocolOnHA.testGetApplicationAttemptsOnHA

Error Message:
Client couldn't connect to the Active RM

Stack Trace:
java.lang.AssertionError: Client couldn't connect to the Active RM
	at org.junit.Assert.fail(Assert.java:88)
	at org.apache.hadoop.yarn.client.ProtocolHATestBase.verifyClientConnection(ProtocolHATestBase.java:259)
	at org.apache.hadoop.yarn.client.ProtocolHATestBase.verifyConnections(ProtocolHATestBase.java:241)
	at org.apache.hadoop.yarn.client.ProtocolHATestBase.startHACluster(ProtocolHATestBase.java:304)
	at org.apache.hadoop.yarn.client.TestApplicationClientProtocolOnHA.initiate(TestApplicationClientProtocolOnHA.java:54)


FAILED:  org.apache.hadoop.yarn.client.TestApplicationClientProtocolOnHA.testGetApplicationAttemptReportOnHA

Error Message:
Client couldn't connect to the Active RM

Stack Trace:
java.lang.AssertionError: Client couldn't connect to the Active RM
	at org.junit.Assert.fail(Assert.java:88)
	at org.apache.hadoop.yarn.client.ProtocolHATestBase.verifyClientConnection(ProtocolHATestBase.java:259)
	at org.apache.hadoop.yarn.client.ProtocolHATestBase.verifyConnections(ProtocolHATestBase.java:241)
	at org.apache.hadoop.yarn.client.ProtocolHATestBase.startHACluster(ProtocolHATestBase.java:304)
	at org.apache.hadoop.yarn.client.TestApplicationClientProtocolOnHA.initiate(TestApplicationClientProtocolOnHA.java:54)


FAILED:  org.apache.hadoop.yarn.client.TestApplicationClientProtocolOnHA.testSubmitApplicationOnHA

Error Message:
Client couldn't connect to the Active RM

Stack Trace:
java.lang.AssertionError: Client couldn't connect to the Active RM
	at org.junit.Assert.fail(Assert.java:88)
	at org.apache.hadoop.yarn.client.ProtocolHATestBase.verifyClientConnection(ProtocolHATestBase.java:259)
	at org.apache.hadoop.yarn.client.ProtocolHATestBase.verifyConnections(ProtocolHATestBase.java:241)
	at org.apache.hadoop.yarn.client.ProtocolHATestBase.startHACluster(ProtocolHATestBase.java:304)
	at org.apache.hadoop.yarn.client.TestApplicationClientProtocolOnHA.initiate(TestApplicationClientProtocolOnHA.java:54)


FAILED:  org.apache.hadoop.yarn.client.TestApplicationClientProtocolOnHA.testGetApplicationReportOnHA

Error Message:
Client couldn't connect to the Active RM

Stack Trace:
java.lang.AssertionError: Client couldn't connect to the Active RM
	at org.junit.Assert.fail(Assert.java:88)
	at org.apache.hadoop.yarn.client.ProtocolHATestBase.verifyClientConnection(ProtocolHATestBase.java:259)
	at org.apache.hadoop.yarn.client.ProtocolHATestBase.verifyConnections(ProtocolHATestBase.java:241)
	at org.apache.hadoop.yarn.client.ProtocolHATestBase.startHACluster(ProtocolHATestBase.java:304)
	at org.apache.hadoop.yarn.client.TestApplicationClientProtocolOnHA.initiate(TestApplicationClientProtocolOnHA.java:54)


FAILED:  org.apache.hadoop.yarn.client.TestApplicationClientProtocolOnHA.testMoveApplicationAcrossQueuesOnHA

Error Message:
Client couldn't connect to the Active RM

Stack Trace:
java.lang.AssertionError: Client couldn't connect to the Active RM
	at org.junit.Assert.fail(Assert.java:88)
	at org.apache.hadoop.yarn.client.ProtocolHATestBase.verifyClientConnection(ProtocolHATestBase.java:259)
	at org.apache.hadoop.yarn.client.ProtocolHATestBase.verifyConnections(ProtocolHATestBase.java:241)
	at org.apache.hadoop.yarn.client.ProtocolHATestBase.startHACluster(ProtocolHATestBase.java:304)
	at org.apache.hadoop.yarn.client.TestApplicationClientProtocolOnHA.initiate(TestApplicationClientProtocolOnHA.java:54)


FAILED:  org.apache.hadoop.yarn.client.TestApplicationClientProtocolOnHA.testGetQueueUserAclsOnHA

Error Message:
Client couldn't connect to the Active RM

Stack Trace:
java.lang.AssertionError: Client couldn't connect to the Active RM
	at org.junit.Assert.fail(Assert.java:88)
	at org.apache.hadoop.yarn.client.ProtocolHATestBase.verifyClientConnection(ProtocolHATestBase.java:259)
	at org.apache.hadoop.yarn.client.ProtocolHATestBase.verifyConnections(ProtocolHATestBase.java:241)
	at org.apache.hadoop.yarn.client.ProtocolHATestBase.startHACluster(ProtocolHATestBase.java:304)
	at org.apache.hadoop.yarn.client.TestApplicationClientProtocolOnHA.initiate(TestApplicationClientProtocolOnHA.java:54)


FAILED:  org.apache.hadoop.yarn.client.TestApplicationClientProtocolOnHA.testRenewDelegationTokenOnHA

Error Message:
Client couldn't connect to the Active RM

Stack Trace:
java.lang.AssertionError: Client couldn't connect to the Active RM
	at org.junit.Assert.fail(Assert.java:88)
	at org.apache.hadoop.yarn.client.ProtocolHATestBase.verifyClientConnection(ProtocolHATestBase.java:259)
	at org.apache.hadoop.yarn.client.ProtocolHATestBase.verifyConnections(ProtocolHATestBase.java:241)
	at org.apache.hadoop.yarn.client.ProtocolHATestBase.startHACluster(ProtocolHATestBase.java:304)
	at org.apache.hadoop.yarn.client.TestApplicationClientProtocolOnHA.initiate(TestApplicationClientProtocolOnHA.java:54)


FAILED:  org.apache.hadoop.yarn.client.TestApplicationClientProtocolOnHA.testCancelDelegationTokenOnHA

Error Message:
Client couldn't connect to the Active RM

Stack Trace:
java.lang.AssertionError: Client couldn't connect to the Active RM
	at org.junit.Assert.fail(Assert.java:88)
	at org.apache.hadoop.yarn.client.ProtocolHATestBase.verifyClientConnection(ProtocolHATestBase.java:259)
	at org.apache.hadoop.yarn.client.ProtocolHATestBase.verifyConnections(ProtocolHATestBase.java:241)
	at org.apache.hadoop.yarn.client.ProtocolHATestBase.startHACluster(ProtocolHATestBase.java:304)
	at org.apache.hadoop.yarn.client.TestApplicationClientProtocolOnHA.initiate(TestApplicationClientProtocolOnHA.java:54)


FAILED:  org.apache.hadoop.yarn.client.TestApplicationClientProtocolOnHA.testGetQueueInfoOnHA

Error Message:
Client couldn't connect to the Active RM

Stack Trace:
java.lang.AssertionError: Client couldn't connect to the Active RM
	at org.junit.Assert.fail(Assert.java:88)
	at org.apache.hadoop.yarn.client.ProtocolHATestBase.verifyClientConnection(ProtocolHATestBase.java:259)
	at org.apache.hadoop.yarn.client.ProtocolHATestBase.verifyConnections(ProtocolHATestBase.java:241)
	at org.apache.hadoop.yarn.client.ProtocolHATestBase.startHACluster(ProtocolHATestBase.java:304)
	at org.apache.hadoop.yarn.client.TestApplicationClientProtocolOnHA.initiate(TestApplicationClientProtocolOnHA.java:54)


FAILED:  org.apache.hadoop.yarn.client.TestApplicationClientProtocolOnHA.testForceKillApplicationOnHA

Error Message:
Client couldn't connect to the Active RM

Stack Trace:
java.lang.AssertionError: Client couldn't connect to the Active RM
	at org.junit.Assert.fail(Assert.java:88)
	at org.apache.hadoop.yarn.client.ProtocolHATestBase.verifyClientConnection(ProtocolHATestBase.java:259)
	at org.apache.hadoop.yarn.client.ProtocolHATestBase.verifyConnections(ProtocolHATestBase.java:241)
	at org.apache.hadoop.yarn.client.ProtocolHATestBase.startHACluster(ProtocolHATestBase.java:304)
	at org.apache.hadoop.yarn.client.TestApplicationClientProtocolOnHA.initiate(TestApplicationClientProtocolOnHA.java:54)


FAILED:  org.apache.hadoop.yarn.client.TestApplicationClientProtocolOnHA.testGetDelegationTokenOnHA

Error Message:
Client couldn't connect to the Active RM

Stack Trace:
java.lang.AssertionError: Client couldn't connect to the Active RM
	at org.junit.Assert.fail(Assert.java:88)
	at org.apache.hadoop.yarn.client.ProtocolHATestBase.verifyClientConnection(ProtocolHATestBase.java:259)
	at org.apache.hadoop.yarn.client.ProtocolHATestBase.verifyConnections(ProtocolHATestBase.java:241)
	at org.apache.hadoop.yarn.client.ProtocolHATestBase.startHACluster(ProtocolHATestBase.java:304)
	at org.apache.hadoop.yarn.client.TestApplicationClientProtocolOnHA.initiate(TestApplicationClientProtocolOnHA.java:54)


FAILED:  org.apache.hadoop.yarn.client.TestApplicationClientProtocolOnHA.testGetApplicationsOnHA

Error Message:
Client couldn't connect to the Active RM

Stack Trace:
java.lang.AssertionError: Client couldn't connect to the Active RM
	at org.junit.Assert.fail(Assert.java:88)
	at org.apache.hadoop.yarn.client.ProtocolHATestBase.verifyClientConnection(ProtocolHATestBase.java:259)
	at org.apache.hadoop.yarn.client.ProtocolHATestBase.verifyConnections(ProtocolHATestBase.java:241)
	at org.apache.hadoop.yarn.client.ProtocolHATestBase.startHACluster(ProtocolHATestBase.java:304)
	at org.apache.hadoop.yarn.client.TestApplicationClientProtocolOnHA.initiate(TestApplicationClientProtocolOnHA.java:54)


FAILED:  org.apache.hadoop.yarn.client.TestApplicationClientProtocolOnHA.testGetClusterNodesOnHA

Error Message:
Client couldn't connect to the Active RM

Stack Trace:
java.lang.AssertionError: Client couldn't connect to the Active RM
	at org.junit.Assert.fail(Assert.java:88)
	at org.apache.hadoop.yarn.client.ProtocolHATestBase.verifyClientConnection(ProtocolHATestBase.java:259)
	at org.apache.hadoop.yarn.client.ProtocolHATestBase.verifyConnections(ProtocolHATestBase.java:241)
	at org.apache.hadoop.yarn.client.ProtocolHATestBase.startHACluster(ProtocolHATestBase.java:304)
	at org.apache.hadoop.yarn.client.TestApplicationClientProtocolOnHA.initiate(TestApplicationClientProtocolOnHA.java:54)


FAILED:  org.apache.hadoop.yarn.client.TestApplicationClientProtocolOnHA.testGetContainerReportOnHA

Error Message:
Client couldn't connect to the Active RM

Stack Trace:
java.lang.AssertionError: Client couldn't connect to the Active RM
	at org.junit.Assert.fail(Assert.java:88)
	at org.apache.hadoop.yarn.client.ProtocolHATestBase.verifyClientConnection(ProtocolHATestBase.java:259)
	at org.apache.hadoop.yarn.client.ProtocolHATestBase.verifyConnections(ProtocolHATestBase.java:241)
	at org.apache.hadoop.yarn.client.ProtocolHATestBase.startHACluster(ProtocolHATestBase.java:304)
	at org.apache.hadoop.yarn.client.TestApplicationClientProtocolOnHA.initiate(TestApplicationClientProtocolOnHA.java:54)


FAILED:  org.apache.hadoop.yarn.client.TestApplicationClientProtocolOnHA.testGetClusterMetricsOnHA

Error Message:
Client couldn't connect to the Active RM

Stack Trace:
java.lang.AssertionError: Client couldn't connect to the Active RM
	at org.junit.Assert.fail(Assert.java:88)
	at org.apache.hadoop.yarn.client.ProtocolHATestBase.verifyClientConnection(ProtocolHATestBase.java:259)
	at org.apache.hadoop.yarn.client.ProtocolHATestBase.verifyConnections(ProtocolHATestBase.java:241)
	at org.apache.hadoop.yarn.client.ProtocolHATestBase.startHACluster(ProtocolHATestBase.java:304)
	at org.apache.hadoop.yarn.client.TestApplicationClientProtocolOnHA.initiate(TestApplicationClientProtocolOnHA.java:54)


FAILED:  org.apache.hadoop.yarn.client.api.impl.TestAHSClient.testGetApplications

Error Message:
org.apache.hadoop.yarn.api.records.ApplicationReport.setUnmanagedApp(Z)V

Stack Trace:
java.lang.AbstractMethodError: org.apache.hadoop.yarn.api.records.ApplicationReport.setUnmanagedApp(Z)V
	at org.apache.hadoop.yarn.api.records.ApplicationReport.newInstance(ApplicationReport.java:84)
	at org.apache.hadoop.yarn.client.api.impl.TestAHSClient$MockAHSClient.createAppReports(TestAHSClient.java:331)
	at org.apache.hadoop.yarn.client.api.impl.TestAHSClient$MockAHSClient.<init>(TestAHSClient.java:211)
	at org.apache.hadoop.yarn.client.api.impl.TestAHSClient.testGetApplications(TestAHSClient.java:76)


FAILED:  org.apache.hadoop.yarn.client.api.impl.TestAHSClient.testGetContainerReport

Error Message:
org.apache.hadoop.yarn.api.records.ApplicationReport.setUnmanagedApp(Z)V

Stack Trace:
java.lang.AbstractMethodError: org.apache.hadoop.yarn.api.records.ApplicationReport.setUnmanagedApp(Z)V
	at org.apache.hadoop.yarn.api.records.ApplicationReport.newInstance(ApplicationReport.java:84)
	at org.apache.hadoop.yarn.client.api.impl.TestAHSClient$MockAHSClient.createAppReports(TestAHSClient.java:331)
	at org.apache.hadoop.yarn.client.api.impl.TestAHSClient$MockAHSClient.<init>(TestAHSClient.java:211)
	at org.apache.hadoop.yarn.client.api.impl.TestAHSClient.testGetContainerReport(TestAHSClient.java:169)


FAILED:  org.apache.hadoop.yarn.client.api.impl.TestAHSClient.testGetApplicationAttempts

Error Message:
org.apache.hadoop.yarn.api.records.ApplicationReport.setUnmanagedApp(Z)V

Stack Trace:
java.lang.AbstractMethodError: org.apache.hadoop.yarn.api.records.ApplicationReport.setUnmanagedApp(Z)V
	at org.apache.hadoop.yarn.api.records.ApplicationReport.newInstance(ApplicationReport.java:84)
	at org.apache.hadoop.yarn.client.api.impl.TestAHSClient$MockAHSClient.createAppReports(TestAHSClient.java:331)
	at org.apache.hadoop.yarn.client.api.impl.TestAHSClient$MockAHSClient.<init>(TestAHSClient.java:211)
	at org.apache.hadoop.yarn.client.api.impl.TestAHSClient.testGetApplicationAttempts(TestAHSClient.java:111)


FAILED:  org.apache.hadoop.yarn.client.api.impl.TestAHSClient.testGetApplicationReport

Error Message:
org.apache.hadoop.yarn.api.records.ApplicationReport.setUnmanagedApp(Z)V

Stack Trace:
java.lang.AbstractMethodError: org.apache.hadoop.yarn.api.records.ApplicationReport.setUnmanagedApp(Z)V
	at org.apache.hadoop.yarn.api.records.ApplicationReport.newInstance(ApplicationReport.java:84)
	at org.apache.hadoop.yarn.client.api.impl.TestAHSClient$MockAHSClient.createAppReports(TestAHSClient.java:331)
	at org.apache.hadoop.yarn.client.api.impl.TestAHSClient$MockAHSClient.<init>(TestAHSClient.java:211)
	at org.apache.hadoop.yarn.client.api.impl.TestAHSClient.testGetApplicationReport(TestAHSClient.java:94)


FAILED:  org.apache.hadoop.yarn.client.api.impl.TestAHSClient.testGetApplicationAttempt

Error Message:
org.apache.hadoop.yarn.api.records.ApplicationReport.setUnmanagedApp(Z)V

Stack Trace:
java.lang.AbstractMethodError: org.apache.hadoop.yarn.api.records.ApplicationReport.setUnmanagedApp(Z)V
	at org.apache.hadoop.yarn.api.records.ApplicationReport.newInstance(ApplicationReport.java:84)
	at org.apache.hadoop.yarn.client.api.impl.TestAHSClient$MockAHSClient.createAppReports(TestAHSClient.java:331)
	at org.apache.hadoop.yarn.client.api.impl.TestAHSClient$MockAHSClient.<init>(TestAHSClient.java:211)
	at org.apache.hadoop.yarn.client.api.impl.TestAHSClient.testGetApplicationAttempt(TestAHSClient.java:129)


FAILED:  org.apache.hadoop.yarn.client.api.impl.TestAHSClient.testGetContainers

Error Message:
org.apache.hadoop.yarn.api.records.ApplicationReport.setUnmanagedApp(Z)V

Stack Trace:
java.lang.AbstractMethodError: org.apache.hadoop.yarn.api.records.ApplicationReport.setUnmanagedApp(Z)V
	at org.apache.hadoop.yarn.api.records.ApplicationReport.newInstance(ApplicationReport.java:84)
	at org.apache.hadoop.yarn.client.api.impl.TestAHSClient$MockAHSClient.createAppReports(TestAHSClient.java:331)
	at org.apache.hadoop.yarn.client.api.impl.TestAHSClient$MockAHSClient.<init>(TestAHSClient.java:211)
	at org.apache.hadoop.yarn.client.api.impl.TestAHSClient.testGetContainers(TestAHSClient.java:150)


FAILED:  org.apache.hadoop.yarn.client.api.impl.TestYarnClient.testGetApplications

Error Message:
org.apache.hadoop.yarn.api.records.ApplicationReport.setUnmanagedApp(Z)V

Stack Trace:
java.lang.AbstractMethodError: org.apache.hadoop.yarn.api.records.ApplicationReport.setUnmanagedApp(Z)V
	at org.apache.hadoop.yarn.api.records.ApplicationReport.newInstance(ApplicationReport.java:84)
	at org.apache.hadoop.yarn.client.api.impl.TestYarnClient$MockYarnClient.createAppReports(TestYarnClient.java:612)
	at org.apache.hadoop.yarn.client.api.impl.TestYarnClient$MockYarnClient.<init>(TestYarnClient.java:534)
	at org.apache.hadoop.yarn.client.api.impl.TestYarnClient.testGetApplications(TestYarnClient.java:303)


FAILED:  org.apache.hadoop.yarn.client.api.impl.TestYarnClient.testGetContainerReport

Error Message:
org.apache.hadoop.yarn.api.records.ApplicationReport.setUnmanagedApp(Z)V

Stack Trace:
java.lang.AbstractMethodError: org.apache.hadoop.yarn.api.records.ApplicationReport.setUnmanagedApp(Z)V
	at org.apache.hadoop.yarn.api.records.ApplicationReport.newInstance(ApplicationReport.java:84)
	at org.apache.hadoop.yarn.client.api.impl.TestYarnClient$MockYarnClient.createAppReports(TestYarnClient.java:612)
	at org.apache.hadoop.yarn.client.api.impl.TestYarnClient$MockYarnClient.<init>(TestYarnClient.java:534)
	at org.apache.hadoop.yarn.client.api.impl.TestYarnClient.testGetContainerReport(TestYarnClient.java:431)


FAILED:  org.apache.hadoop.yarn.client.api.impl.TestYarnClient.testGetApplicationAttempts

Error Message:
org.apache.hadoop.yarn.api.records.ApplicationReport.setUnmanagedApp(Z)V

Stack Trace:
java.lang.AbstractMethodError: org.apache.hadoop.yarn.api.records.ApplicationReport.setUnmanagedApp(Z)V
	at org.apache.hadoop.yarn.api.records.ApplicationReport.newInstance(ApplicationReport.java:84)
	at org.apache.hadoop.yarn.client.api.impl.TestYarnClient$MockYarnClient.createAppReports(TestYarnClient.java:612)
	at org.apache.hadoop.yarn.client.api.impl.TestYarnClient$MockYarnClient.<init>(TestYarnClient.java:534)
	at org.apache.hadoop.yarn.client.api.impl.TestYarnClient.testGetApplicationAttempts(TestYarnClient.java:357)


FAILED:  org.apache.hadoop.yarn.client.api.impl.TestYarnClient.testGetLabelsToNodes

Error Message:
org.apache.hadoop.yarn.api.records.ApplicationReport.setUnmanagedApp(Z)V

Stack Trace:
java.lang.AbstractMethodError: org.apache.hadoop.yarn.api.records.ApplicationReport.setUnmanagedApp(Z)V
	at org.apache.hadoop.yarn.api.records.ApplicationReport.newInstance(ApplicationReport.java:84)
	at org.apache.hadoop.yarn.client.api.impl.TestYarnClient$MockYarnClient.createAppReports(TestYarnClient.java:612)
	at org.apache.hadoop.yarn.client.api.impl.TestYarnClient$MockYarnClient.<init>(TestYarnClient.java:534)
	at org.apache.hadoop.yarn.client.api.impl.TestYarnClient.testGetLabelsToNodes(TestYarnClient.java:459)


FAILED:  org.apache.hadoop.yarn.client.api.impl.TestYarnClient.testAMMRTokens

Error Message:
org.apache.hadoop.yarn.api.records.ApplicationReport.isUnmanagedApp()Z

Stack Trace:
java.lang.AbstractMethodError: org.apache.hadoop.yarn.api.records.ApplicationReport.isUnmanagedApp()Z
	at org.apache.hadoop.yarn.client.api.impl.TestYarnClient.waitTillAccepted(TestYarnClient.java:999)
	at org.apache.hadoop.yarn.client.api.impl.TestYarnClient.testAMMRTokens(TestYarnClient.java:899)


FAILED:  org.apache.hadoop.yarn.client.api.impl.TestYarnClient.testKillApplication

Error Message:
org.apache.hadoop.yarn.api.records.ApplicationReport.setUnmanagedApp(Z)V

Stack Trace:
java.lang.AbstractMethodError: org.apache.hadoop.yarn.api.records.ApplicationReport.setUnmanagedApp(Z)V
	at org.apache.hadoop.yarn.api.records.ApplicationReport.newInstance(ApplicationReport.java:84)
	at org.apache.hadoop.yarn.client.api.impl.TestYarnClient$MockYarnClient.createAppReports(TestYarnClient.java:612)
	at org.apache.hadoop.yarn.client.api.impl.TestYarnClient$MockYarnClient.<init>(TestYarnClient.java:534)
	at org.apache.hadoop.yarn.client.api.impl.TestYarnClient.testKillApplication(TestYarnClient.java:261)


FAILED:  org.apache.hadoop.yarn.client.api.impl.TestYarnClient.testGetNodesToLabels

Error Message:
org.apache.hadoop.yarn.api.records.ApplicationReport.setUnmanagedApp(Z)V

Stack Trace:
java.lang.AbstractMethodError: org.apache.hadoop.yarn.api.records.ApplicationReport.setUnmanagedApp(Z)V
	at org.apache.hadoop.yarn.api.records.ApplicationReport.newInstance(ApplicationReport.java:84)
	at org.apache.hadoop.yarn.client.api.impl.TestYarnClient$MockYarnClient.createAppReports(TestYarnClient.java:612)
	at org.apache.hadoop.yarn.client.api.impl.TestYarnClient$MockYarnClient.<init>(TestYarnClient.java:534)
	at org.apache.hadoop.yarn.client.api.impl.TestYarnClient.testGetNodesToLabels(TestYarnClient.java:485)


FAILED:  org.apache.hadoop.yarn.client.api.impl.TestYarnClient.testGetApplicationAttempt

Error Message:
org.apache.hadoop.yarn.api.records.ApplicationReport.setUnmanagedApp(Z)V

Stack Trace:
java.lang.AbstractMethodError: org.apache.hadoop.yarn.api.records.ApplicationReport.setUnmanagedApp(Z)V
	at org.apache.hadoop.yarn.api.records.ApplicationReport.newInstance(ApplicationReport.java:84)
	at org.apache.hadoop.yarn.client.api.impl.TestYarnClient$MockYarnClient.createAppReports(TestYarnClient.java:612)
	at org.apache.hadoop.yarn.client.api.impl.TestYarnClient$MockYarnClient.<init>(TestYarnClient.java:534)
	at org.apache.hadoop.yarn.client.api.impl.TestYarnClient.testGetApplicationAttempt(TestYarnClient.java:375)


FAILED:  org.apache.hadoop.yarn.client.api.impl.TestYarnClient.testGetContainers

Error Message:
org.apache.hadoop.yarn.api.records.ApplicationReport.setUnmanagedApp(Z)V

Stack Trace:
java.lang.AbstractMethodError: org.apache.hadoop.yarn.api.records.ApplicationReport.setUnmanagedApp(Z)V
	at org.apache.hadoop.yarn.api.records.ApplicationReport.newInstance(ApplicationReport.java:84)
	at org.apache.hadoop.yarn.client.api.impl.TestYarnClient$MockYarnClient.createAppReports(TestYarnClient.java:612)
	at org.apache.hadoop.yarn.client.api.impl.TestYarnClient$MockYarnClient.<init>(TestYarnClient.java:534)
	at org.apache.hadoop.yarn.client.api.impl.TestYarnClient.testGetContainers(TestYarnClient.java:399)


FAILED:  org.apache.hadoop.yarn.client.api.impl.TestYarnClient.testSubmitApplication

Error Message:
org.apache.hadoop.yarn.api.records.ApplicationReport.setUnmanagedApp(Z)V

Stack Trace:
java.lang.AbstractMethodError: org.apache.hadoop.yarn.api.records.ApplicationReport.setUnmanagedApp(Z)V
	at org.apache.hadoop.yarn.api.records.ApplicationReport.newInstance(ApplicationReport.java:84)
	at org.apache.hadoop.yarn.client.api.impl.TestYarnClient$MockYarnClient.createAppReports(TestYarnClient.java:612)
	at org.apache.hadoop.yarn.client.api.impl.TestYarnClient$MockYarnClient.<init>(TestYarnClient.java:534)
	at org.apache.hadoop.yarn.client.api.impl.TestYarnClient.testSubmitApplication(TestYarnClient.java:156)


FAILED:  org.apache.hadoop.yarn.client.cli.TestYarnCLI.testGetApplications

Error Message:
org.apache.hadoop.yarn.api.records.ApplicationReport.setUnmanagedApp(Z)V

Stack Trace:
java.lang.AbstractMethodError: org.apache.hadoop.yarn.api.records.ApplicationReport.setUnmanagedApp(Z)V
	at org.apache.hadoop.yarn.api.records.ApplicationReport.newInstance(ApplicationReport.java:84)
	at org.apache.hadoop.yarn.client.cli.TestYarnCLI.testGetApplications(TestYarnCLI.java:350)


FAILED:  org.apache.hadoop.yarn.client.cli.TestYarnCLI.testMoveApplicationAcrossQueues

Error Message:
org.apache.hadoop.yarn.api.records.ApplicationReport.setUnmanagedApp(Z)V

Stack Trace:
java.lang.AbstractMethodError: org.apache.hadoop.yarn.api.records.ApplicationReport.setUnmanagedApp(Z)V
	at org.apache.hadoop.yarn.api.records.ApplicationReport.newInstance(ApplicationReport.java:84)
	at org.apache.hadoop.yarn.client.cli.TestYarnCLI.testMoveApplicationAcrossQueues(TestYarnCLI.java:871)


FAILED:  org.apache.hadoop.yarn.client.cli.TestYarnCLI.testKillApplication

Error Message:
org.apache.hadoop.yarn.api.records.ApplicationReport.setUnmanagedApp(Z)V

Stack Trace:
java.lang.AbstractMethodError: org.apache.hadoop.yarn.api.records.ApplicationReport.setUnmanagedApp(Z)V
	at org.apache.hadoop.yarn.api.records.ApplicationReport.newInstance(ApplicationReport.java:84)
	at org.apache.hadoop.yarn.client.cli.TestYarnCLI.testKillApplication(TestYarnCLI.java:821)


FAILED:  org.apache.hadoop.yarn.client.cli.TestYarnCLI.testGetApplicationReport

Error Message:
org.apache.hadoop.yarn.api.records.ApplicationReport.setUnmanagedApp(Z)V

Stack Trace:
java.lang.AbstractMethodError: org.apache.hadoop.yarn.api.records.ApplicationReport.setUnmanagedApp(Z)V
	at org.apache.hadoop.yarn.api.records.ApplicationReport.newInstance(ApplicationReport.java:84)
	at org.apache.hadoop.yarn.client.cli.TestYarnCLI.testGetApplicationReport(TestYarnCLI.java:102)