You are viewing a plain text version of this content. The canonical link for it is here.
Posted to dev@calcite.apache.org by Apache Jenkins Server <je...@builds.apache.org> on 2026/05/13 16:17:12 UTC

Build failed in Jenkins: Calcite » Calcite-snapshots #1836

See <https://ci-builds.apache.org/job/Calcite/job/Calcite-snapshots/1836/display/redirect?page=changes>

Changes:

[mbudiu] [CALCITE-7522] Allow EXTRACT(interval FROM tz) to operate on TIMESTAMP WITH TIME ZONE


------------------------------------------
[...truncated 1.18 KiB...]
 > git config remote.origin.url https://github.com/apache/calcite.git # timeout=10
 > git config --add remote.origin.fetch +refs/heads/*:refs/remotes/origin/* # timeout=10
Avoid second fetch
 > git rev-parse refs/remotes/origin/main^{commit} # timeout=10
Checking out Revision e0bc26c344e7537a8b6d0bd875473988833d8eda (refs/remotes/origin/main)
 > git config core.sparsecheckout # timeout=10
 > git checkout -f e0bc26c344e7537a8b6d0bd875473988833d8eda # timeout=10
Commit message: "[CALCITE-7522] Allow EXTRACT(interval FROM tz) to operate on TIMESTAMP WITH TIME ZONE"
 > git rev-list --no-walk 03d333693e1797116cdc160d0471dbf8926ec743 # timeout=10
[Gradle] - Launching build.
[Calcite-snapshots] $ <https://ci-builds.apache.org/job/Calcite/job/Calcite-snapshots/ws/gradlew> "-Dorg.gradle.jvmargs=-Xmx1024m -XX:MaxMetaspaceSize=512m" -Pasf=true -PCI=true --no-build-cache --profile --no-daemon build publish
Downloading https://services.gradle.org/distributions/gradle-8.14.4-bin.zip
.............10%.............20%.............30%.............40%.............50%.............60%.............70%.............80%.............90%..............100%

Welcome to Gradle 8.14.4!

Here are the highlights of this release:
 - Java 24 support
 - GraalVM Native Image toolchain selection
 - Enhancements to test reporting
 - Build Authoring improvements

For more details see https://docs.gradle.org/8.14.4/release-notes.html

To honour the JVM settings for this build a single-use Daemon process will be forked. For more on this, please refer to https://docs.gradle.org/8.14.4/userguide/gradle_daemon.html#sec:disabling_the_daemon in the Gradle documentation.
Daemon will be stopped at the end of the build 
> Task :buildSrc:javacc:checkKotlinGradlePluginConfigurationErrors SKIPPED
> Task :buildSrc:buildext:checkKotlinGradlePluginConfigurationErrors SKIPPED
> Task :buildSrc:fmpp:checkKotlinGradlePluginConfigurationErrors SKIPPED
> Task :buildSrc:checkKotlinGradlePluginConfigurationErrors SKIPPED
> Task :buildSrc:compileKotlin NO-SOURCE
> Task :buildSrc:compileJava NO-SOURCE
> Task :buildSrc:compileGroovy NO-SOURCE
> Task :buildSrc:processResources NO-SOURCE
> Task :buildSrc:classes UP-TO-DATE
> Task :buildSrc:jar
> Task :buildSrc:buildext:pluginDescriptors
> Task :buildSrc:buildext:processResources
> Task :buildSrc:fmpp:pluginDescriptors
> Task :buildSrc:fmpp:processResources
> Task :buildSrc:javacc:pluginDescriptors
> Task :buildSrc:javacc:processResources

> Task :buildSrc:javacc:compileKotlin
w: file://<https://ci-builds.apache.org/job/Calcite/job/Calcite-snapshots/ws/buildSrc/subprojects/javacc/src/main/kotlin/org/apache/calcite/buildtools/javacc/JavaCCTask.kt>:63:17 'javaexec(Action<in JavaExecSpec!>): ExecResult' is deprecated. Deprecated in Java

> Task :buildSrc:buildext:compileKotlin
> Task :buildSrc:fmpp:compileKotlin
> Task :buildSrc:javacc:compileJava NO-SOURCE
> Task :buildSrc:buildext:compileJava NO-SOURCE
> Task :buildSrc:buildext:classes
> Task :buildSrc:fmpp:compileJava NO-SOURCE
> Task :buildSrc:javacc:classes
> Task :buildSrc:fmpp:classes
> Task :buildSrc:fmpp:jar
> Task :buildSrc:buildext:jar
> Task :buildSrc:javacc:jar

> Configure project :
w: file://<https://ci-builds.apache.org/job/Calcite/job/Calcite-snapshots/ws/build.gradle.kts>:915:49: Unchecked cast: Enumeration<*>! to Enumeration<String>
Building Apache Calcite 1.42.0-SNAPSHOT

> Configure project :splunk
w: file://<https://ci-builds.apache.org/job/Calcite/job/Calcite-snapshots/ws/splunk/build.gradle.kts>:59:61: Parameter 'sourceSetName' is never used

Build  FAILURE reason:                                
    Caused by: Please correct the following before proceeding with the release:
    1) Project property 'asfNexusUsername' is not specified
    2) Project property 'asfNexusPassword' is not specified
    
        at com.github.vlsi.gradle.release.StageVoteReleasePlugin.runValidations(StageVoteReleasePlugin.kt:458)
        at com.github.vlsi.gradle.release.StageVoteReleasePlugin.access$runValidations(StageVoteReleasePlugin.kt:68)
        at com.github.vlsi.gradle.release.StageVoteReleasePlugin$configureRoot$14.execute(StageVoteReleasePlugin.kt:357)
        at com.github.vlsi.gradle.release.StageVoteReleasePlugin$configureRoot$14.execute(StageVoteReleasePlugin.kt:311)
        at org.gradle.configuration.internal.DefaultListenerBuildOperationDecorator$BuildOperationEmittingInvocationHandler$1.lambda$run$0(DefaultListenerBuildOperationDecorator.java:257)
        at org.gradle.internal.code.DefaultUserCodeApplicationContext$CurrentApplication.reapply(DefaultUserCodeApplicationContext.java:99)
        at org.gradle.configuration.internal.DefaultListenerBuildOperationDecorator$BuildOperationEmittingInvocationHandler$1.run(DefaultListenerBuildOperationDecorator.java:255)
        at org.gradle.internal.operations.DefaultBuildOperationRunner$1.execute(DefaultBuildOperationRunner.java:30)
        at org.gradle.internal.operations.DefaultBuildOperationRunner$1.execute(DefaultBuildOperationRunner.java:27)
        at org.gradle.internal.operations.DefaultBuildOperationRunner$2.execute(DefaultBuildOperationRunner.java:67)
        at org.gradle.internal.operations.DefaultBuildOperationRunner$2.execute(DefaultBuildOperationRunner.java:60)
        at org.gradle.internal.operations.DefaultBuildOperationRunner.execute(DefaultBuildOperationRunner.java:167)
        at org.gradle.internal.operations.DefaultBuildOperationRunner.execute(DefaultBuildOperationRunner.java:60)
        at org.gradle.internal.operations.DefaultBuildOperationRunner.run(DefaultBuildOperationRunner.java:48)
        at org.gradle.configuration.internal.DefaultListenerBuildOperationDecorator$BuildOperationEmittingInvocationHandler.invoke(DefaultListenerBuildOperationDecorator.java:252)
        at org.gradle.internal.dispatch.ReflectionDispatch.dispatch(ReflectionDispatch.java:36)
        at org.gradle.internal.dispatch.ReflectionDispatch.dispatch(ReflectionDispatch.java:24)
        at org.gradle.internal.event.AbstractBroadcastDispatch.dispatch(AbstractBroadcastDispatch.java:44)
        at org.gradle.internal.event.BroadcastDispatch$SingletonDispatch.dispatch(BroadcastDispatch.java:268)
        at org.gradle.internal.event.BroadcastDispatch$SingletonDispatch.dispatch(BroadcastDispatch.java:170)
        at org.gradle.internal.event.AbstractBroadcastDispatch.dispatch(AbstractBroadcastDispatch.java:84)
        at org.gradle.internal.event.AbstractBroadcastDispatch.dispatch(AbstractBroadcastDispatch.java:70)
        at org.gradle.internal.event.BroadcastDispatch$CompositeDispatch.dispatch(BroadcastDispatch.java:380)
        at org.gradle.internal.event.BroadcastDispatch$CompositeDispatch.dispatch(BroadcastDispatch.java:272)
        at org.gradle.internal.event.ListenerBroadcast.dispatch(ListenerBroadcast.java:160)
        at org.gradle.internal.event.ListenerBroadcast.dispatch(ListenerBroadcast.java:37)
        at org.gradle.internal.dispatch.ProxyDispatchAdapter$DispatchingInvocationHandler.invoke(ProxyDispatchAdapter.java:92)
        at org.gradle.execution.taskgraph.DefaultTaskExecutionGraph$NotifyTaskGraphWhenReady.run(DefaultTaskExecutionGraph.java:375)
        at org.gradle.internal.operations.DefaultBuildOperationRunner$1.execute(DefaultBuildOperationRunner.java:30)
        at org.gradle.internal.operations.DefaultBuildOperationRunner$1.execute(DefaultBuildOperationRunner.java:27)
        at org.gradle.internal.operations.DefaultBuildOperationRunner$2.execute(DefaultBuildOperationRunner.java:67)
        at org.gradle.internal.operations.DefaultBuildOperationRunner$2.execute(DefaultBuildOperationRunner.java:60)
        at org.gradle.internal.operations.DefaultBuildOperationRunner.execute(DefaultBuildOperationRunner.java:167)
        at org.gradle.internal.operations.DefaultBuildOperationRunner.execute(DefaultBuildOperationRunner.java:60)
        at org.gradle.internal.operations.DefaultBuildOperationRunner.run(DefaultBuildOperationRunner.java:48)
        at org.gradle.execution.taskgraph.DefaultTaskExecutionGraph.lambda$fireWhenReady$0(DefaultTaskExecutionGraph.java:355)
        at org.gradle.internal.Factories$1.create(Factories.java:31)
        at org.gradle.internal.work.DefaultWorkerLeaseService.withReplacedLocks(DefaultWorkerLeaseService.java:359)
        at org.gradle.api.internal.project.DefaultProjectStateRegistry$DefaultBuildProjectRegistry.withMutableStateOfAllProjects(DefaultProjectStateRegistry.java:239)
        at org.gradle.api.internal.project.DefaultProjectStateRegistry$DefaultBuildProjectRegistry.withMutableStateOfAllProjects(DefaultProjectStateRegistry.java:232)
        at org.gradle.execution.taskgraph.DefaultTaskExecutionGraph.fireWhenReady(DefaultTaskExecutionGraph.java:354)
        at org.gradle.execution.taskgraph.DefaultTaskExecutionGraph.populate(DefaultTaskExecutionGraph.java:109)
        at org.gradle.internal.build.DefaultBuildWorkPreparer.finalizeWorkGraph(DefaultBuildWorkPreparer.java:53)
        at org.gradle.internal.build.BuildOperationFiringBuildWorkPreparer.finalizeWorkGraph(BuildOperationFiringBuildWorkPreparer.java:72)
        at org.gradle.internal.build.DefaultBuildLifecycleController.lambda$finalizeWorkGraph$9(DefaultBuildLifecycleController.java:202)
        at org.gradle.internal.model.StateTransitionController.lambda$doTransition$14(StateTransitionController.java:255)
        at org.gradle.internal.model.StateTransitionController.doTransition(StateTransitionController.java:266)
        at org.gradle.internal.model.StateTransitionController.doTransition(StateTransitionController.java:254)
        at org.gradle.internal.model.StateTransitionController.lambda$transition$5(StateTransitionController.java:160)
        at org.gradle.internal.work.DefaultSynchronizer.withLock(DefaultSynchronizer.java:36)
        at org.gradle.internal.model.StateTransitionController.transition(StateTransitionController.java:160)
        at org.gradle.internal.build.DefaultBuildLifecycleController.finalizeWorkGraph(DefaultBuildLifecycleController.java:198)
        at org.gradle.internal.build.DefaultBuildWorkGraphController$DefaultBuildWorkGraph.finalizeGraph(DefaultBuildWorkGraphController.java:206)
        at org.gradle.composite.internal.DefaultBuildController.finalizeWorkGraph(DefaultBuildController.java:120)
        at org.gradle.composite.internal.DefaultBuildControllers.populateWorkGraphs(DefaultBuildControllers.java:79)
        at org.gradle.composite.internal.DefaultIncludedBuildTaskGraph$DefaultBuildTreeWorkGraph$1.run(DefaultIncludedBuildTaskGraph.java:210)
        at org.gradle.internal.operations.DefaultBuildOperationRunner$1.execute(DefaultBuildOperationRunner.java:30)
        at org.gradle.internal.operations.DefaultBuildOperationRunner$1.execute(DefaultBuildOperationRunner.java:27)
        at org.gradle.internal.operations.DefaultBuildOperationRunner$2.execute(DefaultBuildOperationRunner.java:67)
        at org.gradle.internal.operations.DefaultBuildOperationRunner$2.execute(DefaultBuildOperationRunner.java:60)
        at org.gradle.internal.operations.DefaultBuildOperationRunner.execute(DefaultBuildOperationRunner.java:167)
        at org.gradle.internal.operations.DefaultBuildOperationRunner.execute(DefaultBuildOperationRunner.java:60)
        at org.gradle.internal.operations.DefaultBuildOperationRunner.run(DefaultBuildOperationRunner.java:48)
        at org.gradle.composite.internal.DefaultIncludedBuildTaskGraph$DefaultBuildTreeWorkGraph.scheduleWork(DefaultIncludedBuildTaskGraph.java:204)
        at org.gradle.internal.buildtree.DefaultBuildTreeWorkPreparer.scheduleRequestedTasks(DefaultBuildTreeWorkPreparer.java:37)
        at org.gradle.internal.cc.impl.VintageBuildTreeWorkController$scheduleAndRunRequestedTasks$1.apply(VintageBuildTreeWorkController.kt:36)
        at org.gradle.internal.cc.impl.VintageBuildTreeWorkController$scheduleAndRunRequestedTasks$1.apply(VintageBuildTreeWorkController.kt:35)
        at org.gradle.composite.internal.DefaultIncludedBuildTaskGraph.withNewWorkGraph(DefaultIncludedBuildTaskGraph.java:112)
        at org.gradle.internal.cc.impl.VintageBuildTreeWorkController.scheduleAndRunRequestedTasks(VintageBuildTreeWorkController.kt:35)
        at org.gradle.internal.buildtree.DefaultBuildTreeLifecycleController.lambda$scheduleAndRunTasks$1(DefaultBuildTreeLifecycleController.java:77)
        at org.gradle.internal.buildtree.DefaultBuildTreeLifecycleController.lambda$runBuild$4(DefaultBuildTreeLifecycleController.java:120)
        at org.gradle.internal.model.StateTransitionController.lambda$transition$6(StateTransitionController.java:169)
        at org.gradle.internal.model.StateTransitionController.doTransition(StateTransitionController.java:266)
        at org.gradle.internal.model.StateTransitionController.lambda$transition$7(StateTransitionController.java:169)
        at org.gradle.internal.work.DefaultSynchronizer.withLock(DefaultSynchronizer.java:46)
        at org.gradle.internal.model.StateTransitionController.transition(StateTransitionController.java:169)
        at org.gradle.internal.buildtree.DefaultBuildTreeLifecycleController.runBuild(DefaultBuildTreeLifecycleController.java:117)
        at org.gradle.internal.buildtree.DefaultBuildTreeLifecycleController.scheduleAndRunTasks(DefaultBuildTreeLifecycleController.java:77)
        at org.gradle.internal.buildtree.DefaultBuildTreeLifecycleController.scheduleAndRunTasks(DefaultBuildTreeLifecycleController.java:72)
        at org.gradle.tooling.internal.provider.ExecuteBuildActionRunner.run(ExecuteBuildActionRunner.java:31)
        at org.gradle.launcher.exec.ChainingBuildActionRunner.run(ChainingBuildActionRunner.java:35)
        at org.gradle.internal.buildtree.ProblemReportingBuildActionRunner.run(ProblemReportingBuildActionRunner.java:49)
        at org.gradle.launcher.exec.BuildOutcomeReportingBuildActionRunner.run(BuildOutcomeReportingBuildActionRunner.java:71)
        at org.gradle.tooling.internal.provider.FileSystemWatchingBuildActionRunner.run(FileSystemWatchingBuildActionRunner.java:135)
        at org.gradle.launcher.exec.BuildCompletionNotifyingBuildActionRunner.run(BuildCompletionNotifyingBuildActionRunner.java:41)
        at org.gradle.launcher.exec.RootBuildLifecycleBuildActionExecutor.lambda$execute$0(RootBuildLifecycleBuildActionExecutor.java:54)
        at org.gradle.composite.internal.DefaultRootBuildState.run(DefaultRootBuildState.java:130)
        at org.gradle.launcher.exec.RootBuildLifecycleBuildActionExecutor.execute(RootBuildLifecycleBuildActionExecutor.java:54)
        at org.gradle.internal.buildtree.InitDeprecationLoggingActionExecutor.execute(InitDeprecationLoggingActionExecutor.java:62)
        at org.gradle.internal.buildtree.InitProblems.execute(InitProblems.java:36)
        at org.gradle.internal.buildtree.DefaultBuildTreeContext.execute(DefaultBuildTreeContext.java:40)
        at org.gradle.launcher.exec.BuildTreeLifecycleBuildActionExecutor.lambda$execute$0(BuildTreeLifecycleBuildActionExecutor.java:71)
        at org.gradle.internal.buildtree.BuildTreeState.run(BuildTreeState.java:60)
        at org.gradle.launcher.exec.BuildTreeLifecycleBuildActionExecutor.execute(BuildTreeLifecycleBuildActionExecutor.java:71)
        at org.gradle.launcher.exec.RunAsBuildOperationBuildActionExecutor$2.call(RunAsBuildOperationBuildActionExecutor.java:67)
        at org.gradle.launcher.exec.RunAsBuildOperationBuildActionExecutor$2.call(RunAsBuildOperationBuildActionExecutor.java:63)
        at org.gradle.internal.operations.DefaultBuildOperationRunner$CallableBuildOperationWorker.execute(DefaultBuildOperationRunner.java:210)
        at org.gradle.internal.operations.DefaultBuildOperationRunner$CallableBuildOperationWorker.execute(DefaultBuildOperationRunner.java:205)
        at org.gradle.internal.operations.DefaultBuildOperationRunner$2.execute(DefaultBuildOperationRunner.java:67)
        at org.gradle.internal.operations.DefaultBuildOperationRunner$2.execute(DefaultBuildOperationRunner.java:60)
        at org.gradle.internal.operations.DefaultBuildOperationRunner.execute(DefaultBuildOperationRunner.java:167)
        at org.gradle.internal.operations.DefaultBuildOperationRunner.execute(DefaultBuildOperationRunner.java:60)
        at org.gradle.internal.operations.DefaultBuildOperationRunner.call(DefaultBuildOperationRunner.java:54)
        at org.gradle.launcher.exec.RunAsBuildOperationBuildActionExecutor.execute(RunAsBuildOperationBuildActionExecutor.java:63)
        at org.gradle.launcher.exec.RunAsWorkerThreadBuildActionExecutor.lambda$execute$0(RunAsWorkerThreadBuildActionExecutor.java:36)
        at org.gradle.internal.work.DefaultWorkerLeaseService.withLocks(DefaultWorkerLeaseService.java:263)
        at org.gradle.internal.work.DefaultWorkerLeaseService.runAsWorkerThread(DefaultWorkerLeaseService.java:127)
        at org.gradle.launcher.exec.RunAsWorkerThreadBuildActionExecutor.execute(RunAsWorkerThreadBuildActionExecutor.java:36)
        at org.gradle.tooling.internal.provider.continuous.ContinuousBuildActionExecutor.execute(ContinuousBuildActionExecutor.java:110)
        at org.gradle.tooling.internal.provider.SubscribableBuildActionExecutor.execute(SubscribableBuildActionExecutor.java:64)
        at org.gradle.internal.session.DefaultBuildSessionContext.execute(DefaultBuildSessionContext.java:46)
        at org.gradle.internal.buildprocess.execution.BuildSessionLifecycleBuildActionExecutor$ActionImpl.apply(BuildSessionLifecycleBuildActionExecutor.java:92)
        at org.gradle.internal.buildprocess.execution.BuildSessionLifecycleBuildActionExecutor$ActionImpl.apply(BuildSessionLifecycleBuildActionExecutor.java:80)
        at org.gradle.internal.session.BuildSessionState.run(BuildSessionState.java:73)
        at org.gradle.internal.buildprocess.execution.BuildSessionLifecycleBuildActionExecutor.execute(BuildSessionLifecycleBuildActionExecutor.java:62)
        at org.gradle.internal.buildprocess.execution.BuildSessionLifecycleBuildActionExecutor.execute(BuildSessionLifecycleBuildActionExecutor.java:41)
        at org.gradle.internal.buildprocess.execution.StartParamsValidatingActionExecutor.execute(StartParamsValidatingActionExecutor.java:64)
        at org.gradle.internal.buildprocess.execution.StartParamsValidatingActionExecutor.execute(StartParamsValidatingActionExecutor.java:32)
        at org.gradle.internal.buildprocess.execution.SessionFailureReportingActionExecutor.execute(SessionFailureReportingActionExecutor.java:51)
        at org.gradle.internal.buildprocess.execution.SessionFailureReportingActionExecutor.execute(SessionFailureReportingActionExecutor.java:39)
        at org.gradle.internal.buildprocess.execution.SetupLoggingActionExecutor.execute(SetupLoggingActionExecutor.java:47)
        at org.gradle.internal.buildprocess.execution.SetupLoggingActionExecutor.execute(SetupLoggingActionExecutor.java:31)
        at org.gradle.launcher.daemon.server.exec.ExecuteBuild.doBuild(ExecuteBuild.java:70)
        at org.gradle.launcher.daemon.server.exec.BuildCommandOnly.execute(BuildCommandOnly.java:37)
        at org.gradle.launcher.daemon.server.api.DaemonCommandExecution.proceed(DaemonCommandExecution.java:104)
        at org.gradle.launcher.daemon.server.exec.WatchForDisconnection.execute(WatchForDisconnection.java:39)
        at org.gradle.launcher.daemon.server.api.DaemonCommandExecution.proceed(DaemonCommandExecution.java:104)
        at org.gradle.launcher.daemon.server.exec.ResetDeprecationLogger.execute(ResetDeprecationLogger.java:29)
        at org.gradle.launcher.daemon.server.api.DaemonCommandExecution.proceed(DaemonCommandExecution.java:104)
        at org.gradle.launcher.daemon.server.exec.RequestStopIfSingleUsedDaemon.execute(RequestStopIfSingleUsedDaemon.java:35)
        at org.gradle.launcher.daemon.server.api.DaemonCommandExecution.proceed(DaemonCommandExecution.java:104)
        at org.gradle.launcher.daemon.server.exec.ForwardClientInput.lambda$execute$0(ForwardClientInput.java:40)
        at org.gradle.internal.daemon.clientinput.ClientInputForwarder.forwardInput(ClientInputForwarder.java:80)
        at org.gradle.launcher.daemon.server.exec.ForwardClientInput.execute(ForwardClientInput.java:37)
        at org.gradle.launcher.daemon.server.api.DaemonCommandExecution.proceed(DaemonCommandExecution.java:104)
        at org.gradle.launcher.daemon.server.exec.LogAndCheckHealth.execute(LogAndCheckHealth.java:53)
        at org.gradle.launcher.daemon.server.api.DaemonCommandExecution.proceed(DaemonCommandExecution.java:104)
        at org.gradle.launcher.daemon.server.exec.LogToClient.doBuild(LogToClient.java:63)
        at org.gradle.launcher.daemon.server.exec.BuildCommandOnly.execute(BuildCommandOnly.java:37)
        at org.gradle.launcher.daemon.server.api.DaemonCommandExecution.proceed(DaemonCommandExecution.java:104)
        at org.gradle.launcher.daemon.server.exec.EstablishBuildEnvironment.doBuild(EstablishBuildEnvironment.java:84)
        at org.gradle.launcher.daemon.server.exec.BuildCommandOnly.execute(BuildCommandOnly.java:37)
        at org.gradle.launcher.daemon.server.api.DaemonCommandExecution.proceed(DaemonCommandExecution.java:104)
        at org.gradle.launcher.daemon.server.exec.StartBuildOrRespondWithBusy$1.run(StartBuildOrRespondWithBusy.java:52)
        at org.gradle.launcher.daemon.server.DaemonStateCoordinator.lambda$runCommand$0(DaemonStateCoordinator.java:321)
        at org.gradle.internal.concurrent.ExecutorPolicy$CatchAndRecordFailures.onExecute(ExecutorPolicy.java:64)
        at org.gradle.internal.concurrent.AbstractManagedExecutor$1.run(AbstractManagedExecutor.java:48)


[Incubating] Problems report is available at: file://<https://ci-builds.apache.org/job/Calcite/job/Calcite-snapshots/ws/build/reports/problems/problems-report.html>

FAILURE: Build failed with an exception.

* What went wrong:
Please correct the following before proceeding with the release:
1) Project property 'asfNexusUsername' is not specified
2) Project property 'asfNexusPassword' is not specified


* Try:
> Run with --stacktrace option to get the stack trace.
> Run with --info or --debug option to get more log output.
> Get more help at https://help.gradle.org.

Deprecated Gradle features were used in this build, making it incompatible with Gradle 9.0.

You can use '--warning-mode all' to show the individual deprecation warnings and determine if they come from your own scripts or plugins.

For more on this, please refer to https://docs.gradle.org/8.14.4/userguide/command_line_interface.html#sec:command_line_warnings in the Gradle documentation.

BUILD FAILED in 3m 32s
13 actionable tasks: 13 executed

See the profiling report at: file://<https://ci-builds.apache.org/job/Calcite/job/Calcite-snapshots/ws/build/reports/profile/profile-2026-05-13-16-14-29.html>
A fine-grained performance profile is available: use the --scan option.
Build step 'Invoke Gradle script' changed build result to FAILURE
Build step 'Invoke Gradle script' marked build as failure
Recording test results
ERROR: Step ‘Publish JUnit test result report’ failed: No test report files were found. Configuration error?

Build failed in Jenkins: Calcite » Calcite-snapshots #1838

Posted by Apache Jenkins Server <je...@builds.apache.org>.
See <https://ci-builds.apache.org/job/Calcite/job/Calcite-snapshots/1838/display/redirect?page=changes>

Changes:

[Zhen Chen] Document how PMC members add JIRA users to project roles


------------------------------------------
[...truncated 530.51 KiB...]
    Warning: JDBC driver threw non-SQLException
    Warning: JDBC driver threw non-SQLException
    Warning: JDBC driver threw non-SQLException

SqlOperatorUnparseTest > testCustomTimeFrame() STANDARD_OUT
    Warning: JDBC driver threw non-SQLException
    Warning: JDBC driver threw non-SQLException
    Warning: JDBC driver threw non-SQLException
    Warning: JDBC driver threw non-SQLException
    Warning: JDBC driver threw non-SQLException
          2.4sec, org.apache.calcite.test.CoreQuidemTest > test(String)[14], [14] sql/cast-with-format.iq
          0.5sec,    3 completed,   0 failed,   0 skipped, org.apache.calcite.test.SqlOperatorUnparseTest > testCastStringToDecimal(CastType, SqlOperatorFixture)
          2.7sec, org.apache.calcite.test.CoreQuidemTest > test(String)[15], [15] sql/some.iq
          9.4sec, org.apache.calcite.test.CalciteSqlOperatorTest > testPeriodOperators()
          1.4sec,    2 completed,   0 failed,   0 skipped, org.apache.calcite.test.CalciteSqlOperatorTest > testBitGetFunc(SqlOperatorFixture, String)
          0.0sec,    3 completed,   0 failed,   0 skipped, org.apache.calcite.test.SqlOperatorUnparseTest > testCastApproxNumericLimits(CastType, SqlOperatorFixture)
          2.6sec, org.apache.calcite.test.CalciteSqlOperatorTest > testTimestampAdd()
          1.1sec,    3 completed,   0 failed,   0 skipped, org.apache.calcite.test.CalciteSqlOperatorTest > testCastStringToDecimal(CastType, SqlOperatorFixture)
          0.1sec,    3 completed,   0 failed,   0 skipped, org.apache.calcite.test.SqlOperatorUnparseTest > testCastBooleanToNumeric(CastType, SqlOperatorFixture)
          3.3sec, org.apache.calcite.test.CalciteSqlOperatorTest > testRandIntegerFunc()
          0.0sec,    3 completed,   0 failed,   0 skipped, org.apache.calcite.test.SqlOperatorUnparseTest > testCastFormatClauseNumericToString(CastType, SqlOperatorFixture)
          2.4sec, org.apache.calcite.test.CalciteSqlOperatorTest > testRpadFunction()
          2.2sec, org.apache.calcite.test.SqlOperatorUnparseTest > testQuantifyCollectionOperators()
         26.2sec, org.apache.calcite.test.CoreQuidemTest2 > test(String)[17], [17] sql/sub-query.iq

CalciteSqlOperatorTest > testRegexpExtractFunc() STANDARD_OUT
    Warning: JDBC driver threw non-SQLException
          2.1sec, org.apache.calcite.test.CoreQuidemTest2 > test(String)[18], [18] sql/functions.iq
          1.9sec,    3 completed,   0 failed,   0 skipped, org.apache.calcite.test.SqlOperatorUnparseTest > testCastIntervalToNumeric(CastType, SqlOperatorFixture)
          0.1sec,    3 completed,   0 failed,   0 skipped, org.apache.calcite.test.SqlOperatorUnparseTest > testCast(CastType, SqlOperatorFixture)
          2.8sec, org.apache.calcite.test.CalciteSqlOperatorTest > testBigQuerySubstrFunction()
          4.6sec, org.apache.calcite.test.CoreQuidemTest2 > test(String)[19], [19] sql/winagg.iq
          2.5sec,    3 completed,   0 failed,   0 skipped, org.apache.calcite.test.SqlOperatorUnparseTest > testCastFormatClauseDateTimeToString(CastType, SqlOperatorFixture)
          3.5sec, org.apache.calcite.test.CalciteSqlOperatorTest > testToCharPg()
          2.6sec, org.apache.calcite.test.CoreQuidemTest2 > test(String)[20], [20] sql/measure.iq
          2.6sec, org.apache.calcite.test.CalciteSqlOperatorTest > testFormatNumber()

CalciteSqlOperatorTest > testJsonArrayAgg() STANDARD_OUT
    Warning: JDBC driver threw non-SQLException
         36.4sec, org.apache.calcite.test.CoreQuidemTest > test(String)[17], [17] sql/sub-query.iq
          0.0sec,    3 completed,   0 failed,   0 skipped, org.apache.calcite.test.CalciteSqlOperatorTest > testCastApproxNumericLimits(CastType, SqlOperatorFixture)

CalciteSqlOperatorTest > testArrayIntersectFunc() STANDARD_OUT
    Warning: JDBC driver threw non-SQLException
          2.2sec,    3 completed,   0 failed,   0 skipped, org.apache.calcite.test.SqlOperatorUnparseTest > testCastWithRoundingToScalar(CastType, SqlOperatorFixture)
          2.2sec, org.apache.calcite.test.CoreQuidemTest > test(String)[18], [18] sql/functions.iq
          4.9sec, org.apache.calcite.test.CoreQuidemTest2 > test(String)[22], [22] sql/join.iq

SqlOperatorUnparseTest > testArrayRepeatFunc() STANDARD_OUT
    Warning: JDBC driver threw non-SQLException

SqlOperatorUnparseTest > testArrayLengthFunc() STANDARD_OUT
    Warning: JDBC driver threw non-SQLException

SqlOperatorUnparseTest > testBitXorScalarFunc() STANDARD_OUT
    Warning: JDBC driver threw non-SQLException
    Warning: JDBC driver threw non-SQLException

SqlOperatorUnparseTest > testExtractIntervalDayTime() STANDARD_OUT
    Warning: JDBC driver threw non-SQLException
          4.8sec, org.apache.calcite.test.CoreQuidemTest > test(String)[19], [19] sql/winagg.iq
          3.2sec, org.apache.calcite.test.CoreQuidemTest2 > test(String)[25], [25] sql/within-distinct.iq
          4.2sec, org.apache.calcite.test.SqlOperatorUnparseTest > testRandomFunc()
          2.7sec, org.apache.calcite.test.CoreQuidemTest > test(String)[20], [20] sql/measure.iq
          2.9sec, org.apache.calcite.test.CalciteSqlOperatorTest > testPostgresqlSubstrFunction()
          2.4sec, org.apache.calcite.test.CoreQuidemTest2 > test(String)[28], [28] sql/outer.iq
          0.3sec,    3 completed,   0 failed,   0 skipped, org.apache.calcite.test.CalciteSqlOperatorTest > testCastBooleanToNumeric(CastType, SqlOperatorFixture)
          5.0sec, org.apache.calcite.test.CoreQuidemTest > test(String)[22], [22] sql/join.iq

SqlOperatorUnparseTest > testJsonObject() STANDARD_OUT
    Warning: JDBC driver threw non-SQLException
    Warning: JDBC driver threw non-SQLException

SqlOperatorUnparseTest > testFormatDate() STANDARD_OUT
    Warning: JDBC driver threw non-SQLException
    Warning: JDBC driver threw non-SQLException

SqlOperatorUnparseTest > testFormatTime() STANDARD_OUT
    Warning: JDBC driver threw non-SQLException
          2.3sec, org.apache.calcite.test.CoreQuidemTest2 > test(String)[31], [31] sql/operator.iq
          2.3sec, org.apache.calcite.test.CalciteSqlOperatorTest > testLogMysqlSparkFunc()
          0.0sec,    3 completed,   0 failed,   0 skipped, org.apache.calcite.test.CalciteSqlOperatorTest > testCastFormatClauseNumericToString(CastType, SqlOperatorFixture)
          3.6sec, org.apache.calcite.test.CoreQuidemTest > test(String)[25], [25] sql/within-distinct.iq
          1.8sec,    2 completed,   0 failed,   0 skipped, org.apache.calcite.test.SqlOperatorUnparseTest > testTimestampDiff(boolean)
          0.5sec,    3 completed,   0 failed,   0 skipped, org.apache.calcite.test.SqlOperatorUnparseTest > testCastToInterval(CastType, SqlOperatorFixture)
          3.0sec, org.apache.calcite.test.CalciteSqlOperatorTest > testQuantifyCollectionOperators()
          2.9sec,    3 completed,   0 failed,   0 skipped, org.apache.calcite.test.CalciteSqlOperatorTest > testCastIntervalToNumeric(CastType, SqlOperatorFixture)
          0.1sec,    3 completed,   0 failed,   0 skipped, org.apache.calcite.test.CalciteSqlOperatorTest > testCast(CastType, SqlOperatorFixture)
          2.1sec, org.apache.calcite.test.SqlOperatorUnparseTest > testCastExactNumericLimits(CastType, SqlOperatorFixture)[2], [2] SAFE_CAST, org.apache.calcite.test.SqlOperatorFixtures$SqlOperatorFixtureInvocationHandler@55179efd
         16.7sec, org.apache.calcite.test.CoreQuidemTest2 > test(String)[32], [32] sql/agg.iq

CoreQuidemTest2 > test(String) > [33] sql/scalar.iq STANDARD_OUT
    Warning: JDBC driver threw non-SQLException
    Warning: JDBC driver threw non-SQLException
    Warning: JDBC driver threw non-SQLException
    Warning: JDBC driver threw non-SQLException
    Warning: JDBC driver threw non-SQLException
          2.1sec, org.apache.calcite.test.SqlOperatorUnparseTest > testCastExactNumericLimits(CastType, SqlOperatorFixture)[3], [3] TRY_CAST, org.apache.calcite.test.SqlOperatorFixtures$SqlOperatorFixtureInvocationHandler@7500ef1b
          5.8sec,    3 completed,   0 failed,   0 skipped, org.apache.calcite.test.SqlOperatorUnparseTest > testCastExactNumericLimits(CastType, SqlOperatorFixture)
          0.7sec,    3 completed,   0 failed,   0 skipped, org.apache.calcite.test.SqlOperatorUnparseTest > testCastDateTime(CastType, SqlOperatorFixture)
          0.3sec,    3 completed,   0 failed,   0 skipped, org.apache.calcite.test.SqlOperatorUnparseTest > testCastFormatClauseStringToDateTime(CastType, SqlOperatorFixture)

SqlOperatorUnparseTest > testConcatWSFunc() STANDARD_OUT
    Warning: JDBC driver threw non-SQLException
          4.2sec,    3 completed,   0 failed,   0 skipped, org.apache.calcite.test.CalciteSqlOperatorTest > testCastFormatClauseDateTimeToString(CastType, SqlOperatorFixture)

SqlOperatorUnparseTest > testXmlTransform() STANDARD_ERROR
    [Fatal Error] :1:2: XML document structures must start and end within the same entity.
          0.4sec,    3 completed,   0 failed,   0 skipped, org.apache.calcite.test.SqlOperatorUnparseTest > testCastTruncates(CastType, SqlOperatorFixture)
         16.0sec, org.apache.calcite.test.CoreQuidemTest > test(String)[32], [32] sql/agg.iq

CalciteSqlOperatorTest > testCastWithRoundingToScalar(CastType, SqlOperatorFixture) > [2] SAFE_CAST, org.apache.calcite.test.SqlOperatorFixtures$SqlOperatorFixtureInvocationHandler@670aee5a STANDARD_OUT
    Warning: JDBC driver threw non-SQLException
    Warning: JDBC driver threw non-SQLException
    Warning: JDBC driver threw non-SQLException
    Warning: JDBC driver threw non-SQLException
    Warning: JDBC driver threw non-SQLException
          9.2sec, org.apache.calcite.test.CoreQuidemTest2 > test(String)[35], [35] sql/spatial.iq
        236.7sec,   40 completed,   0 failed,   0 skipped, org.apache.calcite.test.CoreQuidemTest2 > test(String)
        236.7sec,   40 completed,   0 failed,   0 skipped, org.apache.calcite.test.CoreQuidemTest2
          3.2sec,    3 completed,   0 failed,   0 skipped, org.apache.calcite.test.CalciteSqlOperatorTest > testCastWithRoundingToScalar(CastType, SqlOperatorFixture)

CalciteSqlOperatorTest > testArrayRemoveFunc() STANDARD_OUT
    Warning: JDBC driver threw non-SQLException
          0.4sec,    3 completed,   0 failed,   0 skipped, org.apache.calcite.test.SqlOperatorUnparseTest > testCastDecimalToDoubleToInteger(CastType, SqlOperatorFixture)
          8.6sec, org.apache.calcite.test.CoreQuidemTest > test(String)[35], [35] sql/spatial.iq
        246.1sec,   40 completed,   0 failed,   0 skipped, org.apache.calcite.test.CoreQuidemTest > test(String)
        246.1sec,   40 completed,   0 failed,   0 skipped, org.apache.calcite.test.CoreQuidemTest
          5.6sec, org.apache.calcite.test.CalciteSqlOperatorTest > testRandomFunc()
          3.4sec, org.apache.calcite.test.SqlOperatorUnparseTest > testCastToString(CastType, SqlOperatorFixture)[2], [2] SAFE_CAST, org.apache.calcite.test.SqlOperatorFixtures$SqlOperatorFixtureInvocationHandler@da47875
          3.7sec, org.apache.calcite.test.SqlOperatorUnparseTest > testCastToString(CastType, SqlOperatorFixture)[3], [3] TRY_CAST, org.apache.calcite.test.SqlOperatorFixtures$SqlOperatorFixtureInvocationHandler@6474bc0d
          9.0sec,    3 completed,   0 failed,   0 skipped, org.apache.calcite.test.SqlOperatorUnparseTest > testCastToString(CastType, SqlOperatorFixture)
          0.5sec,    3 completed,   0 failed,   0 skipped, org.apache.calcite.test.SqlOperatorUnparseTest > testCastNull(CastType, SqlOperatorFixture)
          2.8sec, org.apache.calcite.test.CalciteSqlOperatorTest > testMysqlSubstrFunction()
          0.4sec,    3 completed,   0 failed,   0 skipped, org.apache.calcite.test.SqlOperatorUnparseTest > testCastToApproxNumeric(CastType, SqlOperatorFixture)
          3.7sec,    2 completed,   0 failed,   0 skipped, org.apache.calcite.test.CalciteSqlOperatorTest > testTimestampDiff(boolean)
          0.3sec,    3 completed,   0 failed,   0 skipped, org.apache.calcite.test.SqlOperatorUnparseTest > testCastIntervalToInterval(CastType, SqlOperatorFixture)
          0.5sec,    3 completed,   0 failed,   0 skipped, org.apache.calcite.test.SqlOperatorUnparseTest > testCastToBoolean(CastType, SqlOperatorFixture)
          1.4sec,    3 completed,   0 failed,   0 skipped, org.apache.calcite.test.CalciteSqlOperatorTest > testCastToInterval(CastType, SqlOperatorFixture)
          2.6sec, org.apache.calcite.test.CalciteSqlOperatorTest > testStandardSubstringFunction()
          3.6sec, org.apache.calcite.test.CalciteSqlOperatorTest > testCastExactNumericLimits(CastType, SqlOperatorFixture)[1], [1] CAST, org.apache.calcite.test.SqlOperatorFixtureImpl@3ee05778
          3.1sec,    3 completed,   0 failed,   0 skipped, org.apache.calcite.test.SqlOperatorUnparseTest > testCastStringToDateTime(CastType, SqlOperatorFixture)

SqlOperatorUnparseTest > testExtractValue() STANDARD_ERROR
    [Fatal Error] :1:14: The markup in the document following the root element must be well-formed.
          5.4sec, org.apache.calcite.test.CalciteSqlOperatorTest > testCastExactNumericLimits(CastType, SqlOperatorFixture)[2], [2] SAFE_CAST, org.apache.calcite.test.SqlOperatorFixtures$SqlOperatorFixtureInvocationHandler@20f27aa5
          6.1sec, org.apache.calcite.test.CalciteSqlOperatorTest > testCastExactNumericLimits(CastType, SqlOperatorFixture)[3], [3] TRY_CAST, org.apache.calcite.test.SqlOperatorFixtures$SqlOperatorFixtureInvocationHandler@3212ab34
         15.1sec,    3 completed,   0 failed,   0 skipped, org.apache.calcite.test.CalciteSqlOperatorTest > testCastExactNumericLimits(CastType, SqlOperatorFixture)
          1.6sec,    3 completed,   0 failed,   0 skipped, org.apache.calcite.test.CalciteSqlOperatorTest > testCastDateTime(CastType, SqlOperatorFixture)
          0.7sec,    3 completed,   0 failed,   0 skipped, org.apache.calcite.test.CalciteSqlOperatorTest > testCastFormatClauseStringToDateTime(CastType, SqlOperatorFixture)

CalciteSqlOperatorTest > testXmlTransform() STANDARD_ERROR
    [Fatal Error] :1:2: XML document structures must start and end within the same entity.
          1.0sec,    3 completed,   0 failed,   0 skipped, org.apache.calcite.test.CalciteSqlOperatorTest > testCastTruncates(CastType, SqlOperatorFixture)
          3.5sec, org.apache.calcite.test.CalciteSqlOperatorTest > testBitAndOperatorScalarFunc()
          5.0sec, org.apache.calcite.test.SqlOperatorUnparseTest > testRlikeOperator()
          0.0sec,    3 completed,   0 failed,   0 skipped, org.apache.calcite.test.SqlOperatorUnparseTest > testCastFormatClauseByteToString(CastType, SqlOperatorFixture)
WARNING 222.0sec,  580 completed,   0 failed,   1 skipped, org.apache.calcite.test.SqlOperatorUnparseTest
          2.3sec, org.apache.calcite.test.CalciteSqlOperatorTest > testCoshFunc()
          3.7sec, org.apache.calcite.test.CalciteSqlOperatorTest > testOracleSubstrFunction()
          1.3sec,    3 completed,   0 failed,   0 skipped, org.apache.calcite.test.CalciteSqlOperatorTest > testCastDecimalToDoubleToInteger(CastType, SqlOperatorFixture)
          2.2sec, org.apache.calcite.test.CalciteSqlOperatorTest > testRepeatFunc()
          2.0sec, org.apache.calcite.test.CalciteSqlOperatorTest > testAddMonths()
          3.0sec, org.apache.calcite.test.CalciteSqlOperatorTest > testCscFunc()
          5.4sec, org.apache.calcite.test.CalciteSqlOperatorTest > testCastToString(CastType, SqlOperatorFixture)[1], [1] CAST, org.apache.calcite.test.SqlOperatorFixtureImpl@17aba232
          9.2sec, org.apache.calcite.test.CalciteSqlOperatorTest > testCastToString(CastType, SqlOperatorFixture)[2], [2] SAFE_CAST, org.apache.calcite.test.SqlOperatorFixtures$SqlOperatorFixtureInvocationHandler@6ae02270
          9.4sec, org.apache.calcite.test.CalciteSqlOperatorTest > testCastToString(CastType, SqlOperatorFixture)[3], [3] TRY_CAST, org.apache.calcite.test.SqlOperatorFixtures$SqlOperatorFixtureInvocationHandler@459fbf99
         23.9sec,    3 completed,   0 failed,   0 skipped, org.apache.calcite.test.CalciteSqlOperatorTest > testCastToString(CastType, SqlOperatorFixture)
          1.2sec,    3 completed,   0 failed,   0 skipped, org.apache.calcite.test.CalciteSqlOperatorTest > testCastNull(CastType, SqlOperatorFixture)
          2.9sec, org.apache.calcite.test.CalciteSqlOperatorTest > testAtanhFunc()
          3.7sec, org.apache.calcite.test.CalciteSqlOperatorTest > testRandFunc()
          2.2sec, org.apache.calcite.test.CalciteSqlOperatorTest > testAcoshFunc()
          1.1sec,    3 completed,   0 failed,   0 skipped, org.apache.calcite.test.CalciteSqlOperatorTest > testCastToApproxNumeric(CastType, SqlOperatorFixture)
          0.9sec,    3 completed,   0 failed,   0 skipped, org.apache.calcite.test.CalciteSqlOperatorTest > testCastIntervalToInterval(CastType, SqlOperatorFixture)
          1.9sec,    3 completed,   0 failed,   0 skipped, org.apache.calcite.test.CalciteSqlOperatorTest > testCastToBoolean(CastType, SqlOperatorFixture)
          2.1sec, org.apache.calcite.test.CalciteSqlOperatorTest > testSinhFunc()
          2.5sec, org.apache.calcite.test.CalciteSqlOperatorTest > testSimilarToOperator()
          2.1sec, org.apache.calcite.test.CalciteSqlOperatorTest > testJdbcFn()
          4.2sec,    3 completed,   0 failed,   0 skipped, org.apache.calcite.test.CalciteSqlOperatorTest > testCastStringToDateTime(CastType, SqlOperatorFixture)
          2.1sec, org.apache.calcite.test.CalciteSqlOperatorTest > testSecFunc()

CalciteSqlOperatorTest > testExtractValue() STANDARD_ERROR
    [Fatal Error] :1:14: The markup in the document following the root element must be well-formed.
          3.5sec, org.apache.calcite.test.CalciteSqlOperatorTest > testToChar()
          2.1sec, org.apache.calcite.test.CalciteSqlOperatorTest > testLpadFunction()
          2.6sec, org.apache.calcite.test.CalciteSqlOperatorTest > testBigQuerySubstringFunction()
          7.4sec, org.apache.calcite.test.CalciteSqlOperatorTest > testRlikeOperator()
          0.0sec,    3 completed,   0 failed,   0 skipped, org.apache.calcite.test.CalciteSqlOperatorTest > testCastFormatClauseByteToString(CastType, SqlOperatorFixture)
WARNING 483.4sec,  582 completed,   0 failed,   1 skipped, org.apache.calcite.test.CalciteSqlOperatorTest
FAILURE   0.0sec, UnknownClass > executionError
    org.junit.platform.commons.JUnitException: TestEngine with ID 'junit-jupiter' failed to execute tests
        Caused by: org.junit.platform.commons.JUnitException: Error executing tests for engine junit-jupiter
            Caused by: java.util.concurrent.ExecutionException: java.lang.OutOfMemoryError
                at java.util.concurrent.ForkJoinTask.get(ForkJoinTask.java:1006)
                Caused by: java.lang.OutOfMemoryError
                    at java.util.concurrent.ForkJoinTask.getThrowableException(ForkJoinTask.java:598)
                    at java.util.concurrent.ForkJoinTask.get(ForkJoinTask.java:1005)
                    Caused by: java.lang.OutOfMemoryError
                        at java.util.concurrent.ForkJoinTask.getThrowableException(ForkJoinTask.java:598)
                        at java.util.concurrent.ForkJoinTask.reportException(ForkJoinTask.java:677)
                        at java.util.concurrent.ForkJoinTask.join(ForkJoinTask.java:720)
                        at java.util.concurrent.ForkJoinTask.doExec(ForkJoinTask.java:289)
                        at java.util.concurrent.ForkJoinPool$WorkQueue.runTask(ForkJoinPool.java:1056)
                        at java.util.concurrent.ForkJoinPool.runWorker(ForkJoinPool.java:1692)
                        at java.util.concurrent.ForkJoinWorkerThread.run(ForkJoinWorkerThread.java:175)
                        Caused by: java.lang.OutOfMemoryError: Java heap space
                            at org.apache.calcite.sql.parser.impl.SimpleCharStream.ReInit(SimpleCharStream.java:277)
                            at org.apache.calcite.sql.parser.impl.SqlParserImpl$1.getParser(SqlParserImpl.java:166)
                            at org.apache.calcite.sql.parser.SqlParser.create(SqlParser.java:127)
                            at org.apache.calcite.sql.test.SqlTestFactory.createParser(SqlTestFactory.java:140)
                            at org.apache.calcite.sql.parser.SqlParserTest$TesterImpl.parseStmtAndHandleEx(SqlParserTest.java:9893)
                            at org.apache.calcite.sql.parser.SqlParserTest$TesterImpl.check(SqlParserTest.java:9884)
                            at org.apache.calcite.sql.parser.SqlParserFixture.compare(SqlParserFixture.java:90)
                            at org.apache.calcite.sql.parser.SqlParserFixture.ok(SqlParserFixture.java:82)
                            at org.apache.calcite.sql.parser.SqlParserTest.checkLarge(SqlParserTest.java:832)
                            at org.apache.calcite.sql.parser.SqlParserTest.testLarge(SqlParserTest.java:813)

FAILURE   0.0sec,    1 completed,   1 failed,   0 skipped, UnknownClass, JUnit Jupiter
SKIPPED 481.8sec, org.apache.calcite.sql.parser.CoreSqlParserTest > testLarge()
SKIPPED 484.7sec,  494 completed,   0 failed,   4 skipped, org.apache.calcite.sql.parser.CoreSqlParserTest
FAILURE 516.3sec, 15503 completed,   1 failed, 110 skipped, Gradle Test Run :core:test

15503 tests completed, 1 failed, 110 skipped

> Task :core:test FAILED

[Incubating] Problems report is available at: file://<https://ci-builds.apache.org/job/Calcite/job/Calcite-snapshots/ws/build/reports/problems/problems-report.html>

FAILURE: Build failed with an exception.

* What went wrong:
Execution failed for task ':core:test'.
> There were failing tests. See the report at: file://<https://ci-builds.apache.org/job/Calcite/job/Calcite-snapshots/ws/core/build/reports/tests/test/index.html>

Deprecated Gradle features were used in this build, making it incompatible with Gradle 9.0.

You can use '--warning-mode all' to show the individual deprecation warnings and determine if they come from your own scripts or plugins.

For more on this, please refer to https://docs.gradle.org/8.14.4/userguide/command_line_interface.html#sec:command_line_warnings in the Gradle documentation.

BUILD FAILED in 17m 5s
472 actionable tasks: 472 executed

See the profiling report at: file://<https://ci-builds.apache.org/job/Calcite/job/Calcite-snapshots/ws/build/reports/profile/profile-2026-05-14-10-11-00.html>
A fine-grained performance profile is available: use the --scan option.
Build step 'Invoke Gradle script' changed build result to FAILURE
Build step 'Invoke Gradle script' marked build as failure
Recording test results
[Checks API] No suitable checks publisher found.

Build failed in Jenkins: Calcite » Calcite-snapshots #1837

Posted by Apache Jenkins Server <je...@builds.apache.org>.
See <https://ci-builds.apache.org/job/Calcite/job/Calcite-snapshots/1837/display/redirect?page=changes>

Changes:

[mbudiu] [CALCITE-7524] JdbcSchema throws exception for DECIMAL columns with precision 0 in JDBC metadata


------------------------------------------
[...truncated 531.89 KiB...]
         15.0sec, org.apache.calcite.test.CoreQuidemTest > test(String)[29], [29] sql/agg.iq

CoreQuidemTest > test(String) > [30] sql/unsigned.iq STANDARD_OUT
    Warning: JDBC driver threw non-SQLException
    Warning: JDBC driver threw non-SQLException
    Warning: JDBC driver threw non-SQLException
    Warning: JDBC driver threw non-SQLException
    Warning: JDBC driver threw non-SQLException
          3.0sec, org.apache.calcite.test.SqlOperatorUnparseTest > testRandomFunc()
          4.5sec, org.apache.calcite.test.CoreQuidemTest2 > test(String)[32], [32] sql/join.iq

SqlOperatorUnparseTest > testExistsFunc() STANDARD_OUT
    Warning: JDBC driver threw non-SQLException
    Warning: JDBC driver threw non-SQLException
    Warning: JDBC driver threw non-SQLException
    Warning: JDBC driver threw non-SQLException
    Warning: JDBC driver threw non-SQLException
    Warning: JDBC driver threw non-SQLException
    Warning: JDBC driver threw non-SQLException
    Warning: JDBC driver threw non-SQLException
          2.4sec, org.apache.calcite.test.CalciteSqlOperatorTest > testPostgresqlSubstrFunction()

SqlOperatorUnparseTest > testExistsNode() STANDARD_OUT
    Warning: JDBC driver threw non-SQLException
          4.0sec, org.apache.calcite.test.CoreQuidemTest > test(String)[32], [32] sql/join.iq

CalciteSqlOperatorTest > testStddevFunc() STANDARD_OUT
    Warning: JDBC driver threw non-SQLException

SqlOperatorUnparseTest > testLevenshtein() STANDARD_OUT
    Warning: JDBC driver threw non-SQLException
    Warning: JDBC driver threw non-SQLException
    Warning: JDBC driver threw non-SQLException

CoreQuidemTest > test(String) STANDARD_OUT
    Warning: JDBC driver threw non-SQLException

CoreQuidemTest > test(String) > [34] sql/cast.iq STANDARD_OUT
    Warning: JDBC driver threw non-SQLException
    Warning: JDBC driver threw non-SQLException
    Warning: JDBC driver threw non-SQLException
    Warning: JDBC driver threw non-SQLException
    Warning: JDBC driver threw non-SQLException
    Warning: JDBC driver threw non-SQLException

SqlOperatorUnparseTest > testStringComparisonWithConvertFunc() STANDARD_OUT
    Warning: JDBC driver threw non-SQLException
    Warning: JDBC driver threw non-SQLException
    Warning: JDBC driver threw non-SQLException
    Warning: JDBC driver threw non-SQLException
    Warning: JDBC driver threw non-SQLException
    Warning: JDBC driver threw non-SQLException

SqlOperatorUnparseTest > testJsonLength() STANDARD_OUT
    Warning: JDBC driver threw non-SQLException
    Warning: JDBC driver threw non-SQLException
    Warning: JDBC driver threw non-SQLException
    Warning: JDBC driver threw non-SQLException
    Warning: JDBC driver threw non-SQLException
    Warning: JDBC driver threw non-SQLException
    Warning: JDBC driver threw non-SQLException

SqlOperatorUnparseTest > testQuantifyOperatorsWithTypeCoercion() STANDARD_OUT
    Warning: JDBC driver threw non-SQLException
    Warning: JDBC driver threw non-SQLException
    Warning: JDBC driver threw non-SQLException
    Warning: JDBC driver threw non-SQLException
    Warning: JDBC driver threw non-SQLException
    Warning: JDBC driver threw non-SQLException

CalciteSqlOperatorTest > testJsonKeys() STANDARD_OUT
    Warning: JDBC driver threw non-SQLException
          0.1sec,    3 completed,   0 failed,   0 skipped, org.apache.calcite.test.CalciteSqlOperatorTest > testCastBooleanToNumeric(CastType, SqlOperatorFixture)

SqlOperatorUnparseTest > testCharLengthFunc() STANDARD_OUT
    Warning: JDBC driver threw non-SQLException
    Warning: JDBC driver threw non-SQLException

SqlOperatorUnparseTest > testReverseSparkFunc() STANDARD_OUT
    Warning: JDBC driver threw non-SQLException
    Warning: JDBC driver threw non-SQLException
    Warning: JDBC driver threw non-SQLException
    Warning: JDBC driver threw non-SQLException
    Warning: JDBC driver threw non-SQLException
    Warning: JDBC driver threw non-SQLException
    Warning: JDBC driver threw non-SQLException

SqlOperatorUnparseTest > testSomeAggFunc() STANDARD_OUT
    Warning: JDBC driver threw non-SQLException

SqlOperatorUnparseTest > testArrayConcat() STANDARD_OUT
    Warning: JDBC driver threw non-SQLException
    Warning: JDBC driver threw non-SQLException

SqlOperatorUnparseTest > testJsonObject() STANDARD_OUT
    Warning: JDBC driver threw non-SQLException
    Warning: JDBC driver threw non-SQLException
    Warning: JDBC driver threw non-SQLException
    Warning: JDBC driver threw non-SQLException
    Warning: JDBC driver threw non-SQLException

SqlOperatorUnparseTest > testFormatDate() STANDARD_OUT
    Warning: JDBC driver threw non-SQLException

CalciteSqlOperatorTest > testToTimestamp() STANDARD_OUT
    Warning: JDBC driver threw non-SQLException
    Warning: JDBC driver threw non-SQLException
    Warning: JDBC driver threw non-SQLException
    Warning: JDBC driver threw non-SQLException
    Warning: JDBC driver threw non-SQLException
    Warning: JDBC driver threw non-SQLException
    Warning: JDBC driver threw non-SQLException
    Warning: JDBC driver threw non-SQLException

SqlOperatorUnparseTest > testFormatTime() STANDARD_OUT
    Warning: JDBC driver threw non-SQLException

SqlOperatorUnparseTest > testMysqlSubstrFunction() STANDARD_OUT
    Warning: JDBC driver threw non-SQLException
    Warning: JDBC driver threw non-SQLException
    Warning: JDBC driver threw non-SQLException
    Warning: JDBC driver threw non-SQLException
    Warning: JDBC driver threw non-SQLException
    Warning: JDBC driver threw non-SQLException
    Warning: JDBC driver threw non-SQLException
    Warning: JDBC driver threw non-SQLException

CalciteSqlOperatorTest > testArrayPrependFunc() STANDARD_OUT
    Warning: JDBC driver threw non-SQLException
    Warning: JDBC driver threw non-SQLException
    Warning: JDBC driver threw non-SQLException
    Warning: JDBC driver threw non-SQLException
    Warning: JDBC driver threw non-SQLException
    Warning: JDBC driver threw non-SQLException
    Warning: JDBC driver threw non-SQLException
    Warning: JDBC driver threw non-SQLException
    Warning: JDBC driver threw non-SQLException
          5.8sec, org.apache.calcite.test.CoreQuidemTest2 > test(String)[34], [34] sql/cast.iq
          5.7sec, org.apache.calcite.test.CoreQuidemTest > test(String)[34], [34] sql/cast.iq
          0.0sec,    3 completed,   0 failed,   0 skipped, org.apache.calcite.test.CalciteSqlOperatorTest > testCastFormatClauseNumericToString(CastType, SqlOperatorFixture)
          1.9sec,    2 completed,   0 failed,   0 skipped, org.apache.calcite.test.SqlOperatorUnparseTest > testTimestampDiff(boolean)
          3.4sec, org.apache.calcite.test.CalciteSqlOperatorTest > testQuantifyCollectionOperators()
          0.7sec,    3 completed,   0 failed,   0 skipped, org.apache.calcite.test.SqlOperatorUnparseTest > testCastToInterval(CastType, SqlOperatorFixture)
          2.2sec, org.apache.calcite.test.CalciteSqlOperatorTest > testRegexpLike3()
          3.6sec,    3 completed,   0 failed,   0 skipped, org.apache.calcite.test.CalciteSqlOperatorTest > testCastIntervalToNumeric(CastType, SqlOperatorFixture)
          0.1sec,    3 completed,   0 failed,   0 skipped, org.apache.calcite.test.CalciteSqlOperatorTest > testCast(CastType, SqlOperatorFixture)
          2.0sec, org.apache.calcite.test.SqlOperatorUnparseTest > testCastExactNumericLimits(CastType, SqlOperatorFixture)[3], [3] TRY_CAST, org.apache.calcite.test.SqlOperatorFixtures$SqlOperatorFixtureInvocationHandler@67f36588
          5.1sec,    3 completed,   0 failed,   0 skipped, org.apache.calcite.test.SqlOperatorUnparseTest > testCastExactNumericLimits(CastType, SqlOperatorFixture)
          0.6sec,    3 completed,   0 failed,   0 skipped, org.apache.calcite.test.SqlOperatorUnparseTest > testCastDateTime(CastType, SqlOperatorFixture)
          0.3sec,    3 completed,   0 failed,   0 skipped, org.apache.calcite.test.SqlOperatorUnparseTest > testCastFormatClauseStringToDateTime(CastType, SqlOperatorFixture)
          3.0sec,    3 completed,   0 failed,   0 skipped, org.apache.calcite.test.CalciteSqlOperatorTest > testCastFormatClauseDateTimeToString(CastType, SqlOperatorFixture)

SqlOperatorUnparseTest > testXmlTransform() STANDARD_ERROR
    [Fatal Error] :1:2: XML document structures must start and end within the same entity.
          0.3sec,    3 completed,   0 failed,   0 skipped, org.apache.calcite.test.SqlOperatorUnparseTest > testCastTruncates(CastType, SqlOperatorFixture)
         21.2sec, org.apache.calcite.test.CoreQuidemTest2 > test(String)[35], [35] sql/sub-query.iq
          2.5sec,    3 completed,   0 failed,   0 skipped, org.apache.calcite.test.CalciteSqlOperatorTest > testCastWithRoundingToScalar(CastType, SqlOperatorFixture)
        144.4sec,   40 completed,   0 failed,   0 skipped, org.apache.calcite.test.CoreQuidemTest2 > test(String)
        144.4sec,   40 completed,   0 failed,   0 skipped, org.apache.calcite.test.CoreQuidemTest2
          0.4sec,    3 completed,   0 failed,   0 skipped, org.apache.calcite.test.SqlOperatorUnparseTest > testCastDecimalToDoubleToInteger(CastType, SqlOperatorFixture)

SqlOperatorUnparseTest > testDateTrunc() STANDARD_OUT
    Warning: JDBC driver threw non-SQLException
         26.9sec, org.apache.calcite.test.CoreQuidemTest > test(String)[35], [35] sql/sub-query.iq
        150.7sec,   40 completed,   0 failed,   0 skipped, org.apache.calcite.test.CoreQuidemTest > test(String)
        150.7sec,   40 completed,   0 failed,   0 skipped, org.apache.calcite.test.CoreQuidemTest
          3.8sec, org.apache.calcite.test.CalciteSqlOperatorTest > testRandomFunc()
          2.2sec, org.apache.calcite.test.SqlOperatorUnparseTest > testCastToString(CastType, SqlOperatorFixture)[2], [2] SAFE_CAST, org.apache.calcite.test.SqlOperatorFixtures$SqlOperatorFixtureInvocationHandler@4a9af025
          2.3sec, org.apache.calcite.test.SqlOperatorUnparseTest > testCastToString(CastType, SqlOperatorFixture)[3], [3] TRY_CAST, org.apache.calcite.test.SqlOperatorFixtures$SqlOperatorFixtureInvocationHandler@3715bb21
          5.9sec,    3 completed,   0 failed,   0 skipped, org.apache.calcite.test.SqlOperatorUnparseTest > testCastToString(CastType, SqlOperatorFixture)
          0.4sec,    3 completed,   0 failed,   0 skipped, org.apache.calcite.test.SqlOperatorUnparseTest > testCastNull(CastType, SqlOperatorFixture)
          0.2sec,    3 completed,   0 failed,   0 skipped, org.apache.calcite.test.SqlOperatorUnparseTest > testCastToApproxNumeric(CastType, SqlOperatorFixture)
          2.9sec,    2 completed,   0 failed,   0 skipped, org.apache.calcite.test.CalciteSqlOperatorTest > testTimestampDiff(boolean)
          0.1sec,    3 completed,   0 failed,   0 skipped, org.apache.calcite.test.SqlOperatorUnparseTest > testCastIntervalToInterval(CastType, SqlOperatorFixture)
          0.3sec,    3 completed,   0 failed,   0 skipped, org.apache.calcite.test.SqlOperatorUnparseTest > testCastToBoolean(CastType, SqlOperatorFixture)
          0.9sec,    3 completed,   0 failed,   0 skipped, org.apache.calcite.test.CalciteSqlOperatorTest > testCastToInterval(CastType, SqlOperatorFixture)
          2.2sec, org.apache.calcite.test.CalciteSqlOperatorTest > testCastExactNumericLimits(CastType, SqlOperatorFixture)[1], [1] CAST, org.apache.calcite.test.SqlOperatorFixtureImpl@5cff68fa
          1.9sec,    3 completed,   0 failed,   0 skipped, org.apache.calcite.test.SqlOperatorUnparseTest > testCastStringToDateTime(CastType, SqlOperatorFixture)
          3.8sec, org.apache.calcite.test.CalciteSqlOperatorTest > testCastExactNumericLimits(CastType, SqlOperatorFixture)[2], [2] SAFE_CAST, org.apache.calcite.test.SqlOperatorFixtures$SqlOperatorFixtureInvocationHandler@50f9c1de

SqlOperatorUnparseTest > testExtractValue() STANDARD_ERROR
    [Fatal Error] :1:14: The markup in the document following the root element must be well-formed.
          3.8sec, org.apache.calcite.test.CalciteSqlOperatorTest > testCastExactNumericLimits(CastType, SqlOperatorFixture)[3], [3] TRY_CAST, org.apache.calcite.test.SqlOperatorFixtures$SqlOperatorFixtureInvocationHandler@4fdaf137
          9.8sec,    3 completed,   0 failed,   0 skipped, org.apache.calcite.test.CalciteSqlOperatorTest > testCastExactNumericLimits(CastType, SqlOperatorFixture)
          1.3sec,    3 completed,   0 failed,   0 skipped, org.apache.calcite.test.CalciteSqlOperatorTest > testCastDateTime(CastType, SqlOperatorFixture)
          0.5sec,    3 completed,   0 failed,   0 skipped, org.apache.calcite.test.CalciteSqlOperatorTest > testCastFormatClauseStringToDateTime(CastType, SqlOperatorFixture)

CalciteSqlOperatorTest > testXmlTransform() STANDARD_ERROR
    [Fatal Error] :1:2: XML document structures must start and end within the same entity.
          0.7sec,    3 completed,   0 failed,   0 skipped, org.apache.calcite.test.CalciteSqlOperatorTest > testCastTruncates(CastType, SqlOperatorFixture)
          2.4sec, org.apache.calcite.test.CalciteSqlOperatorTest > testBitAndOperatorScalarFunc()
          3.7sec, org.apache.calcite.test.SqlOperatorUnparseTest > testRlikeOperator()
          0.0sec,    3 completed,   0 failed,   0 skipped, org.apache.calcite.test.SqlOperatorUnparseTest > testCastFormatClauseByteToString(CastType, SqlOperatorFixture)
WARNING 163.5sec,  580 completed,   0 failed,   1 skipped, org.apache.calcite.test.SqlOperatorUnparseTest
          2.3sec, org.apache.calcite.test.CalciteSqlOperatorTest > testOracleSubstrFunction()
          0.8sec,    3 completed,   0 failed,   0 skipped, org.apache.calcite.test.CalciteSqlOperatorTest > testCastDecimalToDoubleToInteger(CastType, SqlOperatorFixture)
          2.5sec, org.apache.calcite.test.CalciteSqlOperatorTest > testCscFunc()
          4.2sec, org.apache.calcite.test.CalciteSqlOperatorTest > testCastToString(CastType, SqlOperatorFixture)[1], [1] CAST, org.apache.calcite.test.SqlOperatorFixtureImpl@2f2d8ee7
          7.7sec, org.apache.calcite.test.CalciteSqlOperatorTest > testCastToString(CastType, SqlOperatorFixture)[2], [2] SAFE_CAST, org.apache.calcite.test.SqlOperatorFixtures$SqlOperatorFixtureInvocationHandler@376479f6
          7.4sec, org.apache.calcite.test.CalciteSqlOperatorTest > testCastToString(CastType, SqlOperatorFixture)[3], [3] TRY_CAST, org.apache.calcite.test.SqlOperatorFixtures$SqlOperatorFixtureInvocationHandler@74da2002
         19.3sec,    3 completed,   0 failed,   0 skipped, org.apache.calcite.test.CalciteSqlOperatorTest > testCastToString(CastType, SqlOperatorFixture)
          0.9sec,    3 completed,   0 failed,   0 skipped, org.apache.calcite.test.CalciteSqlOperatorTest > testCastNull(CastType, SqlOperatorFixture)
          2.1sec, org.apache.calcite.test.CalciteSqlOperatorTest > testAtanhFunc()
          3.1sec, org.apache.calcite.test.CalciteSqlOperatorTest > testRandFunc()
          0.7sec,    3 completed,   0 failed,   0 skipped, org.apache.calcite.test.CalciteSqlOperatorTest > testCastToApproxNumeric(CastType, SqlOperatorFixture)
          0.4sec,    3 completed,   0 failed,   0 skipped, org.apache.calcite.test.CalciteSqlOperatorTest > testCastIntervalToInterval(CastType, SqlOperatorFixture)
          0.8sec,    3 completed,   0 failed,   0 skipped, org.apache.calcite.test.CalciteSqlOperatorTest > testCastToBoolean(CastType, SqlOperatorFixture)
          3.4sec, org.apache.calcite.test.CalciteSqlOperatorTest > testSimilarToOperator()
          3.0sec, org.apache.calcite.test.CalciteSqlOperatorTest > testJdbcFn()
          2.1sec, org.apache.calcite.test.CalciteSqlOperatorTest > testCastStringToDateTime(CastType, SqlOperatorFixture)[2], [2] SAFE_CAST, org.apache.calcite.test.SqlOperatorFixtures$SqlOperatorFixtureInvocationHandler@13a3af9e
          2.1sec, org.apache.calcite.test.CalciteSqlOperatorTest > testCastStringToDateTime(CastType, SqlOperatorFixture)[3], [3] TRY_CAST, org.apache.calcite.test.SqlOperatorFixtures$SqlOperatorFixtureInvocationHandler@67ffa890
          5.7sec,    3 completed,   0 failed,   0 skipped, org.apache.calcite.test.CalciteSqlOperatorTest > testCastStringToDateTime(CastType, SqlOperatorFixture)
          2.8sec, org.apache.calcite.test.CalciteSqlOperatorTest > testSecFunc()

CalciteSqlOperatorTest > testExtractValue() STANDARD_ERROR
    [Fatal Error] :1:14: The markup in the document following the root element must be well-formed.
          2.3sec, org.apache.calcite.test.CalciteSqlOperatorTest > testHypotFunc()
          3.6sec, org.apache.calcite.test.CalciteSqlOperatorTest > testToChar()
          2.2sec, org.apache.calcite.test.CalciteSqlOperatorTest > testSoundexFunc()
          2.5sec, org.apache.calcite.test.CalciteSqlOperatorTest > testLpadFunction()
          4.0sec, org.apache.calcite.test.CalciteSqlOperatorTest > testBigQuerySubstringFunction()
          4.7sec, org.apache.calcite.test.CalciteSqlOperatorTest > testRlikeOperator()
          0.0sec,    3 completed,   0 failed,   0 skipped, org.apache.calcite.test.CalciteSqlOperatorTest > testCastFormatClauseByteToString(CastType, SqlOperatorFixture)
WARNING 345.9sec,  582 completed,   0 failed,   1 skipped, org.apache.calcite.test.CalciteSqlOperatorTest
WARNING 370.4sec, 15502 completed,   0 failed, 109 skipped, Gradle Test Run :core:test

[Incubating] Problems report is available at: file://<https://ci-builds.apache.org/job/Calcite/job/Calcite-snapshots/ws/build/reports/problems/problems-report.html>

FAILURE: Build failed with an exception.

* What went wrong:
Execution failed for task ':cassandra:test'.
> There were failing tests. See the report at: file://<https://ci-builds.apache.org/job/Calcite/job/Calcite-snapshots/ws/cassandra/build/reports/tests/test/index.html>

Deprecated Gradle features were used in this build, making it incompatible with Gradle 9.0.

You can use '--warning-mode all' to show the individual deprecation warnings and determine if they come from your own scripts or plugins.

For more on this, please refer to https://docs.gradle.org/8.14.4/userguide/command_line_interface.html#sec:command_line_warnings in the Gradle documentation.

BUILD FAILED in 19m 15s
472 actionable tasks: 472 executed

See the profiling report at: file://<https://ci-builds.apache.org/job/Calcite/job/Calcite-snapshots/ws/build/reports/profile/profile-2026-05-14-02-29-31.html>
A fine-grained performance profile is available: use the --scan option.
Build step 'Invoke Gradle script' changed build result to FAILURE
Build step 'Invoke Gradle script' marked build as failure
Recording test results
[Checks API] No suitable checks publisher found.