You are viewing a plain text version of this content. The canonical link for it is here.
Posted to notifications@jclouds.apache.org by je...@cloudbees.com on 2017/03/18 02:19:36 UTC

Build failed in Jenkins: jclouds-cli #1304

https://jclouds.ci.cloudbees.com/job/jclouds-cli/1304/------------------------------------------
[...truncated 172.08 KB...]
Downloading: https://repo.cloudbees.com/content/repositories/central/org/sonatype/sisu/sisu-guice/3.1.0/sisu-guice-3.1.0.pom
Downloaded: https://repo.cloudbees.com/content/repositories/central/org/sonatype/sisu/sisu-guice/3.1.0/sisu-guice-3.1.0.pom (0 B at 0.0 KB/sec)
Downloading: https://repository-jclouds.forge.cloudbees.com/release/org/sonatype/sisu/inject/guice-parent/3.1.0/guice-parent-3.1.0.pom
Downloading: https://repo.cloudbees.com/content/repositories/central/org/sonatype/sisu/inject/guice-parent/3.1.0/guice-parent-3.1.0.pom
Downloaded: https://repo.cloudbees.com/content/repositories/central/org/sonatype/sisu/inject/guice-parent/3.1.0/guice-parent-3.1.0.pom (0 B at 0.0 KB/sec)
Downloading: https://repository-jclouds.forge.cloudbees.com/release/org/sonatype/sisu/sisu-guava/0.9.9/sisu-guava-0.9.9.pom
Downloading: https://repo.cloudbees.com/content/repositories/central/org/sonatype/sisu/sisu-guava/0.9.9/sisu-guava-0.9.9.pom
Downloaded: https://repo.cloudbees.com/content/repositories/central/org/sonatype/sisu/sisu-guava/0.9.9/sisu-guava-0.9.9.pom (0 B at 0.0 KB/sec)
Downloading: https://repository-jclouds.forge.cloudbees.com/release/org/sonatype/sisu/inject/guava-parent/0.9.9/guava-parent-0.9.9.pom
Downloading: https://repo.cloudbees.com/content/repositories/central/org/sonatype/sisu/inject/guava-parent/0.9.9/guava-parent-0.9.9.pom
Downloaded: https://repo.cloudbees.com/content/repositories/central/org/sonatype/sisu/inject/guava-parent/0.9.9/guava-parent-0.9.9.pom (0 B at 0.0 KB/sec)
Downloading: https://repository-jclouds.forge.cloudbees.com/release/org/apache/maven/maven-project/3.0-alpha-2/maven-project-3.0-alpha-2.pom
Downloading: https://repo.cloudbees.com/content/repositories/central/org/apache/maven/maven-project/3.0-alpha-2/maven-project-3.0-alpha-2.pom
Downloaded: https://repo.cloudbees.com/content/repositories/central/org/apache/maven/maven-project/3.0-alpha-2/maven-project-3.0-alpha-2.pom (0 B at 0.0 KB/sec)
Downloading: https://repository-jclouds.forge.cloudbees.com/release/org/apache/maven/maven/3.0-alpha-2/maven-3.0-alpha-2.pom
Downloading: https://repo.cloudbees.com/content/repositories/central/org/apache/maven/maven/3.0-alpha-2/maven-3.0-alpha-2.pom
Downloaded: https://repo.cloudbees.com/content/repositories/central/org/apache/maven/maven/3.0-alpha-2/maven-3.0-alpha-2.pom (0 B at 0.0 KB/sec)
Downloading: https://repository-jclouds.forge.cloudbees.com/release/org/apache/maven/maven-model/3.0-alpha-2/maven-model-3.0-alpha-2.pom
Downloading: https://repo.cloudbees.com/content/repositories/central/org/apache/maven/maven-model/3.0-alpha-2/maven-model-3.0-alpha-2.pom
Downloaded: https://repo.cloudbees.com/content/repositories/central/org/apache/maven/maven-model/3.0-alpha-2/maven-model-3.0-alpha-2.pom (0 B at 0.0 KB/sec)
Downloading: https://repository-jclouds.forge.cloudbees.com/release/org/codehaus/plexus/plexus-interpolation/1.1/plexus-interpolation-1.1.pom
Downloading: https://repo.cloudbees.com/content/repositories/central/org/codehaus/plexus/plexus-interpolation/1.1/plexus-interpolation-1.1.pom
Downloaded: https://repo.cloudbees.com/content/repositories/central/org/codehaus/plexus/plexus-interpolation/1.1/plexus-interpolation-1.1.pom (0 B at 0.0 KB/sec)
Downloading: https://repository-jclouds.forge.cloudbees.com/release/org/apache/maven/maven-compat/3.0-alpha-2/maven-compat-3.0-alpha-2.pom
Downloading: https://repo.cloudbees.com/content/repositories/central/org/apache/maven/maven-compat/3.0-alpha-2/maven-compat-3.0-alpha-2.pom
Downloaded: https://repo.cloudbees.com/content/repositories/central/org/apache/maven/maven-compat/3.0-alpha-2/maven-compat-3.0-alpha-2.pom (0 B at 0.0 KB/sec)
Downloading: https://repository-jclouds.forge.cloudbees.com/release/org/codehaus/plexus/plexus-container-default/1.0-beta-3.0.5/plexus-container-default-1.0-beta-3.0.5.pom
Downloading: https://repo.cloudbees.com/content/repositories/central/org/codehaus/plexus/plexus-container-default/1.0-beta-3.0.5/plexus-container-default-1.0-beta-3.0.5.pom
Downloaded: https://repo.cloudbees.com/content/repositories/central/org/codehaus/plexus/plexus-container-default/1.0-beta-3.0.5/plexus-container-default-1.0-beta-3.0.5.pom (0 B at 0.0 KB/sec)
Downloading: https://repository-jclouds.forge.cloudbees.com/release/org/codehaus/plexus/plexus-containers/1.0-beta-3.0.5/plexus-containers-1.0-beta-3.0.5.pom
Downloading: https://repo.cloudbees.com/content/repositories/central/org/codehaus/plexus/plexus-containers/1.0-beta-3.0.5/plexus-containers-1.0-beta-3.0.5.pom
Downloaded: https://repo.cloudbees.com/content/repositories/central/org/codehaus/plexus/plexus-containers/1.0-beta-3.0.5/plexus-containers-1.0-beta-3.0.5.pom (0 B at 0.0 KB/sec)
Downloading: https://repository-jclouds.forge.cloudbees.com/release/org/codehaus/plexus/plexus-classworlds/1.4/plexus-classworlds-1.4.pom
Downloading: https://repo.cloudbees.com/content/repositories/central/org/codehaus/plexus/plexus-classworlds/1.4/plexus-classworlds-1.4.pom
Downloaded: https://repo.cloudbees.com/content/repositories/central/org/codehaus/plexus/plexus-classworlds/1.4/plexus-classworlds-1.4.pom (0 B at 0.0 KB/sec)
Downloading: https://repository-jclouds.forge.cloudbees.com/release/org/codehaus/plexus/plexus/2.0.0/plexus-2.0.0.pom
Downloading: https://repo.cloudbees.com/content/repositories/central/org/codehaus/plexus/plexus/2.0.0/plexus-2.0.0.pom
Downloaded: https://repo.cloudbees.com/content/repositories/central/org/codehaus/plexus/plexus/2.0.0/plexus-2.0.0.pom (0 B at 0.0 KB/sec)
Downloading: https://repository-jclouds.forge.cloudbees.com/release/com/google/code/google-collections/google-collect/snapshot-20080530/google-collect-snapshot-20080530.pom
Downloading: https://repo.cloudbees.com/content/repositories/central/com/google/code/google-collections/google-collect/snapshot-20080530/google-collect-snapshot-20080530.pom
Downloaded: https://repo.cloudbees.com/content/repositories/central/com/google/code/google-collections/google-collect/snapshot-20080530/google-collect-snapshot-20080530.pom (0 B at 0.0 KB/sec)
Downloading: https://repository-jclouds.forge.cloudbees.com/release/org/codehaus/plexus/plexus-component-annotations/1.0-beta-3.0.5/plexus-component-annotations-1.0-beta-3.0.5.pom
Downloading: https://repo.cloudbees.com/content/repositories/central/org/codehaus/plexus/plexus-component-annotations/1.0-beta-3.0.5/plexus-component-annotations-1.0-beta-3.0.5.pom
Downloaded: https://repo.cloudbees.com/content/repositories/central/org/codehaus/plexus/plexus-component-annotations/1.0-beta-3.0.5/plexus-component-annotations-1.0-beta-3.0.5.pom (0 B at 0.0 KB/sec)
Downloading: https://repository-jclouds.forge.cloudbees.com/release/org/apache/maven/wagon/wagon-provider-api/1.0-beta-4/wagon-provider-api-1.0-beta-4.pom
Downloading: https://repo.cloudbees.com/content/repositories/central/org/apache/maven/wagon/wagon-provider-api/1.0-beta-4/wagon-provider-api-1.0-beta-4.pom
Downloaded: https://repo.cloudbees.com/content/repositories/central/org/apache/maven/wagon/wagon-provider-api/1.0-beta-4/wagon-provider-api-1.0-beta-4.pom (0 B at 0.0 KB/sec)
Downloading: https://repository-jclouds.forge.cloudbees.com/release/org/apache/maven/wagon/wagon/1.0-beta-4/wagon-1.0-beta-4.pom
Downloading: https://repo.cloudbees.com/content/repositories/central/org/apache/maven/wagon/wagon/1.0-beta-4/wagon-1.0-beta-4.pom
Downloaded: https://repo.cloudbees.com/content/repositories/central/org/apache/maven/wagon/wagon/1.0-beta-4/wagon-1.0-beta-4.pom (0 B at 0.0 KB/sec)
Downloading: https://repository-jclouds.forge.cloudbees.com/release/org/codehaus/woodstox/wstx-asl/3.2.6/wstx-asl-3.2.6.pom
Downloading: https://repo.cloudbees.com/content/repositories/central/org/codehaus/woodstox/wstx-asl/3.2.6/wstx-asl-3.2.6.pom
Downloaded: https://repo.cloudbees.com/content/repositories/central/org/codehaus/woodstox/wstx-asl/3.2.6/wstx-asl-3.2.6.pom (0 B at 0.0 KB/sec)
Downloading: https://repository-jclouds.forge.cloudbees.com/release/stax/stax-api/1.0.1/stax-api-1.0.1.pom
Downloading: https://repo.cloudbees.com/content/repositories/central/stax/stax-api/1.0.1/stax-api-1.0.1.pom
Downloaded: https://repo.cloudbees.com/content/repositories/central/stax/stax-api/1.0.1/stax-api-1.0.1.pom (0 B at 0.0 KB/sec)
Downloading: https://repository-jclouds.forge.cloudbees.com/release/org/sonatype/spice/model-builder/1.3/model-builder-1.3.pom
Downloading: https://repo.cloudbees.com/content/repositories/central/org/sonatype/spice/model-builder/1.3/model-builder-1.3.pom
Downloaded: https://repo.cloudbees.com/content/repositories/central/org/sonatype/spice/model-builder/1.3/model-builder-1.3.pom (0 B at 0.0 KB/sec)
Downloading: https://repository-jclouds.forge.cloudbees.com/release/org/apache/maven/maven-project-builder/3.0-alpha-2/maven-project-builder-3.0-alpha-2.pom
Downloading: https://repo.cloudbees.com/content/repositories/central/org/apache/maven/maven-project-builder/3.0-alpha-2/maven-project-builder-3.0-alpha-2.pom
Downloaded: https://repo.cloudbees.com/content/repositories/central/org/apache/maven/maven-project-builder/3.0-alpha-2/maven-project-builder-3.0-alpha-2.pom (0 B at 0.0 KB/sec)
Downloading: https://repository-jclouds.forge.cloudbees.com/release/org/apache/felix/maven-bundle-plugin/2.4.0/maven-bundle-plugin-2.4.0.pom
Downloading: https://repo.cloudbees.com/content/repositories/central/org/apache/felix/maven-bundle-plugin/2.4.0/maven-bundle-plugin-2.4.0.pom
Downloaded: https://repo.cloudbees.com/content/repositories/central/org/apache/felix/maven-bundle-plugin/2.4.0/maven-bundle-plugin-2.4.0.pom (0 B at 0.0 KB/sec)
Downloading: https://repository-jclouds.forge.cloudbees.com/release/biz/aQute/bnd/bndlib/2.3.0/bndlib-2.3.0.pom
Downloading: https://repo.cloudbees.com/content/repositories/central/biz/aQute/bnd/bndlib/2.3.0/bndlib-2.3.0.pom
Downloaded: https://repo.cloudbees.com/content/repositories/central/biz/aQute/bnd/bndlib/2.3.0/bndlib-2.3.0.pom (0 B at 0.0 KB/sec)
Downloading: https://repository-jclouds.forge.cloudbees.com/release/biz/aQute/bnd/parent/2.3.0/parent-2.3.0.pom
Downloading: https://repo.cloudbees.com/content/repositories/central/biz/aQute/bnd/parent/2.3.0/parent-2.3.0.pom
Downloaded: https://repo.cloudbees.com/content/repositories/central/biz/aQute/bnd/parent/2.3.0/parent-2.3.0.pom (0 B at 0.0 KB/sec)
Downloading: https://repository-jclouds.forge.cloudbees.com/release/org/osgi/org.osgi.core/4.3.1/org.osgi.core-4.3.1.pom
Downloading: https://repo.cloudbees.com/content/repositories/central/org/osgi/org.osgi.core/4.3.1/org.osgi.core-4.3.1.pom
Downloaded: https://repo.cloudbees.com/content/repositories/central/org/osgi/org.osgi.core/4.3.1/org.osgi.core-4.3.1.pom (0 B at 0.0 KB/sec)
Downloading: https://repository-jclouds.forge.cloudbees.com/release/org/easymock/easymock/3.2/easymock-3.2.pom
Downloading: https://repo.cloudbees.com/content/repositories/central/org/easymock/easymock/3.2/easymock-3.2.pom
Downloaded: https://repo.cloudbees.com/content/repositories/central/org/easymock/easymock/3.2/easymock-3.2.pom (0 B at 0.0 KB/sec)
Downloading: https://repository-jclouds.forge.cloudbees.com/release/org/easymock/easymock-parent/3.2/easymock-parent-3.2.pom
Downloading: https://repo.cloudbees.com/content/repositories/central/org/easymock/easymock-parent/3.2/easymock-parent-3.2.pom
Downloaded: https://repo.cloudbees.com/content/repositories/central/org/easymock/easymock-parent/3.2/easymock-parent-3.2.pom (0 B at 0.0 KB/sec)
Downloading: https://repository-jclouds.forge.cloudbees.com/release/org/objenesis/objenesis/1.3/objenesis-1.3.pom
Downloading: https://repo.cloudbees.com/content/repositories/central/org/objenesis/objenesis/1.3/objenesis-1.3.pom
Downloaded: https://repo.cloudbees.com/content/repositories/central/org/objenesis/objenesis/1.3/objenesis-1.3.pom (0 B at 0.0 KB/sec)
Downloading: https://repository-jclouds.forge.cloudbees.com/release/org/objenesis/objenesis-parent/1.3/objenesis-parent-1.3.pom
Downloading: https://repo.cloudbees.com/content/repositories/central/org/objenesis/objenesis-parent/1.3/objenesis-parent-1.3.pom
Downloaded: https://repo.cloudbees.com/content/repositories/central/org/objenesis/objenesis-parent/1.3/objenesis-parent-1.3.pom (0 B at 0.0 KB/sec)
Downloading: https://repository-jclouds.forge.cloudbees.com/release/org/apache/maven/maven-plugin-api/3.0-alpha-2/maven-plugin-api-3.0-alpha-2.pom
Downloading: https://repo.cloudbees.com/content/repositories/central/org/apache/maven/maven-plugin-api/3.0-alpha-2/maven-plugin-api-3.0-alpha-2.pom
Downloaded: https://repo.cloudbees.com/content/repositories/central/org/apache/maven/maven-plugin-api/3.0-alpha-2/maven-plugin-api-3.0-alpha-2.pom (0 B at 0.0 KB/sec)
Downloading: https://repository-jclouds.forge.cloudbees.com/release/org/osgi/org.osgi.compendium/4.3.1/org.osgi.compendium-4.3.1.pom
Downloading: https://repo.cloudbees.com/content/repositories/central/org/osgi/org.osgi.compendium/4.3.1/org.osgi.compendium-4.3.1.pom
Downloaded: https://repo.cloudbees.com/content/repositories/central/org/osgi/org.osgi.compendium/4.3.1/org.osgi.compendium-4.3.1.pom (0 B at 0.0 KB/sec)
Downloading: https://repository-jclouds.forge.cloudbees.com/release/org/apache/servicemix/bundles/org.apache.servicemix.bundles.ant/1.8.4_1/org.apache.servicemix.bundles.ant-1.8.4_1.pom
Downloading: https://repo.cloudbees.com/content/repositories/central/org/apache/servicemix/bundles/org.apache.servicemix.bundles.ant/1.8.4_1/org.apache.servicemix.bundles.ant-1.8.4_1.pom
Downloaded: https://repo.cloudbees.com/content/repositories/central/org/apache/servicemix/bundles/org.apache.servicemix.bundles.ant/1.8.4_1/org.apache.servicemix.bundles.ant-1.8.4_1.pom (0 B at 0.0 KB/sec)
Downloading: https://repository-jclouds.forge.cloudbees.com/release/org/apache/servicemix/bundles/bundles-pom/10/bundles-pom-10.pom
Downloading: https://repo.cloudbees.com/content/repositories/central/org/apache/servicemix/bundles/bundles-pom/10/bundles-pom-10.pom
Downloaded: https://repo.cloudbees.com/content/repositories/central/org/apache/servicemix/bundles/bundles-pom/10/bundles-pom-10.pom (0 B at 0.0 KB/sec)
Downloading: https://repository-jclouds.forge.cloudbees.com/release/org/slf4j/slf4j-jdk14/1.7.7/slf4j-jdk14-1.7.7.jar
Downloading: https://repository-jclouds.forge.cloudbees.com/release/org/sonatype/sisu/sisu-inject-bean/2.3.0/sisu-inject-bean-2.3.0.jar
Downloading: https://repository-jclouds.forge.cloudbees.com/release/org/sonatype/sisu/sisu-guice/3.1.0/sisu-guice-3.1.0-no_aop.jar
Downloading: https://repository-jclouds.forge.cloudbees.com/release/org/sonatype/sisu/sisu-guava/0.9.9/sisu-guava-0.9.9.jar
Downloading: https://repository-jclouds.forge.cloudbees.com/release/org/codehaus/plexus/plexus-interpolation/1.1/plexus-interpolation-1.1.jar
Downloading: https://repository-jclouds.forge.cloudbees.com/release/com/google/code/google-collections/google-collect/snapshot-20080530/google-collect-snapshot-20080530.jar
Downloading: https://repository-jclouds.forge.cloudbees.com/release/org/codehaus/woodstox/wstx-asl/3.2.6/wstx-asl-3.2.6.jar
Downloading: https://repository-jclouds.forge.cloudbees.com/release/stax/stax-api/1.0.1/stax-api-1.0.1.jar
Downloading: https://repository-jclouds.forge.cloudbees.com/release/org/sonatype/spice/model-builder/1.3/model-builder-1.3.jar
Downloading: https://repository-jclouds.forge.cloudbees.com/release/org/apache/maven/maven-project-builder/3.0-alpha-2/maven-project-builder-3.0-alpha-2.jar
Downloading: https://repository-jclouds.forge.cloudbees.com/release/org/apache/felix/maven-bundle-plugin/2.4.0/maven-bundle-plugin-2.4.0.jar
Downloading: https://repository-jclouds.forge.cloudbees.com/release/biz/aQute/bnd/bndlib/2.3.0/bndlib-2.3.0.jar
Downloading: https://repository-jclouds.forge.cloudbees.com/release/org/osgi/org.osgi.core/4.3.1/org.osgi.core-4.3.1.jar
Downloading: https://repository-jclouds.forge.cloudbees.com/release/org/easymock/easymock/3.2/easymock-3.2.jar
Downloading: https://repository-jclouds.forge.cloudbees.com/release/org/objenesis/objenesis/1.3/objenesis-1.3.jar
Downloading: https://repository-jclouds.forge.cloudbees.com/release/org/osgi/org.osgi.compendium/4.3.1/org.osgi.compendium-4.3.1.jar
Downloading: https://repository-jclouds.forge.cloudbees.com/release/org/apache/servicemix/bundles/org.apache.servicemix.bundles.ant/1.8.4_1/org.apache.servicemix.bundles.ant-1.8.4_1.jar
Downloading: https://repo.cloudbees.com/content/repositories/central/org/slf4j/slf4j-jdk14/1.7.7/slf4j-jdk14-1.7.7.jar
Downloading: https://repo.cloudbees.com/content/repositories/central/org/sonatype/sisu/sisu-inject-bean/2.3.0/sisu-inject-bean-2.3.0.jar
Downloading: https://repo.cloudbees.com/content/repositories/central/org/sonatype/sisu/sisu-guice/3.1.0/sisu-guice-3.1.0-no_aop.jar
Downloading: https://repo.cloudbees.com/content/repositories/central/org/sonatype/sisu/sisu-guava/0.9.9/sisu-guava-0.9.9.jar
Downloading: https://repo.cloudbees.com/content/repositories/central/org/codehaus/plexus/plexus-interpolation/1.1/plexus-interpolation-1.1.jar
Downloaded: https://repo.cloudbees.com/content/repositories/central/org/codehaus/plexus/plexus-interpolation/1.1/plexus-interpolation-1.1.jar (0 B at 0.0 KB/sec)
Downloading: https://repo.cloudbees.com/content/repositories/central/com/google/code/google-collections/google-collect/snapshot-20080530/google-collect-snapshot-20080530.jar
Downloaded: https://repo.cloudbees.com/content/repositories/central/org/slf4j/slf4j-jdk14/1.7.7/slf4j-jdk14-1.7.7.jar (0 B at 0.0 KB/sec)
Downloading: https://repo.cloudbees.com/content/repositories/central/org/codehaus/woodstox/wstx-asl/3.2.6/wstx-asl-3.2.6.jar
Downloaded: https://repo.cloudbees.com/content/repositories/central/org/sonatype/sisu/sisu-guava/0.9.9/sisu-guava-0.9.9.jar (0 B at 0.0 KB/sec)
Downloading: https://repo.cloudbees.com/content/repositories/central/stax/stax-api/1.0.1/stax-api-1.0.1.jar
Downloaded: https://repo.cloudbees.com/content/repositories/central/org/sonatype/sisu/sisu-inject-bean/2.3.0/sisu-inject-bean-2.3.0.jar (0 B at 0.0 KB/sec)
Downloading: https://repo.cloudbees.com/content/repositories/central/org/sonatype/spice/model-builder/1.3/model-builder-1.3.jar
Downloaded: https://repo.cloudbees.com/content/repositories/central/org/sonatype/sisu/sisu-guice/3.1.0/sisu-guice-3.1.0-no_aop.jar (0 B at 0.0 KB/sec)
Downloading: https://repo.cloudbees.com/content/repositories/central/org/apache/maven/maven-project-builder/3.0-alpha-2/maven-project-builder-3.0-alpha-2.jar
Downloaded: https://repo.cloudbees.com/content/repositories/central/com/google/code/google-collections/google-collect/snapshot-20080530/google-collect-snapshot-20080530.jar (0 B at 0.0 KB/sec)
Downloading: https://repo.cloudbees.com/content/repositories/central/org/apache/felix/maven-bundle-plugin/2.4.0/maven-bundle-plugin-2.4.0.jar
Downloaded: https://repo.cloudbees.com/content/repositories/central/org/codehaus/woodstox/wstx-asl/3.2.6/wstx-asl-3.2.6.jar (0 B at 0.0 KB/sec)
Downloading: https://repo.cloudbees.com/content/repositories/central/biz/aQute/bnd/bndlib/2.3.0/bndlib-2.3.0.jar
Downloaded: https://repo.cloudbees.com/content/repositories/central/stax/stax-api/1.0.1/stax-api-1.0.1.jar (0 B at 0.0 KB/sec)
Downloading: https://repo.cloudbees.com/content/repositories/central/org/osgi/org.osgi.core/4.3.1/org.osgi.core-4.3.1.jar
Downloaded: https://repo.cloudbees.com/content/repositories/central/org/sonatype/spice/model-builder/1.3/model-builder-1.3.jar (0 B at 0.0 KB/sec)
Downloading: https://repo.cloudbees.com/content/repositories/central/org/easymock/easymock/3.2/easymock-3.2.jar
Downloaded: https://repo.cloudbees.com/content/repositories/central/org/apache/felix/maven-bundle-plugin/2.4.0/maven-bundle-plugin-2.4.0.jar (0 B at 0.0 KB/sec)
Downloaded: https://repo.cloudbees.com/content/repositories/central/org/apache/maven/maven-project-builder/3.0-alpha-2/maven-project-builder-3.0-alpha-2.jar (0 B at 0.0 KB/sec)
Downloading: https://repo.cloudbees.com/content/repositories/central/org/objenesis/objenesis/1.3/objenesis-1.3.jar
Downloading: https://repo.cloudbees.com/content/repositories/central/org/osgi/org.osgi.compendium/4.3.1/org.osgi.compendium-4.3.1.jar
Downloaded: https://repo.cloudbees.com/content/repositories/central/biz/aQute/bnd/bndlib/2.3.0/bndlib-2.3.0.jar (0 B at 0.0 KB/sec)
Downloading: https://repo.cloudbees.com/content/repositories/central/org/apache/servicemix/bundles/org.apache.servicemix.bundles.ant/1.8.4_1/org.apache.servicemix.bundles.ant-1.8.4_1.jar
Downloaded: https://repo.cloudbees.com/content/repositories/central/org/osgi/org.osgi.core/4.3.1/org.osgi.core-4.3.1.jar (0 B at 0.0 KB/sec)
Downloaded: https://repo.cloudbees.com/content/repositories/central/org/easymock/easymock/3.2/easymock-3.2.jar (0 B at 0.0 KB/sec)
Downloaded: https://repo.cloudbees.com/content/repositories/central/org/objenesis/objenesis/1.3/objenesis-1.3.jar (0 B at 0.0 KB/sec)
Downloaded: https://repo.cloudbees.com/content/repositories/central/org/apache/servicemix/bundles/org.apache.servicemix.bundles.ant/1.8.4_1/org.apache.servicemix.bundles.ant-1.8.4_1.jar (0 B at 0.0 KB/sec)
Downloaded: https://repo.cloudbees.com/content/repositories/central/org/osgi/org.osgi.compendium/4.3.1/org.osgi.compendium-4.3.1.jar (0 B at 0.0 KB/sec)
[INFO] Copying bundle: org.apache.karaf.assemblies.features:standard:xml:features:2.3.11
[INFO] Copying bundle: org.apache.karaf.assemblies.features:enterprise:xml:features:2.3.11
[INFO] Copying bundle: org.apache.karaf.assemblies.features:enterprise:xml:features:2.3.11
[INFO] Copying bundle: org.ops4j.pax.cdi:pax-cdi-features:xml:features:0.8.0
[INFO] Copying bundle: org.apache.karaf.assemblies.features:standard:xml:features:2.3.11
[INFO] Copying bundle: org.apache.karaf.assemblies.features:standard:xml:features:2.3.11
[INFO] Copying bundle: org.apache.jclouds.karaf:jclouds-karaf:xml:features:2.1.0-SNAPSHOT
Downloading: https://repository.apache.org/content/repositories/snapshots/org/apache/jclouds/karaf/jclouds-karaf/2.1.0-SNAPSHOT/maven-metadata.xml
Downloading: http://repository.apache.org/snapshots/org/apache/jclouds/karaf/jclouds-karaf/2.1.0-SNAPSHOT/maven-metadata.xml
Downloading: https://repository-jclouds.forge.cloudbees.com/snapshot/org/apache/jclouds/karaf/jclouds-karaf/2.1.0-SNAPSHOT/maven-metadata.xml
Downloaded: http://repository.apache.org/snapshots/org/apache/jclouds/karaf/jclouds-karaf/2.1.0-SNAPSHOT/maven-metadata.xml (2 KB at 31.7 KB/sec)
Downloaded: https://repository.apache.org/content/repositories/snapshots/org/apache/jclouds/karaf/jclouds-karaf/2.1.0-SNAPSHOT/maven-metadata.xml (2 KB at 28.7 KB/sec)
Started calculate disk usage of build
Finished Calculation of disk usage of build in 0 seconds
Started calculate disk usage of workspace
Finished Calculation of disk usage of workspace in 0 seconds
[INFO] ------------------------------------------------------------------------
[INFO] Reactor Summary:
[INFO] 
[INFO] Apache jclouds :: cli ............................. SUCCESS [10.534s]
[INFO] jclouds :: cli :: branding ........................ SUCCESS [4.028s]
[INFO] jclouds :: cli :: runner .......................... SUCCESS [22.887s]
[INFO] jclouds :: cli :: assembly ........................ FAILURE [7.267s]
[INFO] Apache jclouds :: cli ............................. SKIPPED
[INFO] ------------------------------------------------------------------------
[INFO] BUILD FAILURE
[INFO] ------------------------------------------------------------------------
[INFO] Total time: 48.339s
[INFO] Finished at: Fri Mar 17 22:19:33 EDT 2017
[INFO] Final Memory: 51M/268M
[INFO] ------------------------------------------------------------------------
Waiting for Jenkins to finish collecting data
[ERROR] Failed to execute goal org.apache.karaf.tooling:features-maven-plugin:2.3.11:add-features-to-repo (add-features-to-repo) on project jclouds-cli-assembly: Error populating repository: Unable to find the feature 'jclouds-api-cloudsigma2' -> [Help 1]
org.apache.maven.lifecycle.LifecycleExecutionException: Failed to execute goal org.apache.karaf.tooling:features-maven-plugin:2.3.11:add-features-to-repo (add-features-to-repo) on project jclouds-cli-assembly: Error populating repository
	at org.apache.maven.lifecycle.internal.MojoExecutor.execute(MojoExecutor.java:217)
	at org.apache.maven.lifecycle.internal.MojoExecutor.execute(MojoExecutor.java:153)
	at org.apache.maven.lifecycle.internal.MojoExecutor.execute(MojoExecutor.java:145)
	at org.apache.maven.lifecycle.internal.LifecycleModuleBuilder.buildProject(LifecycleModuleBuilder.java:84)
	at org.apache.maven.lifecycle.internal.LifecycleModuleBuilder.buildProject(LifecycleModuleBuilder.java:59)
	at org.apache.maven.lifecycle.internal.LifecycleStarter.singleThreadedBuild(LifecycleStarter.java:183)
	at org.apache.maven.lifecycle.internal.LifecycleStarter.execute(LifecycleStarter.java:161)
	at org.apache.maven.DefaultMaven.doExecute(DefaultMaven.java:320)
	at org.apache.maven.DefaultMaven.execute(DefaultMaven.java:156)
	at org.jvnet.hudson.maven3.launcher.Maven3Launcher.main(Maven3Launcher.java:117)
	at sun.reflect.NativeMethodAccessorImpl.invoke0(Native Method)
	at sun.reflect.NativeMethodAccessorImpl.invoke(NativeMethodAccessorImpl.java:57)
	at sun.reflect.DelegatingMethodAccessorImpl.invoke(DelegatingMethodAccessorImpl.java:43)
	at java.lang.reflect.Method.invoke(Method.java:606)
	at org.codehaus.plexus.classworlds.launcher.Launcher.launchStandard(Launcher.java:329)
	at org.codehaus.plexus.classworlds.launcher.Launcher.launch(Launcher.java:239)
	at org.jvnet.hudson.maven3.agent.Maven3Main.launch(Maven3Main.java:181)
	at sun.reflect.NativeMethodAccessorImpl.invoke0(Native Method)
	at sun.reflect.NativeMethodAccessorImpl.invoke(NativeMethodAccessorImpl.java:57)
	at sun.reflect.DelegatingMethodAccessorImpl.invoke(DelegatingMethodAccessorImpl.java:43)
	at java.lang.reflect.Method.invoke(Method.java:606)
	at hudson.maven.Maven3Builder.call(Maven3Builder.java:139)
	at hudson.maven.Maven3Builder.call(Maven3Builder.java:70)
	at hudson.remoting.UserRequest.perform(UserRequest.java:153)
	at hudson.remoting.UserRequest.perform(UserRequest.java:50)
	at hudson.remoting.Request$2.run(Request.java:336)
	at hudson.remoting.InterceptingExecutorService$1.call(InterceptingExecutorService.java:68)
	at java.util.concurrent.FutureTask.run(FutureTask.java:262)
	at java.util.concurrent.ThreadPoolExecutor.runWorker(ThreadPoolExecutor.java:1145)
	at java.util.concurrent.ThreadPoolExecutor$Worker.run(ThreadPoolExecutor.java:615)
	at java.lang.Thread.run(Thread.java:745)
Caused by: org.apache.maven.plugin.MojoExecutionException: Error populating repository
	at org.apache.karaf.tooling.features.AddFeaturesToRepoMojo.execute(AddFeaturesToRepoMojo.java:226)
	at org.apache.maven.plugin.DefaultBuildPluginManager.executeMojo(DefaultBuildPluginManager.java:101)
	at org.apache.maven.lifecycle.internal.MojoExecutor.execute(MojoExecutor.java:209)
	... 30 more
Caused by: java.lang.IllegalArgumentException: Unable to find the feature 'jclouds-api-cloudsigma2'
	at org.apache.karaf.tooling.features.AddFeaturesToRepoMojo.addFeatures(AddFeaturesToRepoMojo.java:328)
	at org.apache.karaf.tooling.features.AddFeaturesToRepoMojo.execute(AddFeaturesToRepoMojo.java:165)
	... 32 more
[ERROR] 
[ERROR] Re-run Maven using the -X switch to enable full debug logging.
[ERROR] 
[ERROR] For more information about the errors and possible solutions, please read the following articles:
[ERROR] [Help 1] http://cwiki.apache.org/confluence/display/MAVEN/MojoExecutionException
[ERROR] 
[ERROR] After correcting the problems, you can resume the build with the command
[ERROR]   mvn <goals> -rf :jclouds-cli-assembly
[JENKINS] Archiving <https://jclouds.ci.cloudbees.com/job/jclouds-cli/ws/branding/pom.xml> to org.apache.jclouds.cli/jclouds-cli-branding/2.1.0-SNAPSHOT/jclouds-cli-branding-2.1.0-SNAPSHOT.pom
[JENKINS] Archiving <https://jclouds.ci.cloudbees.com/job/jclouds-cli/ws/branding/target/jclouds-cli-branding-2.1.0-SNAPSHOT.jar> to org.apache.jclouds.cli/jclouds-cli-branding/2.1.0-20170318.021901-60/jclouds-cli-branding-2.1.0-20170318.021901-60.jar
[JENKINS] Archiving <https://jclouds.ci.cloudbees.com/job/jclouds-cli/ws/branding/target/jclouds-cli-branding-2.1.0-SNAPSHOT-tests.jar> to org.apache.jclouds.cli/jclouds-cli-branding/2.1.0-20170318.021901-60/jclouds-cli-branding-2.1.0-20170318.021901-60-tests.jar
[JENKINS] Archiving <https://jclouds.ci.cloudbees.com/job/jclouds-cli/ws/branding/target/jclouds-cli-branding-2.1.0-SNAPSHOT-sources.jar> to org.apache.jclouds.cli/jclouds-cli-branding/2.1.0-20170318.021901-60/jclouds-cli-branding-2.1.0-20170318.021901-60-sources.jar
[JENKINS] Archiving <https://jclouds.ci.cloudbees.com/job/jclouds-cli/ws/assembly/pom.xml> to org.apache.jclouds.cli/jclouds-cli-assembly/2.1.0-SNAPSHOT/jclouds-cli-assembly-2.1.0-SNAPSHOT.pom
[JENKINS] Archiving <https://jclouds.ci.cloudbees.com/job/jclouds-cli/ws/pom.xml> to org.apache.jclouds.cli/jclouds-cli/2.1.0-SNAPSHOT/jclouds-cli-2.1.0-SNAPSHOT.pom
[JENKINS] Archiving <https://jclouds.ci.cloudbees.com/job/jclouds-cli/ws/runner/pom.xml> to org.apache.jclouds.cli/jclouds-cli-runner/2.1.0-SNAPSHOT/jclouds-cli-runner-2.1.0-SNAPSHOT.pom
[JENKINS] Archiving <https://jclouds.ci.cloudbees.com/job/jclouds-cli/ws/runner/target/jclouds-cli-runner-2.1.0-SNAPSHOT.jar> to org.apache.jclouds.cli/jclouds-cli-runner/2.1.0-20170318.021924-59/jclouds-cli-runner-2.1.0-20170318.021924-59.jar
[JENKINS] Archiving <https://jclouds.ci.cloudbees.com/job/jclouds-cli/ws/runner/target/jclouds-cli-runner-2.1.0-SNAPSHOT-tests.jar> to org.apache.jclouds.cli/jclouds-cli-runner/2.1.0-20170318.021924-59/jclouds-cli-runner-2.1.0-20170318.021924-59-tests.jar
[JENKINS] Archiving <https://jclouds.ci.cloudbees.com/job/jclouds-cli/ws/runner/target/jclouds-cli-runner-2.1.0-SNAPSHOT-javadoc.jar> to org.apache.jclouds.cli/jclouds-cli-runner/2.1.0-20170318.021924-59/jclouds-cli-runner-2.1.0-20170318.021924-59-javadoc.jar
[JENKINS] Archiving <https://jclouds.ci.cloudbees.com/job/jclouds-cli/ws/runner/target/jclouds-cli-runner-2.1.0-SNAPSHOT-sources.jar> to org.apache.jclouds.cli/jclouds-cli-runner/2.1.0-20170318.021924-59/jclouds-cli-runner-2.1.0-20170318.021924-59-sources.jar
[JENKINS] Archiving <https://jclouds.ci.cloudbees.com/job/jclouds-cli/ws/project/pom.xml> to org.apache.jclouds.cli/jclouds-cli-project/2.1.0-SNAPSHOT/jclouds-cli-project-2.1.0-SNAPSHOT.pom
[JENKINS] Archiving <https://jclouds.ci.cloudbees.com/job/jclouds-cli/ws/project/target/jclouds-cli-project-2.1.0-SNAPSHOT-tests.jar> to org.apache.jclouds.cli/jclouds-cli-project/2.1.0-20170318.021857-60/jclouds-cli-project-2.1.0-20170318.021857-60-tests.jar
channel stopped
Started calculate disk usage of build
Finished Calculation of disk usage of build in 0 seconds
Started calculate disk usage of workspace
Finished Calculation of disk usage of workspace in 0 seconds

Build failed in Jenkins: jclouds-cli #1307

Posted by je...@cloudbees.com.
See <https://jclouds.ci.cloudbees.com/job/jclouds-cli/1307/display/redirect>

------------------------------------------
[...truncated 574.76 KB...]
Downloading: https://repository-jclouds.forge.cloudbees.com/release/org/sonatype/sisu/inject/guava-parent/0.9.9/guava-parent-0.9.9.pom
Downloading: https://repo.cloudbees.com/content/repositories/central/org/sonatype/sisu/inject/guava-parent/0.9.9/guava-parent-0.9.9.pom
Downloaded: https://repo.cloudbees.com/content/repositories/central/org/sonatype/sisu/inject/guava-parent/0.9.9/guava-parent-0.9.9.pom (11 KB at 565.7 KB/sec)
Downloading: https://repository-jclouds.forge.cloudbees.com/release/org/apache/maven/maven-project/3.0-alpha-2/maven-project-3.0-alpha-2.pom
Downloading: https://repo.cloudbees.com/content/repositories/central/org/apache/maven/maven-project/3.0-alpha-2/maven-project-3.0-alpha-2.pom
Downloaded: https://repo.cloudbees.com/content/repositories/central/org/apache/maven/maven-project/3.0-alpha-2/maven-project-3.0-alpha-2.pom (4 KB at 189.5 KB/sec)
Downloading: https://repository-jclouds.forge.cloudbees.com/release/org/apache/maven/maven/3.0-alpha-2/maven-3.0-alpha-2.pom
Downloading: https://repo.cloudbees.com/content/repositories/central/org/apache/maven/maven/3.0-alpha-2/maven-3.0-alpha-2.pom
Downloaded: https://repo.cloudbees.com/content/repositories/central/org/apache/maven/maven/3.0-alpha-2/maven-3.0-alpha-2.pom (21 KB at 994.0 KB/sec)
Downloading: https://repository-jclouds.forge.cloudbees.com/release/org/apache/maven/maven-model/3.0-alpha-2/maven-model-3.0-alpha-2.pom
Downloading: https://repo.cloudbees.com/content/repositories/central/org/apache/maven/maven-model/3.0-alpha-2/maven-model-3.0-alpha-2.pom
Downloaded: https://repo.cloudbees.com/content/repositories/central/org/apache/maven/maven-model/3.0-alpha-2/maven-model-3.0-alpha-2.pom (4 KB at 244.9 KB/sec)
Downloading: https://repository-jclouds.forge.cloudbees.com/release/org/codehaus/plexus/plexus-interpolation/1.1/plexus-interpolation-1.1.pom
Downloading: https://repo.cloudbees.com/content/repositories/central/org/codehaus/plexus/plexus-interpolation/1.1/plexus-interpolation-1.1.pom
Downloaded: https://repo.cloudbees.com/content/repositories/central/org/codehaus/plexus/plexus-interpolation/1.1/plexus-interpolation-1.1.pom (2 KB at 78.0 KB/sec)
Downloading: https://repository-jclouds.forge.cloudbees.com/release/org/apache/maven/maven-compat/3.0-alpha-2/maven-compat-3.0-alpha-2.pom
Downloading: https://repo.cloudbees.com/content/repositories/central/org/apache/maven/maven-compat/3.0-alpha-2/maven-compat-3.0-alpha-2.pom
Downloaded: https://repo.cloudbees.com/content/repositories/central/org/apache/maven/maven-compat/3.0-alpha-2/maven-compat-3.0-alpha-2.pom (3 KB at 86.1 KB/sec)
Downloading: https://repository-jclouds.forge.cloudbees.com/release/org/codehaus/plexus/plexus-container-default/1.0-beta-3.0.5/plexus-container-default-1.0-beta-3.0.5.pom
Downloading: https://repo.cloudbees.com/content/repositories/central/org/codehaus/plexus/plexus-container-default/1.0-beta-3.0.5/plexus-container-default-1.0-beta-3.0.5.pom
Downloaded: https://repo.cloudbees.com/content/repositories/central/org/codehaus/plexus/plexus-container-default/1.0-beta-3.0.5/plexus-container-default-1.0-beta-3.0.5.pom (2 KB at 91.5 KB/sec)
Downloading: https://repository-jclouds.forge.cloudbees.com/release/org/codehaus/plexus/plexus-containers/1.0-beta-3.0.5/plexus-containers-1.0-beta-3.0.5.pom
Downloading: https://repo.cloudbees.com/content/repositories/central/org/codehaus/plexus/plexus-containers/1.0-beta-3.0.5/plexus-containers-1.0-beta-3.0.5.pom
Downloaded: https://repo.cloudbees.com/content/repositories/central/org/codehaus/plexus/plexus-containers/1.0-beta-3.0.5/plexus-containers-1.0-beta-3.0.5.pom (5 KB at 191.2 KB/sec)
Downloading: https://repository-jclouds.forge.cloudbees.com/release/org/codehaus/plexus/plexus-classworlds/1.4/plexus-classworlds-1.4.pom
Downloading: https://repo.cloudbees.com/content/repositories/central/org/codehaus/plexus/plexus-classworlds/1.4/plexus-classworlds-1.4.pom
Downloaded: https://repo.cloudbees.com/content/repositories/central/org/codehaus/plexus/plexus-classworlds/1.4/plexus-classworlds-1.4.pom (5 KB at 123.2 KB/sec)
Downloading: https://repository-jclouds.forge.cloudbees.com/release/org/codehaus/plexus/plexus/2.0.0/plexus-2.0.0.pom
Downloading: https://repo.cloudbees.com/content/repositories/central/org/codehaus/plexus/plexus/2.0.0/plexus-2.0.0.pom
Downloaded: https://repo.cloudbees.com/content/repositories/central/org/codehaus/plexus/plexus/2.0.0/plexus-2.0.0.pom (8 KB at 324.2 KB/sec)
Downloading: https://repository-jclouds.forge.cloudbees.com/release/com/google/code/google-collections/google-collect/snapshot-20080530/google-collect-snapshot-20080530.pom
Downloading: https://repo.cloudbees.com/content/repositories/central/com/google/code/google-collections/google-collect/snapshot-20080530/google-collect-snapshot-20080530.pom
Downloaded: https://repo.cloudbees.com/content/repositories/central/com/google/code/google-collections/google-collect/snapshot-20080530/google-collect-snapshot-20080530.pom (2 KB at 83.4 KB/sec)
Downloading: https://repository-jclouds.forge.cloudbees.com/release/org/codehaus/plexus/plexus-component-annotations/1.0-beta-3.0.5/plexus-component-annotations-1.0-beta-3.0.5.pom
Downloading: https://repo.cloudbees.com/content/repositories/central/org/codehaus/plexus/plexus-component-annotations/1.0-beta-3.0.5/plexus-component-annotations-1.0-beta-3.0.5.pom
Downloaded: https://repo.cloudbees.com/content/repositories/central/org/codehaus/plexus/plexus-component-annotations/1.0-beta-3.0.5/plexus-component-annotations-1.0-beta-3.0.5.pom (602 B at 45.2 KB/sec)
Downloading: https://repository-jclouds.forge.cloudbees.com/release/org/apache/maven/wagon/wagon-provider-api/1.0-beta-4/wagon-provider-api-1.0-beta-4.pom
Downloading: https://repo.cloudbees.com/content/repositories/central/org/apache/maven/wagon/wagon-provider-api/1.0-beta-4/wagon-provider-api-1.0-beta-4.pom
Downloaded: https://repo.cloudbees.com/content/repositories/central/org/apache/maven/wagon/wagon-provider-api/1.0-beta-4/wagon-provider-api-1.0-beta-4.pom (906 B at 34.0 KB/sec)
Downloading: https://repository-jclouds.forge.cloudbees.com/release/org/apache/maven/wagon/wagon/1.0-beta-4/wagon-1.0-beta-4.pom
Downloading: https://repo.cloudbees.com/content/repositories/central/org/apache/maven/wagon/wagon/1.0-beta-4/wagon-1.0-beta-4.pom
Downloaded: https://repo.cloudbees.com/content/repositories/central/org/apache/maven/wagon/wagon/1.0-beta-4/wagon-1.0-beta-4.pom (11 KB at 196.9 KB/sec)
Downloading: https://repository-jclouds.forge.cloudbees.com/release/org/codehaus/woodstox/wstx-asl/3.2.6/wstx-asl-3.2.6.pom
Downloading: https://repo.cloudbees.com/content/repositories/central/org/codehaus/woodstox/wstx-asl/3.2.6/wstx-asl-3.2.6.pom
Downloaded: https://repo.cloudbees.com/content/repositories/central/org/codehaus/woodstox/wstx-asl/3.2.6/wstx-asl-3.2.6.pom (2 KB at 53.2 KB/sec)
Downloading: https://repository-jclouds.forge.cloudbees.com/release/stax/stax-api/1.0.1/stax-api-1.0.1.pom
Downloading: https://repo.cloudbees.com/content/repositories/central/stax/stax-api/1.0.1/stax-api-1.0.1.pom
Downloaded: https://repo.cloudbees.com/content/repositories/central/stax/stax-api/1.0.1/stax-api-1.0.1.pom (2 KB at 93.1 KB/sec)
Downloading: https://repository-jclouds.forge.cloudbees.com/release/org/sonatype/spice/model-builder/1.3/model-builder-1.3.pom
Downloading: https://repo.cloudbees.com/content/repositories/central/org/sonatype/spice/model-builder/1.3/model-builder-1.3.pom
Downloaded: https://repo.cloudbees.com/content/repositories/central/org/sonatype/spice/model-builder/1.3/model-builder-1.3.pom (3 KB at 165.4 KB/sec)
Downloading: https://repository-jclouds.forge.cloudbees.com/release/org/apache/maven/maven-project-builder/3.0-alpha-2/maven-project-builder-3.0-alpha-2.pom
Downloading: https://repo.cloudbees.com/content/repositories/central/org/apache/maven/maven-project-builder/3.0-alpha-2/maven-project-builder-3.0-alpha-2.pom
Downloaded: https://repo.cloudbees.com/content/repositories/central/org/apache/maven/maven-project-builder/3.0-alpha-2/maven-project-builder-3.0-alpha-2.pom (2 KB at 86.7 KB/sec)
Downloading: https://repository-jclouds.forge.cloudbees.com/release/org/apache/felix/maven-bundle-plugin/2.4.0/maven-bundle-plugin-2.4.0.pom
Downloading: https://repo.cloudbees.com/content/repositories/central/org/apache/felix/maven-bundle-plugin/2.4.0/maven-bundle-plugin-2.4.0.pom
Downloaded: https://repo.cloudbees.com/content/repositories/central/org/apache/felix/maven-bundle-plugin/2.4.0/maven-bundle-plugin-2.4.0.pom (4 KB at 281.0 KB/sec)
Downloading: https://repository-jclouds.forge.cloudbees.com/release/biz/aQute/bnd/bndlib/2.3.0/bndlib-2.3.0.pom
Downloading: https://repo.cloudbees.com/content/repositories/central/biz/aQute/bnd/bndlib/2.3.0/bndlib-2.3.0.pom
Downloaded: https://repo.cloudbees.com/content/repositories/central/biz/aQute/bnd/bndlib/2.3.0/bndlib-2.3.0.pom (2 KB at 36.6 KB/sec)
Downloading: https://repository-jclouds.forge.cloudbees.com/release/biz/aQute/bnd/parent/2.3.0/parent-2.3.0.pom
Downloading: https://repo.cloudbees.com/content/repositories/central/biz/aQute/bnd/parent/2.3.0/parent-2.3.0.pom
Downloaded: https://repo.cloudbees.com/content/repositories/central/biz/aQute/bnd/parent/2.3.0/parent-2.3.0.pom (5 KB at 53.3 KB/sec)
Downloading: https://repository-jclouds.forge.cloudbees.com/release/org/osgi/org.osgi.core/4.3.1/org.osgi.core-4.3.1.pom
Downloading: https://repo.cloudbees.com/content/repositories/central/org/osgi/org.osgi.core/4.3.1/org.osgi.core-4.3.1.pom
Downloaded: https://repo.cloudbees.com/content/repositories/central/org/osgi/org.osgi.core/4.3.1/org.osgi.core-4.3.1.pom (2 KB at 46.0 KB/sec)
Downloading: https://repository-jclouds.forge.cloudbees.com/release/org/easymock/easymock/3.2/easymock-3.2.pom
Downloading: https://repo.cloudbees.com/content/repositories/central/org/easymock/easymock/3.2/easymock-3.2.pom
Downloaded: https://repo.cloudbees.com/content/repositories/central/org/easymock/easymock/3.2/easymock-3.2.pom (5 KB at 67.3 KB/sec)
Downloading: https://repository-jclouds.forge.cloudbees.com/release/org/easymock/easymock-parent/3.2/easymock-parent-3.2.pom
Downloading: https://repo.cloudbees.com/content/repositories/central/org/easymock/easymock-parent/3.2/easymock-parent-3.2.pom
Downloaded: https://repo.cloudbees.com/content/repositories/central/org/easymock/easymock-parent/3.2/easymock-parent-3.2.pom (17 KB at 727.6 KB/sec)
Downloading: https://repository-jclouds.forge.cloudbees.com/release/org/objenesis/objenesis/1.3/objenesis-1.3.pom
Downloading: https://repo.cloudbees.com/content/repositories/central/org/objenesis/objenesis/1.3/objenesis-1.3.pom
Downloaded: https://repo.cloudbees.com/content/repositories/central/org/objenesis/objenesis/1.3/objenesis-1.3.pom (3 KB at 63.6 KB/sec)
Downloading: https://repository-jclouds.forge.cloudbees.com/release/org/objenesis/objenesis-parent/1.3/objenesis-parent-1.3.pom
Downloading: https://repo.cloudbees.com/content/repositories/central/org/objenesis/objenesis-parent/1.3/objenesis-parent-1.3.pom
Downloaded: https://repo.cloudbees.com/content/repositories/central/org/objenesis/objenesis-parent/1.3/objenesis-parent-1.3.pom (14 KB at 495.0 KB/sec)
Downloading: https://repository-jclouds.forge.cloudbees.com/release/org/apache/maven/maven-plugin-api/3.0-alpha-2/maven-plugin-api-3.0-alpha-2.pom
Downloading: https://repo.cloudbees.com/content/repositories/central/org/apache/maven/maven-plugin-api/3.0-alpha-2/maven-plugin-api-3.0-alpha-2.pom
Downloaded: https://repo.cloudbees.com/content/repositories/central/org/apache/maven/maven-plugin-api/3.0-alpha-2/maven-plugin-api-3.0-alpha-2.pom (2 KB at 60.4 KB/sec)
Downloading: https://repository-jclouds.forge.cloudbees.com/release/org/osgi/org.osgi.compendium/4.3.1/org.osgi.compendium-4.3.1.pom
Downloading: https://repo.cloudbees.com/content/repositories/central/org/osgi/org.osgi.compendium/4.3.1/org.osgi.compendium-4.3.1.pom
Downloaded: https://repo.cloudbees.com/content/repositories/central/org/osgi/org.osgi.compendium/4.3.1/org.osgi.compendium-4.3.1.pom (2 KB at 66.3 KB/sec)
Downloading: https://repository-jclouds.forge.cloudbees.com/release/org/apache/servicemix/bundles/org.apache.servicemix.bundles.ant/1.8.4_1/org.apache.servicemix.bundles.ant-1.8.4_1.pom
Downloading: https://repo.cloudbees.com/content/repositories/central/org/apache/servicemix/bundles/org.apache.servicemix.bundles.ant/1.8.4_1/org.apache.servicemix.bundles.ant-1.8.4_1.pom
Downloaded: https://repo.cloudbees.com/content/repositories/central/org/apache/servicemix/bundles/org.apache.servicemix.bundles.ant/1.8.4_1/org.apache.servicemix.bundles.ant-1.8.4_1.pom (4 KB at 114.3 KB/sec)
Downloading: https://repository-jclouds.forge.cloudbees.com/release/org/apache/servicemix/bundles/bundles-pom/10/bundles-pom-10.pom
Downloading: https://repo.cloudbees.com/content/repositories/central/org/apache/servicemix/bundles/bundles-pom/10/bundles-pom-10.pom
Downloaded: https://repo.cloudbees.com/content/repositories/central/org/apache/servicemix/bundles/bundles-pom/10/bundles-pom-10.pom (15 KB at 399.5 KB/sec)
Downloading: https://repository-jclouds.forge.cloudbees.com/release/org/slf4j/slf4j-jdk14/1.7.7/slf4j-jdk14-1.7.7.jar
Downloading: https://repository-jclouds.forge.cloudbees.com/release/org/sonatype/sisu/sisu-inject-bean/2.3.0/sisu-inject-bean-2.3.0.jar
Downloading: https://repository-jclouds.forge.cloudbees.com/release/org/sonatype/sisu/sisu-guice/3.1.0/sisu-guice-3.1.0-no_aop.jar
Downloading: https://repository-jclouds.forge.cloudbees.com/release/org/sonatype/sisu/sisu-guava/0.9.9/sisu-guava-0.9.9.jar
Downloading: https://repository-jclouds.forge.cloudbees.com/release/org/codehaus/plexus/plexus-interpolation/1.1/plexus-interpolation-1.1.jar
Downloading: https://repository-jclouds.forge.cloudbees.com/release/com/google/code/google-collections/google-collect/snapshot-20080530/google-collect-snapshot-20080530.jar
Downloading: https://repository-jclouds.forge.cloudbees.com/release/org/codehaus/woodstox/wstx-asl/3.2.6/wstx-asl-3.2.6.jar
Downloading: https://repository-jclouds.forge.cloudbees.com/release/stax/stax-api/1.0.1/stax-api-1.0.1.jar
Downloading: https://repository-jclouds.forge.cloudbees.com/release/org/sonatype/spice/model-builder/1.3/model-builder-1.3.jar
Downloading: https://repository-jclouds.forge.cloudbees.com/release/org/apache/maven/maven-project-builder/3.0-alpha-2/maven-project-builder-3.0-alpha-2.jar
Downloading: https://repository-jclouds.forge.cloudbees.com/release/org/apache/felix/maven-bundle-plugin/2.4.0/maven-bundle-plugin-2.4.0.jar
Downloading: https://repository-jclouds.forge.cloudbees.com/release/biz/aQute/bnd/bndlib/2.3.0/bndlib-2.3.0.jar
Downloading: https://repository-jclouds.forge.cloudbees.com/release/org/osgi/org.osgi.core/4.3.1/org.osgi.core-4.3.1.jar
Downloading: https://repository-jclouds.forge.cloudbees.com/release/org/easymock/easymock/3.2/easymock-3.2.jar
Downloading: https://repository-jclouds.forge.cloudbees.com/release/org/objenesis/objenesis/1.3/objenesis-1.3.jar
Downloading: https://repository-jclouds.forge.cloudbees.com/release/org/osgi/org.osgi.compendium/4.3.1/org.osgi.compendium-4.3.1.jar
Downloading: https://repository-jclouds.forge.cloudbees.com/release/org/apache/servicemix/bundles/org.apache.servicemix.bundles.ant/1.8.4_1/org.apache.servicemix.bundles.ant-1.8.4_1.jar
Downloading: https://repo.cloudbees.com/content/repositories/central/org/slf4j/slf4j-jdk14/1.7.7/slf4j-jdk14-1.7.7.jar
Downloading: https://repo.cloudbees.com/content/repositories/central/org/sonatype/sisu/sisu-inject-bean/2.3.0/sisu-inject-bean-2.3.0.jar
Downloading: https://repo.cloudbees.com/content/repositories/central/org/sonatype/sisu/sisu-guice/3.1.0/sisu-guice-3.1.0-no_aop.jar
Downloading: https://repo.cloudbees.com/content/repositories/central/org/sonatype/sisu/sisu-guava/0.9.9/sisu-guava-0.9.9.jar
Downloading: https://repo.cloudbees.com/content/repositories/central/org/codehaus/plexus/plexus-interpolation/1.1/plexus-interpolation-1.1.jar
Downloaded: https://repo.cloudbees.com/content/repositories/central/org/slf4j/slf4j-jdk14/1.7.7/slf4j-jdk14-1.7.7.jar (8 KB at 160.7 KB/sec)
Downloading: https://repo.cloudbees.com/content/repositories/central/com/google/code/google-collections/google-collect/snapshot-20080530/google-collect-snapshot-20080530.jar
Downloaded: https://repo.cloudbees.com/content/repositories/central/org/codehaus/plexus/plexus-interpolation/1.1/plexus-interpolation-1.1.jar (35 KB at 597.4 KB/sec)
Downloading: https://repo.cloudbees.com/content/repositories/central/org/codehaus/woodstox/wstx-asl/3.2.6/wstx-asl-3.2.6.jar
Downloaded: https://repo.cloudbees.com/content/repositories/central/org/sonatype/sisu/sisu-inject-bean/2.3.0/sisu-inject-bean-2.3.0.jar (283 KB at 4553.1 KB/sec)
Downloading: https://repo.cloudbees.com/content/repositories/central/stax/stax-api/1.0.1/stax-api-1.0.1.jar
Downloaded: https://repo.cloudbees.com/content/repositories/central/org/sonatype/sisu/sisu-guice/3.1.0/sisu-guice-3.1.0-no_aop.jar (350 KB at 4475.0 KB/sec)
Downloading: https://repo.cloudbees.com/content/repositories/central/org/sonatype/spice/model-builder/1.3/model-builder-1.3.jar
Downloaded: https://repo.cloudbees.com/content/repositories/central/org/sonatype/sisu/sisu-guava/0.9.9/sisu-guava-0.9.9.jar (1473 KB at 12692.1 KB/sec)
Downloading: https://repo.cloudbees.com/content/repositories/central/org/apache/maven/maven-project-builder/3.0-alpha-2/maven-project-builder-3.0-alpha-2.jar
Downloaded: https://repo.cloudbees.com/content/repositories/central/org/codehaus/woodstox/wstx-asl/3.2.6/wstx-asl-3.2.6.jar (509 KB at 8915.7 KB/sec)
Downloading: https://repo.cloudbees.com/content/repositories/central/org/apache/felix/maven-bundle-plugin/2.4.0/maven-bundle-plugin-2.4.0.jar
Downloaded: https://repo.cloudbees.com/content/repositories/central/org/sonatype/spice/model-builder/1.3/model-builder-1.3.jar (35 KB at 668.1 KB/sec)
Downloading: https://repo.cloudbees.com/content/repositories/central/biz/aQute/bnd/bndlib/2.3.0/bndlib-2.3.0.jar
Downloaded: https://repo.cloudbees.com/content/repositories/central/stax/stax-api/1.0.1/stax-api-1.0.1.jar (26 KB at 349.9 KB/sec)
Downloading: https://repo.cloudbees.com/content/repositories/central/org/osgi/org.osgi.core/4.3.1/org.osgi.core-4.3.1.jar
Downloaded: https://repo.cloudbees.com/content/repositories/central/org/apache/maven/maven-project-builder/3.0-alpha-2/maven-project-builder-3.0-alpha-2.jar (166 KB at 6350.4 KB/sec)
Downloading: https://repo.cloudbees.com/content/repositories/central/org/easymock/easymock/3.2/easymock-3.2.jar
Downloaded: https://repo.cloudbees.com/content/repositories/central/org/apache/felix/maven-bundle-plugin/2.4.0/maven-bundle-plugin-2.4.0.jar (124 KB at 4403.2 KB/sec)
Downloading: https://repo.cloudbees.com/content/repositories/central/org/objenesis/objenesis/1.3/objenesis-1.3.jar
Downloaded: https://repo.cloudbees.com/content/repositories/central/org/easymock/easymock/3.2/easymock-3.2.jar (117 KB at 4678.9 KB/sec)
Downloading: https://repo.cloudbees.com/content/repositories/central/org/osgi/org.osgi.compendium/4.3.1/org.osgi.compendium-4.3.1.jar
Downloaded: https://repo.cloudbees.com/content/repositories/central/com/google/code/google-collections/google-collect/snapshot-20080530/google-collect-snapshot-20080530.jar (490 KB at 3887.6 KB/sec)
Downloading: https://repo.cloudbees.com/content/repositories/central/org/apache/servicemix/bundles/org.apache.servicemix.bundles.ant/1.8.4_1/org.apache.servicemix.bundles.ant-1.8.4_1.jar
Downloaded: https://repo.cloudbees.com/content/repositories/central/org/objenesis/objenesis/1.3/objenesis-1.3.jar (40 KB at 842.9 KB/sec)
Downloaded: https://repo.cloudbees.com/content/repositories/central/biz/aQute/bnd/bndlib/2.3.0/bndlib-2.3.0.jar (1744 KB at 22075.8 KB/sec)
Downloaded: https://repo.cloudbees.com/content/repositories/central/org/osgi/org.osgi.compendium/4.3.1/org.osgi.compendium-4.3.1.jar (750 KB at 15289.0 KB/sec)
Downloaded: https://repo.cloudbees.com/content/repositories/central/org/osgi/org.osgi.core/4.3.1/org.osgi.core-4.3.1.jar (342 KB at 4219.5 KB/sec)
Downloaded: https://repo.cloudbees.com/content/repositories/central/org/apache/servicemix/bundles/org.apache.servicemix.bundles.ant/1.8.4_1/org.apache.servicemix.bundles.ant-1.8.4_1.jar (1927 KB at 8233.0 KB/sec)
[INFO] Copying bundle: org.apache.karaf.assemblies.features:standard:xml:features:2.3.11
Downloading: https://repo.cloudbees.com/content/repositories/central/org/apache/karaf/assemblies/features/standard/2.3.11/standard-2.3.11-features.xml
Downloaded: https://repo.cloudbees.com/content/repositories/central/org/apache/karaf/assemblies/features/standard/2.3.11/standard-2.3.11-features.xml (38 KB at 1518.2 KB/sec)
[INFO] Copying bundle: org.apache.karaf.assemblies.features:enterprise:xml:features:2.3.11
Downloading: https://repo.cloudbees.com/content/repositories/central/org/apache/karaf/assemblies/features/enterprise/2.3.11/enterprise-2.3.11-features.xml
Downloaded: https://repo.cloudbees.com/content/repositories/central/org/apache/karaf/assemblies/features/enterprise/2.3.11/enterprise-2.3.11-features.xml (20 KB at 707.2 KB/sec)
[INFO] Copying bundle: org.apache.karaf.assemblies.features:enterprise:xml:features:2.3.11
[INFO] Copying bundle: org.ops4j.pax.cdi:pax-cdi-features:xml:features:0.8.0
Downloading: https://repo.cloudbees.com/content/repositories/central/org/ops4j/pax/cdi/pax-cdi-features/0.8.0/pax-cdi-features-0.8.0-features.xml
Downloaded: https://repo.cloudbees.com/content/repositories/central/org/ops4j/pax/cdi/pax-cdi-features/0.8.0/pax-cdi-features-0.8.0-features.xml (11 KB at 552.3 KB/sec)
[INFO] Copying bundle: org.apache.karaf.assemblies.features:standard:xml:features:2.3.11
[INFO] Copying bundle: org.apache.karaf.assemblies.features:standard:xml:features:2.3.11
[INFO] Copying bundle: org.apache.jclouds.karaf:jclouds-karaf:xml:features:2.1.0-SNAPSHOT
Downloading: https://repository-jclouds.forge.cloudbees.com/snapshot/org/apache/jclouds/karaf/jclouds-karaf/2.1.0-SNAPSHOT/maven-metadata.xml
Downloading: https://repository.apache.org/content/repositories/snapshots/org/apache/jclouds/karaf/jclouds-karaf/2.1.0-SNAPSHOT/maven-metadata.xml
Downloading: http://repository.apache.org/snapshots/org/apache/jclouds/karaf/jclouds-karaf/2.1.0-SNAPSHOT/maven-metadata.xml
Downloaded: http://repository.apache.org/snapshots/org/apache/jclouds/karaf/jclouds-karaf/2.1.0-SNAPSHOT/maven-metadata.xml (2 KB at 34.3 KB/sec)
Downloaded: https://repository.apache.org/content/repositories/snapshots/org/apache/jclouds/karaf/jclouds-karaf/2.1.0-SNAPSHOT/maven-metadata.xml (2 KB at 1.2 KB/sec)
Downloading: https://repository.apache.org/content/repositories/snapshots/org/apache/jclouds/karaf/jclouds-karaf/2.1.0-SNAPSHOT/jclouds-karaf-2.1.0-20170320.163404-90-features.xml
Downloaded: https://repository.apache.org/content/repositories/snapshots/org/apache/jclouds/karaf/jclouds-karaf/2.1.0-SNAPSHOT/jclouds-karaf-2.1.0-20170320.163404-90-features.xml (43 KB at 753.4 KB/sec)
Started calculate disk usage of build
Finished Calculation of disk usage of build in 0 seconds
Started calculate disk usage of workspace
Finished Calculation of disk usage of workspace in 0 seconds
[INFO] ------------------------------------------------------------------------
[INFO] Reactor Summary:
[INFO] 
[INFO] Apache jclouds :: cli ............................. SUCCESS [29.549s]
[INFO] jclouds :: cli :: branding ........................ SUCCESS [6.025s]
[INFO] jclouds :: cli :: runner .......................... SUCCESS [26.814s]
[INFO] jclouds :: cli :: assembly ........................ FAILURE [21.907s]
[INFO] Apache jclouds :: cli ............................. SKIPPED
[INFO] ------------------------------------------------------------------------
[INFO] BUILD FAILURE
[INFO] ------------------------------------------------------------------------
[INFO] Total time: 1:38.994s
[INFO] Finished at: Mon Mar 20 12:48:20 EDT 2017
[INFO] Final Memory: 51M/251M
[INFO] ------------------------------------------------------------------------
Waiting for Jenkins to finish collecting data
[ERROR] Failed to execute goal org.apache.karaf.tooling:features-maven-plugin:2.3.11:add-features-to-repo (add-features-to-repo) on project jclouds-cli-assembly: Error populating repository: Unable to find the feature 'jclouds-api-cloudsigma2' -> [Help 1]
org.apache.maven.lifecycle.LifecycleExecutionException: Failed to execute goal org.apache.karaf.tooling:features-maven-plugin:2.3.11:add-features-to-repo (add-features-to-repo) on project jclouds-cli-assembly: Error populating repository
	at org.apache.maven.lifecycle.internal.MojoExecutor.execute(MojoExecutor.java:217)
	at org.apache.maven.lifecycle.internal.MojoExecutor.execute(MojoExecutor.java:153)
	at org.apache.maven.lifecycle.internal.MojoExecutor.execute(MojoExecutor.java:145)
	at org.apache.maven.lifecycle.internal.LifecycleModuleBuilder.buildProject(LifecycleModuleBuilder.java:84)
	at org.apache.maven.lifecycle.internal.LifecycleModuleBuilder.buildProject(LifecycleModuleBuilder.java:59)
	at org.apache.maven.lifecycle.internal.LifecycleStarter.singleThreadedBuild(LifecycleStarter.java:183)
	at org.apache.maven.lifecycle.internal.LifecycleStarter.execute(LifecycleStarter.java:161)
	at org.apache.maven.DefaultMaven.doExecute(DefaultMaven.java:320)
	at org.apache.maven.DefaultMaven.execute(DefaultMaven.java:156)
	at org.jvnet.hudson.maven3.launcher.Maven3Launcher.main(Maven3Launcher.java:117)
	at sun.reflect.NativeMethodAccessorImpl.invoke0(Native Method)
	at sun.reflect.NativeMethodAccessorImpl.invoke(NativeMethodAccessorImpl.java:57)
	at sun.reflect.DelegatingMethodAccessorImpl.invoke(DelegatingMethodAccessorImpl.java:43)
	at java.lang.reflect.Method.invoke(Method.java:606)
	at org.codehaus.plexus.classworlds.launcher.Launcher.launchStandard(Launcher.java:329)
	at org.codehaus.plexus.classworlds.launcher.Launcher.launch(Launcher.java:239)
	at org.jvnet.hudson.maven3.agent.Maven3Main.launch(Maven3Main.java:181)
	at sun.reflect.NativeMethodAccessorImpl.invoke0(Native Method)
	at sun.reflect.NativeMethodAccessorImpl.invoke(NativeMethodAccessorImpl.java:57)
	at sun.reflect.DelegatingMethodAccessorImpl.invoke(DelegatingMethodAccessorImpl.java:43)
	at java.lang.reflect.Method.invoke(Method.java:606)
	at hudson.maven.Maven3Builder.call(Maven3Builder.java:139)
	at hudson.maven.Maven3Builder.call(Maven3Builder.java:70)
	at hudson.remoting.UserRequest.perform(UserRequest.java:153)
	at hudson.remoting.UserRequest.perform(UserRequest.java:50)
	at hudson.remoting.Request$2.run(Request.java:336)
	at hudson.remoting.InterceptingExecutorService$1.call(InterceptingExecutorService.java:68)
	at java.util.concurrent.FutureTask.run(FutureTask.java:262)
	at java.util.concurrent.ThreadPoolExecutor.runWorker(ThreadPoolExecutor.java:1145)
	at java.util.concurrent.ThreadPoolExecutor$Worker.run(ThreadPoolExecutor.java:615)
	at java.lang.Thread.run(Thread.java:745)
Caused by: org.apache.maven.plugin.MojoExecutionException: Error populating repository
	at org.apache.karaf.tooling.features.AddFeaturesToRepoMojo.execute(AddFeaturesToRepoMojo.java:226)
	at org.apache.maven.plugin.DefaultBuildPluginManager.executeMojo(DefaultBuildPluginManager.java:101)
	at org.apache.maven.lifecycle.internal.MojoExecutor.execute(MojoExecutor.java:209)
	... 30 more
Caused by: java.lang.IllegalArgumentException: Unable to find the feature 'jclouds-api-cloudsigma2'
	at org.apache.karaf.tooling.features.AddFeaturesToRepoMojo.addFeatures(AddFeaturesToRepoMojo.java:328)
	at org.apache.karaf.tooling.features.AddFeaturesToRepoMojo.execute(AddFeaturesToRepoMojo.java:165)
	... 32 more
[ERROR] 
[ERROR] Re-run Maven using the -X switch to enable full debug logging.
[ERROR] 
[ERROR] For more information about the errors and possible solutions, please read the following articles:
[ERROR] [Help 1] http://cwiki.apache.org/confluence/display/MAVEN/MojoExecutionException
[ERROR] 
[ERROR] After correcting the problems, you can resume the build with the command
[ERROR]   mvn <goals> -rf :jclouds-cli-assembly
[JENKINS] Archiving <https://jclouds.ci.cloudbees.com/job/jclouds-cli/ws/branding/pom.xml> to org.apache.jclouds.cli/jclouds-cli-branding/2.1.0-SNAPSHOT/jclouds-cli-branding-2.1.0-SNAPSHOT.pom
[JENKINS] Archiving <https://jclouds.ci.cloudbees.com/job/jclouds-cli/ws/branding/target/jclouds-cli-branding-2.1.0-SNAPSHOT.jar> to org.apache.jclouds.cli/jclouds-cli-branding/2.1.0-20170320.164730-62/jclouds-cli-branding-2.1.0-20170320.164730-62.jar
[JENKINS] Archiving <https://jclouds.ci.cloudbees.com/job/jclouds-cli/ws/branding/target/jclouds-cli-branding-2.1.0-SNAPSHOT-tests.jar> to org.apache.jclouds.cli/jclouds-cli-branding/2.1.0-20170320.164730-62/jclouds-cli-branding-2.1.0-20170320.164730-62-tests.jar
[JENKINS] Archiving <https://jclouds.ci.cloudbees.com/job/jclouds-cli/ws/branding/target/jclouds-cli-branding-2.1.0-SNAPSHOT-sources.jar> to org.apache.jclouds.cli/jclouds-cli-branding/2.1.0-20170320.164730-62/jclouds-cli-branding-2.1.0-20170320.164730-62-sources.jar
[JENKINS] Archiving <https://jclouds.ci.cloudbees.com/job/jclouds-cli/ws/assembly/pom.xml> to org.apache.jclouds.cli/jclouds-cli-assembly/2.1.0-SNAPSHOT/jclouds-cli-assembly-2.1.0-SNAPSHOT.pom
[JENKINS] Archiving <https://jclouds.ci.cloudbees.com/job/jclouds-cli/ws/pom.xml> to org.apache.jclouds.cli/jclouds-cli/2.1.0-SNAPSHOT/jclouds-cli-2.1.0-SNAPSHOT.pom
[JENKINS] Archiving <https://jclouds.ci.cloudbees.com/job/jclouds-cli/ws/runner/pom.xml> to org.apache.jclouds.cli/jclouds-cli-runner/2.1.0-SNAPSHOT/jclouds-cli-runner-2.1.0-SNAPSHOT.pom
[JENKINS] Archiving <https://jclouds.ci.cloudbees.com/job/jclouds-cli/ws/runner/target/jclouds-cli-runner-2.1.0-SNAPSHOT.jar> to org.apache.jclouds.cli/jclouds-cli-runner/2.1.0-20170320.164757-61/jclouds-cli-runner-2.1.0-20170320.164757-61.jar
[JENKINS] Archiving <https://jclouds.ci.cloudbees.com/job/jclouds-cli/ws/runner/target/jclouds-cli-runner-2.1.0-SNAPSHOT-tests.jar> to org.apache.jclouds.cli/jclouds-cli-runner/2.1.0-20170320.164757-61/jclouds-cli-runner-2.1.0-20170320.164757-61-tests.jar
[JENKINS] Archiving <https://jclouds.ci.cloudbees.com/job/jclouds-cli/ws/runner/target/jclouds-cli-runner-2.1.0-SNAPSHOT-javadoc.jar> to org.apache.jclouds.cli/jclouds-cli-runner/2.1.0-20170320.164757-61/jclouds-cli-runner-2.1.0-20170320.164757-61-javadoc.jar
[JENKINS] Archiving <https://jclouds.ci.cloudbees.com/job/jclouds-cli/ws/runner/target/jclouds-cli-runner-2.1.0-SNAPSHOT-sources.jar> to org.apache.jclouds.cli/jclouds-cli-runner/2.1.0-20170320.164757-61/jclouds-cli-runner-2.1.0-20170320.164757-61-sources.jar
[JENKINS] Archiving <https://jclouds.ci.cloudbees.com/job/jclouds-cli/ws/project/pom.xml> to org.apache.jclouds.cli/jclouds-cli-project/2.1.0-SNAPSHOT/jclouds-cli-project-2.1.0-SNAPSHOT.pom
[JENKINS] Archiving <https://jclouds.ci.cloudbees.com/job/jclouds-cli/ws/project/target/jclouds-cli-project-2.1.0-SNAPSHOT-tests.jar> to org.apache.jclouds.cli/jclouds-cli-project/2.1.0-20170320.164724-62/jclouds-cli-project-2.1.0-20170320.164724-62-tests.jar
channel stopped
Started calculate disk usage of build
Finished Calculation of disk usage of build in 0 seconds
Started calculate disk usage of workspace
Finished Calculation of disk usage of workspace in 0 seconds

Build failed in Jenkins: jclouds-cli #1306

Posted by je...@cloudbees.com.
See <https://jclouds.ci.cloudbees.com/job/jclouds-cli/1306/display/redirect>

------------------------------------------
[...truncated 57.50 KB...]
[INFO] Exclude: **/TODO
[INFO] Exclude: .mailmap
[INFO] Exclude: .idea/**
[INFO] Exclude: **/*.iml
[INFO] Exclude: **/.project
[INFO] Exclude: **/.classpath
[INFO] Exclude: **/.settings/**
[INFO] Exclude: **/.checkstyle
[INFO] Exclude: **/target/**
[INFO] Exclude: .repository/**
[INFO] 2 resources included (use -debug for more details)
Warning:  org.apache.xerces.jaxp.SAXParserImpl$JAXPSAXParser: Property 'http://www.oracle.com/xml/jaxp/properties/entityExpansionLimit' is not recognized.
Compiler warnings:
  WARNING:  'org.apache.xerces.jaxp.SAXParserImpl: Property 'http://javax.xml.XMLConstants/property/accessExternalDTD' is not recognized.'
Warning:  org.apache.xerces.parsers.SAXParser: Feature 'http://javax.xml.XMLConstants/feature/secure-processing' is not recognized.
Warning:  org.apache.xerces.parsers.SAXParser: Property 'http://javax.xml.XMLConstants/property/accessExternalDTD' is not recognized.
Warning:  org.apache.xerces.parsers.SAXParser: Property 'http://www.oracle.com/xml/jaxp/properties/entityExpansionLimit' is not recognized.
[INFO] Rat check: Summary of files. Unapproved: 0 unknown: 0 generated: 0 approved: 2 licence.
[INFO] 
[INFO] --- maven-jar-plugin:2.4:test-jar (default) @ jclouds-cli-runner ---
[INFO] Building jar: <https://jclouds.ci.cloudbees.com/job/jclouds-cli/ws/runner/target/jclouds-cli-runner-2.1.0-SNAPSHOT-tests.jar>
[INFO] 
[INFO] --- maven-javadoc-plugin:2.9:jar (javadoc) @ jclouds-cli-runner ---
[INFO] 
2 warnings
[WARNING] Javadoc Warnings
[WARNING] <https://jclouds.ci.cloudbees.com/job/jclouds-cli/ws/runner/src/main/java/org/jclouds/cli/runner/Main.java>:317: warning - @return tag has no arguments.
[WARNING] <https://jclouds.ci.cloudbees.com/job/jclouds-cli/ws/runner/src/main/java/org/jclouds/cli/runner/Main.java>:327: warning - @return tag has no arguments.
[INFO] Building jar: <https://jclouds.ci.cloudbees.com/job/jclouds-cli/ws/runner/target/jclouds-cli-runner-2.1.0-SNAPSHOT-javadoc.jar>
[INFO] 
[INFO] --- maven-source-plugin:2.2:jar-no-fork (attach-sources) @ jclouds-cli-runner ---
[INFO] Building jar: <https://jclouds.ci.cloudbees.com/job/jclouds-cli/ws/runner/target/jclouds-cli-runner-2.1.0-SNAPSHOT-sources.jar>
[INFO] 
[INFO] --- maven-surefire-plugin:2.17:test (integration) @ jclouds-cli-runner ---
[JENKINS] Recording test results[INFO] 
[INFO] --- duplicate-finder-maven-plugin:1.1.1:check (default) @ jclouds-cli-runner ---

[INFO] Skipping duplicate-finder execution!
[INFO] 
[INFO] --- maven-checkstyle-plugin:2.15:check (default) @ jclouds-cli-runner ---
[INFO] 
[INFO] --- modernizer-maven-plugin:1.4.0:modernizer (modernizer) @ jclouds-cli-runner ---
[INFO] 
[INFO] --- maven-install-plugin:2.4:install (default-install) @ jclouds-cli-runner ---
[INFO] Installing <https://jclouds.ci.cloudbees.com/job/jclouds-cli/ws/runner/target/jclouds-cli-runner-2.1.0-SNAPSHOT.jar> to /home/jenkins/.m2/repository/org/apache/jclouds/cli/jclouds-cli-runner/2.1.0-SNAPSHOT/jclouds-cli-runner-2.1.0-SNAPSHOT.jar
[INFO] Installing <https://jclouds.ci.cloudbees.com/job/jclouds-cli/ws/runner/pom.xml> to /home/jenkins/.m2/repository/org/apache/jclouds/cli/jclouds-cli-runner/2.1.0-SNAPSHOT/jclouds-cli-runner-2.1.0-SNAPSHOT.pom
[INFO] Installing <https://jclouds.ci.cloudbees.com/job/jclouds-cli/ws/runner/target/jclouds-cli-runner-2.1.0-SNAPSHOT-tests.jar> to /home/jenkins/.m2/repository/org/apache/jclouds/cli/jclouds-cli-runner/2.1.0-SNAPSHOT/jclouds-cli-runner-2.1.0-SNAPSHOT-tests.jar
[INFO] Installing <https://jclouds.ci.cloudbees.com/job/jclouds-cli/ws/runner/target/jclouds-cli-runner-2.1.0-SNAPSHOT-javadoc.jar> to /home/jenkins/.m2/repository/org/apache/jclouds/cli/jclouds-cli-runner/2.1.0-SNAPSHOT/jclouds-cli-runner-2.1.0-SNAPSHOT-javadoc.jar
[INFO] Installing <https://jclouds.ci.cloudbees.com/job/jclouds-cli/ws/runner/target/jclouds-cli-runner-2.1.0-SNAPSHOT-sources.jar> to /home/jenkins/.m2/repository/org/apache/jclouds/cli/jclouds-cli-runner/2.1.0-SNAPSHOT/jclouds-cli-runner-2.1.0-SNAPSHOT-sources.jar
[INFO] 
[INFO] --- maven-deploy-plugin:2.7:deploy (default-deploy) @ jclouds-cli-runner ---
Downloading: https://repository.apache.org/content/repositories/snapshots/org/apache/jclouds/cli/jclouds-cli-runner/2.1.0-SNAPSHOT/maven-metadata.xml
Downloaded: https://repository.apache.org/content/repositories/snapshots/org/apache/jclouds/cli/jclouds-cli-runner/2.1.0-SNAPSHOT/maven-metadata.xml (2 KB at 8.6 KB/sec)
Uploading: https://repository.apache.org/content/repositories/snapshots/org/apache/jclouds/cli/jclouds-cli-runner/2.1.0-SNAPSHOT/jclouds-cli-runner-2.1.0-20170320.160049-60.jar
Uploaded: https://repository.apache.org/content/repositories/snapshots/org/apache/jclouds/cli/jclouds-cli-runner/2.1.0-SNAPSHOT/jclouds-cli-runner-2.1.0-20170320.160049-60.jar (20 KB at 200.9 KB/sec)
Uploading: https://repository.apache.org/content/repositories/snapshots/org/apache/jclouds/cli/jclouds-cli-runner/2.1.0-SNAPSHOT/jclouds-cli-runner-2.1.0-20170320.160049-60.pom
Uploaded: https://repository.apache.org/content/repositories/snapshots/org/apache/jclouds/cli/jclouds-cli-runner/2.1.0-SNAPSHOT/jclouds-cli-runner-2.1.0-20170320.160049-60.pom (3 KB at 24.8 KB/sec)
Downloading: https://repository.apache.org/content/repositories/snapshots/org/apache/jclouds/cli/jclouds-cli-runner/maven-metadata.xml
Downloaded: https://repository.apache.org/content/repositories/snapshots/org/apache/jclouds/cli/jclouds-cli-runner/maven-metadata.xml (440 B at 9.3 KB/sec)
Uploading: https://repository.apache.org/content/repositories/snapshots/org/apache/jclouds/cli/jclouds-cli-runner/2.1.0-SNAPSHOT/maven-metadata.xml
Uploaded: https://repository.apache.org/content/repositories/snapshots/org/apache/jclouds/cli/jclouds-cli-runner/2.1.0-SNAPSHOT/maven-metadata.xml (2 KB at 18.5 KB/sec)
Uploading: https://repository.apache.org/content/repositories/snapshots/org/apache/jclouds/cli/jclouds-cli-runner/maven-metadata.xml
Uploaded: https://repository.apache.org/content/repositories/snapshots/org/apache/jclouds/cli/jclouds-cli-runner/maven-metadata.xml (440 B at 6.0 KB/sec)
Uploading: https://repository.apache.org/content/repositories/snapshots/org/apache/jclouds/cli/jclouds-cli-runner/2.1.0-SNAPSHOT/jclouds-cli-runner-2.1.0-20170320.160049-60-tests.jar
Uploaded: https://repository.apache.org/content/repositories/snapshots/org/apache/jclouds/cli/jclouds-cli-runner/2.1.0-SNAPSHOT/jclouds-cli-runner-2.1.0-20170320.160049-60-tests.jar (9 KB at 85.8 KB/sec)
Uploading: https://repository.apache.org/content/repositories/snapshots/org/apache/jclouds/cli/jclouds-cli-runner/2.1.0-SNAPSHOT/maven-metadata.xml
Uploaded: https://repository.apache.org/content/repositories/snapshots/org/apache/jclouds/cli/jclouds-cli-runner/2.1.0-SNAPSHOT/maven-metadata.xml (2 KB at 19.0 KB/sec)
Uploading: https://repository.apache.org/content/repositories/snapshots/org/apache/jclouds/cli/jclouds-cli-runner/2.1.0-SNAPSHOT/jclouds-cli-runner-2.1.0-20170320.160049-60-javadoc.jar
Uploaded: https://repository.apache.org/content/repositories/snapshots/org/apache/jclouds/cli/jclouds-cli-runner/2.1.0-SNAPSHOT/jclouds-cli-runner-2.1.0-20170320.160049-60-javadoc.jar (47 KB at 472.0 KB/sec)
Uploading: https://repository.apache.org/content/repositories/snapshots/org/apache/jclouds/cli/jclouds-cli-runner/2.1.0-SNAPSHOT/maven-metadata.xml
Uploaded: https://repository.apache.org/content/repositories/snapshots/org/apache/jclouds/cli/jclouds-cli-runner/2.1.0-SNAPSHOT/maven-metadata.xml (2 KB at 17.1 KB/sec)
Uploading: https://repository.apache.org/content/repositories/snapshots/org/apache/jclouds/cli/jclouds-cli-runner/2.1.0-SNAPSHOT/jclouds-cli-runner-2.1.0-20170320.160049-60-sources.jar
Uploaded: https://repository.apache.org/content/repositories/snapshots/org/apache/jclouds/cli/jclouds-cli-runner/2.1.0-SNAPSHOT/jclouds-cli-runner-2.1.0-20170320.160049-60-sources.jar (13 KB at 155.1 KB/sec)
Uploading: https://repository.apache.org/content/repositories/snapshots/org/apache/jclouds/cli/jclouds-cli-runner/2.1.0-SNAPSHOT/maven-metadata.xml
Uploaded: https://repository.apache.org/content/repositories/snapshots/org/apache/jclouds/cli/jclouds-cli-runner/2.1.0-SNAPSHOT/maven-metadata.xml (2 KB at 18.7 KB/sec)
Started calculate disk usage of build
Finished Calculation of disk usage of build in 0 seconds
Started calculate disk usage of workspace
Finished Calculation of disk usage of workspace in 0 seconds
[INFO]                                                                         
[INFO] ------------------------------------------------------------------------
[INFO] Building jclouds :: cli :: assembly 2.1.0-SNAPSHOT
[INFO] ------------------------------------------------------------------------
[INFO] 
[INFO] --- maven-clean-plugin:2.5:clean (default-clean) @ jclouds-cli-assembly ---
[INFO] 
[INFO] --- maven-enforcer-plugin:1.1.1:enforce (enforce-banned-dependencies) @ jclouds-cli-assembly ---
[INFO] 
[INFO] --- maven-enforcer-plugin:1.1.1:enforce (enforce-java) @ jclouds-cli-assembly ---
[INFO] 
[INFO] --- maven-remote-resources-plugin:1.5:process (default) @ jclouds-cli-assembly ---
[INFO] 
[INFO] --- maven-resources-plugin:2.4.2:resources (filter) @ jclouds-cli-assembly ---
[INFO] Using 'UTF-8' encoding to copy filtered resources.
[INFO] skip non existing resourceDirectory <https://jclouds.ci.cloudbees.com/job/jclouds-cli/ws/assembly/src/main/resources>
[INFO] Copying 13 resources
[INFO] Copying 3 resources
[INFO] 
[INFO] --- maven-dependency-plugin:2.8:unpack (unpack-unix) @ jclouds-cli-assembly ---
[INFO] Configured Artifact: org.apache.karaf:apache-karaf:minimal:2.3.11:tar.gz
[INFO] Unpacking /home/jenkins/.m2/repository/org/apache/karaf/apache-karaf/2.3.11/apache-karaf-2.3.11-minimal.tar.gz to <https://jclouds.ci.cloudbees.com/job/jclouds-cli/ws/assembly/target/dependencies/unix> with includes "" and excludes ""
[INFO] Expanding: /home/jenkins/.m2/repository/org/apache/karaf/apache-karaf/2.3.11/apache-karaf-2.3.11-minimal.tar.gz into <https://jclouds.ci.cloudbees.com/job/jclouds-cli/ws/assembly/target/dependencies/unix>
[INFO] 
[INFO] --- maven-dependency-plugin:2.8:unpack (unpack-win) @ jclouds-cli-assembly ---
[INFO] Configured Artifact: org.apache.karaf:apache-karaf:minimal:2.3.11:zip
[INFO] Unpacking /home/jenkins/.m2/repository/org/apache/karaf/apache-karaf/2.3.11/apache-karaf-2.3.11-minimal.zip to <https://jclouds.ci.cloudbees.com/job/jclouds-cli/ws/assembly/target/dependencies/win> with includes "" and excludes ""
[INFO] 
[INFO] --- maven-resources-plugin:2.4.2:resources (default-resources) @ jclouds-cli-assembly ---
[INFO] Using 'UTF-8' encoding to copy filtered resources.
[INFO] skip non existing resourceDirectory <https://jclouds.ci.cloudbees.com/job/jclouds-cli/ws/assembly/src/main/resources>
[INFO] Copying 13 resources
[INFO] Copying 3 resources
[INFO] 
[INFO] --- maven-compiler-plugin:3.1:compile (default-compile) @ jclouds-cli-assembly ---
[INFO] No sources to compile
[INFO] 
[INFO] --- maven-enforcer-plugin:1.1.1:enforce (enforce-banned-dependencies) @ jclouds-cli-assembly ---
[INFO] 
[INFO] --- maven-enforcer-plugin:1.1.1:enforce (enforce-java) @ jclouds-cli-assembly ---
[INFO] 
[INFO] --- maven-remote-resources-plugin:1.5:process (default) @ jclouds-cli-assembly ---
[INFO] 
[INFO] --- maven-resources-plugin:2.4.2:resources (filter) @ jclouds-cli-assembly ---
[INFO] Using 'UTF-8' encoding to copy filtered resources.
[INFO] skip non existing resourceDirectory <https://jclouds.ci.cloudbees.com/job/jclouds-cli/ws/assembly/src/main/resources>
[INFO] Copying 13 resources
[INFO] Copying 3 resources
[INFO] Copying 3 resources
[INFO] 
[INFO] --- maven-dependency-plugin:2.8:unpack (unpack-unix) @ jclouds-cli-assembly ---
[INFO] Configured Artifact: org.apache.karaf:apache-karaf:minimal:2.3.11:tar.gz
[INFO] apache-karaf-2.3.11-minimal.tar.gz already unpacked.
[INFO] 
[INFO] --- maven-dependency-plugin:2.8:unpack (unpack-win) @ jclouds-cli-assembly ---
[INFO] Configured Artifact: org.apache.karaf:apache-karaf:minimal:2.3.11:zip
[INFO] apache-karaf-2.3.11-minimal.zip already unpacked.
[INFO] 
[INFO] --- maven-resources-plugin:2.4.2:resources (default-resources) @ jclouds-cli-assembly ---
[INFO] Using 'UTF-8' encoding to copy filtered resources.
[INFO] skip non existing resourceDirectory <https://jclouds.ci.cloudbees.com/job/jclouds-cli/ws/assembly/src/main/resources>
[INFO] Copying 13 resources
[INFO] Copying 3 resources
[INFO] Copying 3 resources
[INFO] 
[INFO] --- maven-compiler-plugin:3.1:compile (default-compile) @ jclouds-cli-assembly ---
[INFO] No sources to compile
[WARNING] Failed to getClass for org.apache.karaf.tooling.features.AddFeaturesToRepoMojo
[INFO] 
[INFO] --- features-maven-plugin:2.3.11:add-features-to-repo (add-features-to-repo) @ jclouds-cli-assembly ---
[INFO] Copying bundle: org.apache.karaf.assemblies.features:standard:xml:features:2.3.11
[INFO] Copying bundle: org.apache.karaf.assemblies.features:enterprise:xml:features:2.3.11
[INFO] Copying bundle: org.apache.karaf.assemblies.features:enterprise:xml:features:2.3.11
[INFO] Copying bundle: org.ops4j.pax.cdi:pax-cdi-features:xml:features:0.8.0
[INFO] Copying bundle: org.apache.karaf.assemblies.features:standard:xml:features:2.3.11
[INFO] Copying bundle: org.apache.karaf.assemblies.features:standard:xml:features:2.3.11
[INFO] Copying bundle: org.apache.jclouds.karaf:jclouds-karaf:xml:features:2.1.0-SNAPSHOT
Downloading: http://repository.apache.org/snapshots/org/apache/jclouds/karaf/jclouds-karaf/2.1.0-SNAPSHOT/maven-metadata.xml
Downloading: https://repository-jclouds.forge.cloudbees.com/snapshot/org/apache/jclouds/karaf/jclouds-karaf/2.1.0-SNAPSHOT/maven-metadata.xml
Downloading: https://repository.apache.org/content/repositories/snapshots/org/apache/jclouds/karaf/jclouds-karaf/2.1.0-SNAPSHOT/maven-metadata.xml
Downloaded: https://repository.apache.org/content/repositories/snapshots/org/apache/jclouds/karaf/jclouds-karaf/2.1.0-SNAPSHOT/maven-metadata.xml (832 B at 15.6 KB/sec)
Downloaded: http://repository.apache.org/snapshots/org/apache/jclouds/karaf/jclouds-karaf/2.1.0-SNAPSHOT/maven-metadata.xml (832 B at 13.5 KB/sec)
Started calculate disk usage of build
Finished Calculation of disk usage of build in 0 seconds
Started calculate disk usage of workspace
Finished Calculation of disk usage of workspace in 0 seconds
[INFO] ------------------------------------------------------------------------
[INFO] Reactor Summary:
[INFO] 
[INFO] Apache jclouds :: cli ............................. SUCCESS [7.947s]
[INFO] jclouds :: cli :: branding ........................ SUCCESS [3.757s]
[INFO] jclouds :: cli :: runner .......................... SUCCESS [25.948s]
[INFO] jclouds :: cli :: assembly ........................ FAILURE [8.197s]
[INFO] Apache jclouds :: cli ............................. SKIPPED
[INFO] ------------------------------------------------------------------------
[INFO] BUILD FAILURE
[INFO] ------------------------------------------------------------------------
[INFO] Total time: 48.605s
[INFO] Finished at: Mon Mar 20 12:00:59 EDT 2017
[INFO] Final Memory: 50M/210M
[INFO] ------------------------------------------------------------------------
Waiting for Jenkins to finish collecting data
[ERROR] Failed to execute goal org.apache.karaf.tooling:features-maven-plugin:2.3.11:add-features-to-repo (add-features-to-repo) on project jclouds-cli-assembly: Error populating repository: Unable to find the feature 'jclouds-api-cloudsigma2' -> [Help 1]
org.apache.maven.lifecycle.LifecycleExecutionException: Failed to execute goal org.apache.karaf.tooling:features-maven-plugin:2.3.11:add-features-to-repo (add-features-to-repo) on project jclouds-cli-assembly: Error populating repository
	at org.apache.maven.lifecycle.internal.MojoExecutor.execute(MojoExecutor.java:217)
	at org.apache.maven.lifecycle.internal.MojoExecutor.execute(MojoExecutor.java:153)
	at org.apache.maven.lifecycle.internal.MojoExecutor.execute(MojoExecutor.java:145)
	at org.apache.maven.lifecycle.internal.LifecycleModuleBuilder.buildProject(LifecycleModuleBuilder.java:84)
	at org.apache.maven.lifecycle.internal.LifecycleModuleBuilder.buildProject(LifecycleModuleBuilder.java:59)
	at org.apache.maven.lifecycle.internal.LifecycleStarter.singleThreadedBuild(LifecycleStarter.java:183)
	at org.apache.maven.lifecycle.internal.LifecycleStarter.execute(LifecycleStarter.java:161)
	at org.apache.maven.DefaultMaven.doExecute(DefaultMaven.java:320)
	at org.apache.maven.DefaultMaven.execute(DefaultMaven.java:156)
	at org.jvnet.hudson.maven3.launcher.Maven3Launcher.main(Maven3Launcher.java:117)
	at sun.reflect.NativeMethodAccessorImpl.invoke0(Native Method)
	at sun.reflect.NativeMethodAccessorImpl.invoke(NativeMethodAccessorImpl.java:57)
	at sun.reflect.DelegatingMethodAccessorImpl.invoke(DelegatingMethodAccessorImpl.java:43)
	at java.lang.reflect.Method.invoke(Method.java:606)
	at org.codehaus.plexus.classworlds.launcher.Launcher.launchStandard(Launcher.java:329)
	at org.codehaus.plexus.classworlds.launcher.Launcher.launch(Launcher.java:239)
	at org.jvnet.hudson.maven3.agent.Maven3Main.launch(Maven3Main.java:181)
	at sun.reflect.NativeMethodAccessorImpl.invoke0(Native Method)
	at sun.reflect.NativeMethodAccessorImpl.invoke(NativeMethodAccessorImpl.java:57)
	at sun.reflect.DelegatingMethodAccessorImpl.invoke(DelegatingMethodAccessorImpl.java:43)
	at java.lang.reflect.Method.invoke(Method.java:606)
	at hudson.maven.Maven3Builder.call(Maven3Builder.java:139)
	at hudson.maven.Maven3Builder.call(Maven3Builder.java:70)
	at hudson.remoting.UserRequest.perform(UserRequest.java:153)
	at hudson.remoting.UserRequest.perform(UserRequest.java:50)
	at hudson.remoting.Request$2.run(Request.java:336)
	at hudson.remoting.InterceptingExecutorService$1.call(InterceptingExecutorService.java:68)
	at java.util.concurrent.FutureTask.run(FutureTask.java:262)
	at java.util.concurrent.ThreadPoolExecutor.runWorker(ThreadPoolExecutor.java:1145)
	at java.util.concurrent.ThreadPoolExecutor$Worker.run(ThreadPoolExecutor.java:615)
	at java.lang.Thread.run(Thread.java:745)
Caused by: org.apache.maven.plugin.MojoExecutionException: Error populating repository
	at org.apache.karaf.tooling.features.AddFeaturesToRepoMojo.execute(AddFeaturesToRepoMojo.java:226)
	at org.apache.maven.plugin.DefaultBuildPluginManager.executeMojo(DefaultBuildPluginManager.java:101)
	at org.apache.maven.lifecycle.internal.MojoExecutor.execute(MojoExecutor.java:209)
	... 30 more
Caused by: java.lang.IllegalArgumentException: Unable to find the feature 'jclouds-api-cloudsigma2'
	at org.apache.karaf.tooling.features.AddFeaturesToRepoMojo.addFeatures(AddFeaturesToRepoMojo.java:328)
	at org.apache.karaf.tooling.features.AddFeaturesToRepoMojo.execute(AddFeaturesToRepoMojo.java:165)
	... 32 more
[ERROR] 
[ERROR] Re-run Maven using the -X switch to enable full debug logging.
[ERROR] 
[ERROR] For more information about the errors and possible solutions, please read the following articles:
[ERROR] [Help 1] http://cwiki.apache.org/confluence/display/MAVEN/MojoExecutionException
[ERROR] 
[ERROR] After correcting the problems, you can resume the build with the command
[ERROR]   mvn <goals> -rf :jclouds-cli-assembly
[JENKINS] Archiving <https://jclouds.ci.cloudbees.com/job/jclouds-cli/ws/branding/pom.xml> to org.apache.jclouds.cli/jclouds-cli-branding/2.1.0-SNAPSHOT/jclouds-cli-branding-2.1.0-SNAPSHOT.pom
[JENKINS] Archiving <https://jclouds.ci.cloudbees.com/job/jclouds-cli/ws/branding/target/jclouds-cli-branding-2.1.0-SNAPSHOT.jar> to org.apache.jclouds.cli/jclouds-cli-branding/2.1.0-20170320.160023-61/jclouds-cli-branding-2.1.0-20170320.160023-61.jar
[JENKINS] Archiving <https://jclouds.ci.cloudbees.com/job/jclouds-cli/ws/branding/target/jclouds-cli-branding-2.1.0-SNAPSHOT-tests.jar> to org.apache.jclouds.cli/jclouds-cli-branding/2.1.0-20170320.160023-61/jclouds-cli-branding-2.1.0-20170320.160023-61-tests.jar
[JENKINS] Archiving <https://jclouds.ci.cloudbees.com/job/jclouds-cli/ws/branding/target/jclouds-cli-branding-2.1.0-SNAPSHOT-sources.jar> to org.apache.jclouds.cli/jclouds-cli-branding/2.1.0-20170320.160023-61/jclouds-cli-branding-2.1.0-20170320.160023-61-sources.jar
[JENKINS] Archiving <https://jclouds.ci.cloudbees.com/job/jclouds-cli/ws/assembly/pom.xml> to org.apache.jclouds.cli/jclouds-cli-assembly/2.1.0-SNAPSHOT/jclouds-cli-assembly-2.1.0-SNAPSHOT.pom
[JENKINS] Archiving <https://jclouds.ci.cloudbees.com/job/jclouds-cli/ws/pom.xml> to org.apache.jclouds.cli/jclouds-cli/2.1.0-SNAPSHOT/jclouds-cli-2.1.0-SNAPSHOT.pom
[JENKINS] Archiving <https://jclouds.ci.cloudbees.com/job/jclouds-cli/ws/runner/pom.xml> to org.apache.jclouds.cli/jclouds-cli-runner/2.1.0-SNAPSHOT/jclouds-cli-runner-2.1.0-SNAPSHOT.pom
[JENKINS] Archiving <https://jclouds.ci.cloudbees.com/job/jclouds-cli/ws/runner/target/jclouds-cli-runner-2.1.0-SNAPSHOT.jar> to org.apache.jclouds.cli/jclouds-cli-runner/2.1.0-20170320.160049-60/jclouds-cli-runner-2.1.0-20170320.160049-60.jar
[JENKINS] Archiving <https://jclouds.ci.cloudbees.com/job/jclouds-cli/ws/runner/target/jclouds-cli-runner-2.1.0-SNAPSHOT-tests.jar> to org.apache.jclouds.cli/jclouds-cli-runner/2.1.0-20170320.160049-60/jclouds-cli-runner-2.1.0-20170320.160049-60-tests.jar
[JENKINS] Archiving <https://jclouds.ci.cloudbees.com/job/jclouds-cli/ws/runner/target/jclouds-cli-runner-2.1.0-SNAPSHOT-javadoc.jar> to org.apache.jclouds.cli/jclouds-cli-runner/2.1.0-20170320.160049-60/jclouds-cli-runner-2.1.0-20170320.160049-60-javadoc.jar
[JENKINS] Archiving <https://jclouds.ci.cloudbees.com/job/jclouds-cli/ws/runner/target/jclouds-cli-runner-2.1.0-SNAPSHOT-sources.jar> to org.apache.jclouds.cli/jclouds-cli-runner/2.1.0-20170320.160049-60/jclouds-cli-runner-2.1.0-20170320.160049-60-sources.jar
[JENKINS] Archiving <https://jclouds.ci.cloudbees.com/job/jclouds-cli/ws/project/pom.xml> to org.apache.jclouds.cli/jclouds-cli-project/2.1.0-SNAPSHOT/jclouds-cli-project-2.1.0-SNAPSHOT.pom
[JENKINS] Archiving <https://jclouds.ci.cloudbees.com/job/jclouds-cli/ws/project/target/jclouds-cli-project-2.1.0-SNAPSHOT-tests.jar> to org.apache.jclouds.cli/jclouds-cli-project/2.1.0-20170320.160019-61/jclouds-cli-project-2.1.0-20170320.160019-61-tests.jar
channel stopped
Started calculate disk usage of build
Finished Calculation of disk usage of build in 0 seconds
Started calculate disk usage of workspace
Finished Calculation of disk usage of workspace in 0 seconds

Build failed in Jenkins: jclouds-cli #1305

Posted by je...@cloudbees.com.
https://jclouds.ci.cloudbees.com/job/jclouds-cli/1305/------------------------------------------
Started by upstream project "jclouds-karaf" build number 2124
originally caused by:
 Started by an SCM change
Building remotely on 19783b04 (standard m1.large lxc-fedora17 large) in workspace <https://jclouds.ci.cloudbees.com/job/jclouds-cli/ws/>
$ sudo /opt/jenkins/sbin/mount-webdav https://repository-jclouds.forge.cloudbees.com/private jclouds alert
webdav mount try 1
Private webdav filestore is mounted
Cloning the remote Git repository
Cloning repository https://git-wip-us.apache.org/repos/asf/jclouds-cli.git
 > git init <https://jclouds.ci.cloudbees.com/job/jclouds-cli/ws/> # timeout=10
Fetching upstream changes from https://git-wip-us.apache.org/repos/asf/jclouds-cli.git
 > git --version # timeout=10
 > git -c core.askpass=true fetch --tags --progress https://git-wip-us.apache.org/repos/asf/jclouds-cli.git +refs/heads/*:refs/remotes/origin/*
 > git config remote.origin.url https://git-wip-us.apache.org/repos/asf/jclouds-cli.git # timeout=10
 > git config --add remote.origin.fetch +refs/heads/*:refs/remotes/origin/* # timeout=10
 > git config remote.origin.url https://git-wip-us.apache.org/repos/asf/jclouds-cli.git # timeout=10
Fetching upstream changes from https://git-wip-us.apache.org/repos/asf/jclouds-cli.git
 > git -c core.askpass=true fetch --tags --progress https://git-wip-us.apache.org/repos/asf/jclouds-cli.git +refs/heads/*:refs/remotes/origin/*
 > git rev-parse refs/remotes/origin/master^{commit} # timeout=10
 > git rev-parse refs/remotes/origin/origin/master^{commit} # timeout=10
Checking out Revision 1c3112e026f31eea606062657370cc6a412a27f0 (refs/remotes/origin/master)
 > git config core.sparsecheckout # timeout=10
 > git checkout -f 1c3112e026f31eea606062657370cc6a412a27f0
 > git rev-list 1c3112e026f31eea606062657370cc6a412a27f0 # timeout=10
 > git tag -a -f -m Jenkins Build #1305 jenkins-jclouds-cli-1305 # timeout=10
Parsing POMs
Failed to transfer Could not find metadata org.apache.jclouds:jclouds-project:2.1.0-SNAPSHOT/maven-metadata.xml in cloudbees-private-snapshot-repository (https://repository-jclouds.forge.cloudbees.com/snapshot)
Failed to transfer Could not find metadata org.apache.jclouds:jclouds-project:2.1.0-SNAPSHOT/maven-metadata.xml in sonatype (https://oss.sonatype.org/content/repositories/releases/)
Failed to transfer Could not find metadata org.apache.jclouds:jclouds-project:2.1.0-SNAPSHOT/maven-metadata.xml in maven2-repository.dev.java.net (http://download.java.net/maven/2/)
Failed to transfer Could not transfer metadata org.apache.jclouds:jclouds-project:2.1.0-SNAPSHOT/maven-metadata.xml from/to apache-snapshots (https://repository.apache.org/content/repositories/snapshots): Connection timed out
Failed to transfer Could not find artifact org.apache.jclouds:jclouds-project:pom:2.1.0-SNAPSHOT in cloudbees-private-snapshot-repository (https://repository-jclouds.forge.cloudbees.com/snapshot)
Failed to transfer Could not find artifact org.apache.jclouds:jclouds-project:pom:2.1.0-SNAPSHOT in apache-snapshots (https://repository.apache.org/content/repositories/snapshots)
Failed to transfer Could not find artifact org.apache.jclouds:jclouds-project:pom:2.1.0-SNAPSHOT in sonatype (https://oss.sonatype.org/content/repositories/releases/)
Failed to transfer Could not find artifact org.apache.jclouds:jclouds-project:pom:2.1.0-SNAPSHOT in maven2-repository.dev.java.net (http://download.java.net/maven/2/)
ERROR: Failed to parse POMs
java.io.IOException: remote file operation failed: <https://jclouds.ci.cloudbees.com/job/jclouds-cli/ws/> at hudson.remoting.Channel@18a5cf50:19783b04: hudson.remoting.ProxyException: hudson.maven.MavenModuleSetBuild$MavenExecutionException: org.apache.maven.project.ProjectBuildingException: Some problems were encountered while processing the POMs:
[FATAL] Non-resolvable parent POM for org.apache.jclouds.cli:jclouds-cli-project:2.1.0-SNAPSHOT: Could not find artifact org.apache.jclouds:jclouds-project:pom:2.1.0-SNAPSHOT in cloudbees-private-snapshot-repository (https://repository-jclouds.forge.cloudbees.com/snapshot) and 'parent.relativePath' points at no local POM @ org.apache.jclouds.cli:jclouds-cli-project:2.1.0-SNAPSHOT, <https://jclouds.ci.cloudbees.com/job/jclouds-cli/ws/project/pom.xml,> line 23, column 11

	at hudson.FilePath.act(FilePath.java:992)
	at hudson.FilePath.act(FilePath.java:974)
	at hudson.maven.MavenModuleSetBuild$MavenModuleSetBuildExecution.parsePoms(MavenModuleSetBuild.java:980)
	at hudson.maven.MavenModuleSetBuild$MavenModuleSetBuildExecution.doRun(MavenModuleSetBuild.java:692)
	at hudson.model.AbstractBuild$AbstractBuildExecution.run(AbstractBuild.java:544)
	at hudson.model.Run.execute(Run.java:1728)
	at hudson.maven.MavenModuleSetBuild.run(MavenModuleSetBuild.java:544)
	at hudson.model.ResourceController.execute(ResourceController.java:98)
	at hudson.model.Executor.run(Executor.java:404)
Caused by: hudson.remoting.ProxyException: hudson.maven.MavenModuleSetBuild$MavenExecutionException: org.apache.maven.project.ProjectBuildingException: Some problems were encountered while processing the POMs:
[FATAL] Non-resolvable parent POM for org.apache.jclouds.cli:jclouds-cli-project:2.1.0-SNAPSHOT: Could not find artifact org.apache.jclouds:jclouds-project:pom:2.1.0-SNAPSHOT in cloudbees-private-snapshot-repository (https://repository-jclouds.forge.cloudbees.com/snapshot) and 'parent.relativePath' points at no local POM @ org.apache.jclouds.cli:jclouds-cli-project:2.1.0-SNAPSHOT, <https://jclouds.ci.cloudbees.com/job/jclouds-cli/ws/project/pom.xml,> line 23, column 11

	at hudson.maven.MavenModuleSetBuild$PomParser.invoke(MavenModuleSetBuild.java:1384)
	at hudson.maven.MavenModuleSetBuild$PomParser.invoke(MavenModuleSetBuild.java:1118)
	at hudson.FilePath$FileCallableWrapper.call(FilePath.java:2731)
	at hudson.remoting.UserRequest.perform(UserRequest.java:153)
	at hudson.remoting.UserRequest.perform(UserRequest.java:50)
	at hudson.remoting.Request$2.run(Request.java:336)
	at hudson.remoting.InterceptingExecutorService$1.call(InterceptingExecutorService.java:68)
	at java.util.concurrent.FutureTask.run(FutureTask.java:262)
	at java.util.concurrent.ThreadPoolExecutor.runWorker(ThreadPoolExecutor.java:1145)
	at java.util.concurrent.ThreadPoolExecutor$Worker.run(ThreadPoolExecutor.java:615)
	at java.lang.Thread.run(Thread.java:745)
	at ......remote call to 19783b04(Native Method)
	at hudson.remoting.Channel.attachCallSiteStackTrace(Channel.java:1537)
	at hudson.remoting.UserResponse.retrieve(UserRequest.java:253)
	at hudson.remoting.Channel.call(Channel.java:822)
	at hudson.FilePath.act(FilePath.java:985)
	... 8 more
Caused by: hudson.remoting.ProxyException: org.apache.maven.project.ProjectBuildingException: Some problems were encountered while processing the POMs:
[FATAL] Non-resolvable parent POM for org.apache.jclouds.cli:jclouds-cli-project:2.1.0-SNAPSHOT: Could not find artifact org.apache.jclouds:jclouds-project:pom:2.1.0-SNAPSHOT in cloudbees-private-snapshot-repository (https://repository-jclouds.forge.cloudbees.com/snapshot) and 'parent.relativePath' points at no local POM @ org.apache.jclouds.cli:jclouds-cli-project:2.1.0-SNAPSHOT, <https://jclouds.ci.cloudbees.com/job/jclouds-cli/ws/project/pom.xml,> line 23, column 11

	at org.apache.maven.project.DefaultProjectBuilder.build(DefaultProjectBuilder.java:364)
	at hudson.maven.MavenEmbedder.buildProjects(MavenEmbedder.java:361)
	at hudson.maven.MavenEmbedder.readProjects(MavenEmbedder.java:331)
	at hudson.maven.MavenModuleSetBuild$PomParser.invoke(MavenModuleSetBuild.java:1321)
	at hudson.maven.MavenModuleSetBuild$PomParser.invoke(MavenModuleSetBuild.java:1118)
	at hudson.FilePath$FileCallableWrapper.call(FilePath.java:2731)
	at hudson.remoting.UserRequest.perform(UserRequest.java:153)
	at hudson.remoting.UserRequest.perform(UserRequest.java:50)
	at hudson.remoting.Request$2.run(Request.java:336)
	at hudson.remoting.InterceptingExecutorService$1.call(InterceptingExecutorService.java:68)
	at java.util.concurrent.FutureTask.run(FutureTask.java:262)
	at java.util.concurrent.ThreadPoolExecutor.runWorker(ThreadPoolExecutor.java:1145)
	at java.util.concurrent.ThreadPoolExecutor$Worker.run(ThreadPoolExecutor.java:615)
	at java.lang.Thread.run(Thread.java:745)
Started calculate disk usage of build
Finished Calculation of disk usage of build in 0 seconds
Started calculate disk usage of workspace
Finished Calculation of disk usage of workspace in 0 seconds