You are viewing a plain text version of this content. The canonical link for it is here.
Posted to notifications@directory.apache.org by Apache Jenkins Server <je...@builds.apache.org> on 2012/03/31 06:06:20 UTC

Build failed in Jenkins: dir-apacheds-jdk16-win #85

See <https://builds.apache.org/job/dir-apacheds-jdk16-win/85/>

------------------------------------------
[...truncated 1603 lines...]
[INFO] 
[INFO] --- maven-bundle-plugin:2.3.7:bundle (default-bundle) @ apacheds-core ---
[INFO] 
[INFO] --- maven-site-plugin:3.0:attach-descriptor (attach-descriptor) @ apacheds-core ---
[INFO] [INFO] Checking legal files in: apacheds-core-2.0.0-M7-SNAPSHOT.jar

[INFO] --- tools-maven-plugin:1.4:verify-legal-files (verify-legal-files) @ apacheds-core ---
Mar 31, 2012 5:06:08 AM hudson.maven.ExecutedMojo <init>
WARNING: Failed to getClass for org.apache.maven.plugin.source.SourceJarMojo
[INFO] 
[INFO] --- maven-source-plugin:2.1.2:jar (attach-sources) @ apacheds-core ---
[INFO] META-INF already added, skipping
[INFO] org already added, skipping
[INFO] org\apache already added, skipping
[INFO] org\apache\directory already added, skipping
[INFO] org\apache\directory\server already added, skipping
[INFO] org\apache\directory\server\core already added, skipping
[INFO] META-INF already added, skipping
[INFO] META-INF\DEPENDENCIES already added, skipping
[INFO] META-INF\LICENSE already added, skipping
[INFO] META-INF\NOTICE already added, skipping
[INFO] Building jar: F:\hudson\hudson-slave\workspace\dir-apacheds-jdk16-win\trunk\core\target\apacheds-core-2.0.0-M7-SNAPSHOT-sources.jar
[INFO] META-INF already added, skipping
[INFO] org already added, skipping
[INFO] org\apache already added, skipping
[INFO] org\apache\directory already added, skipping
[INFO] org\apache\directory\server already added, skipping
[INFO] org\apache\directory\server\core already added, skipping
[INFO] META-INF already added, skipping
[INFO] META-INF\DEPENDENCIES already added, skipping
[INFO] META-INF\LICENSE already added, skipping
[INFO] META-INF\NOTICE already added, skipping
[INFO] Installing F:\hudson\hudson-slave\workspace\dir-apacheds-jdk16-win\trunk\core\target\apacheds-core-2.0.0-M7-SNAPSHOT.jar to f:\hudson\hudson-slave\maven-repositories\0\org\apache\directory\server\apacheds-core\2.0.0-M7-SNAPSHOT\apacheds-core-2.0.0-M7-SNAPSHOT.jar
[INFO] 
[INFO] --- maven-install-plugin:2.3.1:install (default-install) @ apacheds-core ---
[INFO] Installing F:\hudson\hudson-slave\workspace\dir-apacheds-jdk16-win\trunk\core\pom.xml to f:\hudson\hudson-slave\maven-repositories\0\org\apache\directory\server\apacheds-core\2.0.0-M7-SNAPSHOT\apacheds-core-2.0.0-M7-SNAPSHOT.pom
[INFO] Installing F:\hudson\hudson-slave\workspace\dir-apacheds-jdk16-win\trunk\core\target\apacheds-core-2.0.0-M7-SNAPSHOT-sources.jar to f:\hudson\hudson-slave\maven-repositories\0\org\apache\directory\server\apacheds-core\2.0.0-M7-SNAPSHOT\apacheds-core-2.0.0-M7-SNAPSHOT-sources.jar
[INFO] 
[INFO] --- maven-bundle-plugin:2.3.7:install (default-install) @ apacheds-core ---
[INFO] Installing org/apache/directory/server/apacheds-core/2.0.0-M7-SNAPSHOT/apacheds-core-2.0.0-M7-SNAPSHOT.jar
[INFO] Writing OBR metadata
[JENKINS] Archiving disabled - not archiving F:\hudson\hudson-slave\workspace\dir-apacheds-jdk16-win\trunk\core\pom.xml
[JENKINS] Archiving disabled - not archiving F:\hudson\hudson-slave\workspace\dir-apacheds-jdk16-win\trunk\core\target\apacheds-core-2.0.0-M7-SNAPSHOT.jar
[JENKINS] Archiving disabled - not archiving F:\hudson\hudson-slave\workspace\dir-apacheds-jdk16-win\trunk\core\target\apacheds-core-2.0.0-M7-SNAPSHOT-sources.jar
[INFO]                                                                         
[INFO] ------------------------------------------------------------------------
[INFO] Building ApacheDS Core AVL 2.0.0-M7-SNAPSHOT
[INFO] ------------------------------------------------------------------------
[INFO] Deleting F:\hudson\hudson-slave\workspace\dir-apacheds-jdk16-win\trunk\core-avl\target
[INFO] 
[INFO] --- maven-clean-plugin:2.4.1:clean (default-clean) @ apacheds-core-avl ---
[INFO] 
[INFO] --- maven-remote-resources-plugin:1.2.1:process (default) @ apacheds-core-avl ---
[debug] execute contextualize
[INFO] [INFO] Using 'UTF-8' encoding to copy filtered resources.
[INFO] skip non existing resourceDirectory F:\hudson\hudson-slave\workspace\dir-apacheds-jdk16-win\trunk\core-avl\src\main\resources
[INFO] Copying 3 resources

[INFO] --- maven-resources-plugin:2.5:resources (default-resources) @ apacheds-core-avl ---
[INFO] 
[INFO] --- maven-compiler-plugin:2.3.2:compile (default-compile) @ apacheds-core-avl ---
[INFO] Compiling 22 source files to F:\hudson\hudson-slave\workspace\dir-apacheds-jdk16-win\trunk\core-avl\target\classes
[INFO] -------------------------------------------------------------
[ERROR] COMPILATION ERROR : 
[INFO] -------------------------------------------------------------
[ERROR] \hudson\hudson-slave\workspace\dir-apacheds-jdk16-win\trunk\core-avl\src\main\java\org\apache\directory\server\core\avltree\AvlTreeMapNoDupsWrapperCursor.java:[23,52] cannot find symbol
symbol  : class AbstractTupleCursor
location: package org.apache.directory.shared.ldap.model.cursor
[ERROR] \hudson\hudson-slave\workspace\dir-apacheds-jdk16-win\trunk\core-avl\src\main\java\org\apache\directory\server\core\avltree\AvlTreeMapNoDupsWrapperCursor.java:[35,57] cannot find symbol
symbol: class AbstractTupleCursor
public class AvlTreeMapNoDupsWrapperCursor<K, V> extends AbstractTupleCursor<K, V>
[ERROR] \hudson\hudson-slave\workspace\dir-apacheds-jdk16-win\trunk\core-avl\src\main\java\org\apache\directory\server\core\avltree\AvlTreeMapNoDupsWrapperCursor.java:[35,76] a generic class may not extend java.lang.Throwable
[ERROR] \hudson\hudson-slave\workspace\dir-apacheds-jdk16-win\trunk\core-avl\src\main\java\org\apache\directory\server\core\avltree\AvlSingletonOrOrderedSetCursor.java:[25,52] cannot find symbol
symbol  : class AbstractTupleCursor
location: package org.apache.directory.shared.ldap.model.cursor
[ERROR] \hudson\hudson-slave\workspace\dir-apacheds-jdk16-win\trunk\core-avl\src\main\java\org\apache\directory\server\core\avltree\AvlSingletonOrOrderedSetCursor.java:[35,58] cannot find symbol
symbol: class AbstractTupleCursor
public class AvlSingletonOrOrderedSetCursor<K, V> extends AbstractTupleCursor<K, SingletonOrOrderedSet<V>>
[ERROR] \hudson\hudson-slave\workspace\dir-apacheds-jdk16-win\trunk\core-avl\src\main\java\org\apache\directory\server\core\avltree\AvlSingletonOrOrderedSetCursor.java:[35,77] a generic class may not extend java.lang.Throwable
[ERROR] \hudson\hudson-slave\workspace\dir-apacheds-jdk16-win\trunk\core-avl\src\main\java\org\apache\directory\server\core\avltree\KeyTupleAvlCursor.java:[23,52] cannot find symbol
symbol  : class AbstractTupleCursor
location: package org.apache.directory.shared.ldap.model.cursor
[ERROR] \hudson\hudson-slave\workspace\dir-apacheds-jdk16-win\trunk\core-avl\src\main\java\org\apache\directory\server\core\avltree\KeyTupleAvlCursor.java:[35,45] cannot find symbol
symbol: class AbstractTupleCursor
public class KeyTupleAvlCursor<K, V> extends AbstractTupleCursor<K, V>
[ERROR] \hudson\hudson-slave\workspace\dir-apacheds-jdk16-win\trunk\core-avl\src\main\java\org\apache\directory\server\core\avltree\KeyTupleAvlCursor.java:[35,64] a generic class may not extend java.lang.Throwable
[ERROR] \hudson\hudson-slave\workspace\dir-apacheds-jdk16-win\trunk\core-avl\src\main\java\org\apache\directory\server\core\avltree\AvlSingletonOrOrderedSetCursor.java:[75,8] cannot find symbol
symbol  : method checkNotClosed(java.lang.String)
location: class org.apache.directory.server.core.avltree.AvlSingletonOrOrderedSetCursor<K,V>
[ERROR] \hudson\hudson-slave\workspace\dir-apacheds-jdk16-win\trunk\core-avl\src\main\java\org\apache\directory\server\core\avltree\AvlSingletonOrOrderedSetCursor.java:[95,8] cannot find symbol
symbol  : method checkNotClosed(java.lang.String)
location: class org.apache.directory.server.core.avltree.AvlSingletonOrOrderedSetCursor<K,V>
[ERROR] \hudson\hudson-slave\workspace\dir-apacheds-jdk16-win\trunk\core-avl\src\main\java\org\apache\directory\server\core\avltree\AvlSingletonOrOrderedSetCursor.java:[103,8] cannot find symbol
symbol  : method checkNotClosed(java.lang.String)
location: class org.apache.directory.server.core.avltree.AvlSingletonOrOrderedSetCursor<K,V>
[ERROR] \hudson\hudson-slave\workspace\dir-apacheds-jdk16-win\trunk\core-avl\src\main\java\org\apache\directory\server\core\avltree\AvlSingletonOrOrderedSetCursor.java:[122,8] cannot find symbol
symbol  : method checkNotClosed(java.lang.String)
location: class org.apache.directory.server.core.avltree.AvlSingletonOrOrderedSetCursor<K,V>
[ERROR] \hudson\hudson-slave\workspace\dir-apacheds-jdk16-win\trunk\core-avl\src\main\java\org\apache\directory\server\core\avltree\AvlSingletonOrOrderedSetCursor.java:[137,8] cannot find symbol
symbol  : method checkNotClosed(java.lang.String)
location: class org.apache.directory.server.core.avltree.AvlSingletonOrOrderedSetCursor<K,V>
[ERROR] \hudson\hudson-slave\workspace\dir-apacheds-jdk16-win\trunk\core-avl\src\main\java\org\apache\directory\server\core\avltree\AvlSingletonOrOrderedSetCursor.java:[156,8] cannot find symbol
symbol  : method checkNotClosed(java.lang.String)
location: class org.apache.directory.server.core.avltree.AvlSingletonOrOrderedSetCursor<K,V>
[ERROR] \hudson\hudson-slave\workspace\dir-apacheds-jdk16-win\trunk\core-avl\src\main\java\org\apache\directory\server\core\avltree\AvlSingletonOrOrderedSetCursor.java:[192,8] cannot find symbol
symbol  : method checkNotClosed(java.lang.String)
location: class org.apache.directory.server.core.avltree.AvlSingletonOrOrderedSetCursor<K,V>
[ERROR] \hudson\hudson-slave\workspace\dir-apacheds-jdk16-win\trunk\core-avl\src\main\java\org\apache\directory\server\core\avltree\AvlSingletonOrOrderedSetCursor.java:[228,8] cannot find symbol
symbol  : method checkNotClosed(java.lang.String)
location: class org.apache.directory.server.core.avltree.AvlSingletonOrOrderedSetCursor<K,V>
[ERROR] \hudson\hudson-slave\workspace\dir-apacheds-jdk16-win\trunk\core-avl\src\main\java\org\apache\directory\server\core\avltree\AvlSingletonOrOrderedSetCursor.java:[260,8] cannot find symbol
symbol  : method checkNotClosed(java.lang.String)
location: class org.apache.directory.server.core.avltree.AvlSingletonOrOrderedSetCursor<K,V>
[ERROR] \hudson\hudson-slave\workspace\dir-apacheds-jdk16-win\trunk\core-avl\src\main\java\org\apache\directory\server\core\avltree\KeyTupleAvlCursor.java:[85,8] cannot find symbol
symbol  : method checkNotClosed(java.lang.String)
location: class org.apache.directory.server.core.avltree.KeyTupleAvlCursor<K,V>
[ERROR] \hudson\hudson-slave\workspace\dir-apacheds-jdk16-win\trunk\core-avl\src\main\java\org\apache\directory\server\core\avltree\KeyTupleAvlCursor.java:[98,8] cannot find symbol
symbol  : method checkNotClosed(java.lang.String)
location: class org.apache.directory.server.core.avltree.KeyTupleAvlCursor<K,V>
[ERROR] \hudson\hudson-slave\workspace\dir-apacheds-jdk16-win\trunk\core-avl\src\main\java\org\apache\directory\server\core\avltree\KeyTupleAvlCursor.java:[119,8] cannot find symbol
symbol  : method checkNotClosed(java.lang.String)
location: class org.apache.directory.server.core.avltree.KeyTupleAvlCursor<K,V>
[ERROR] \hudson\hudson-slave\workspace\dir-apacheds-jdk16-win\trunk\core-avl\src\main\java\org\apache\directory\server\core\avltree\KeyTupleAvlCursor.java:[127,8] cannot find symbol
symbol  : method checkNotClosed(java.lang.String)
location: class org.apache.directory.server.core.avltree.KeyTupleAvlCursor<K,V>
[ERROR] \hudson\hudson-slave\workspace\dir-apacheds-jdk16-win\trunk\core-avl\src\main\java\org\apache\directory\server\core\avltree\KeyTupleAvlCursor.java:[135,8] cannot find symbol
symbol  : method checkNotClosed(java.lang.String)
location: class org.apache.directory.server.core.avltree.KeyTupleAvlCursor<K,V>
[ERROR] \hudson\hudson-slave\workspace\dir-apacheds-jdk16-win\trunk\core-avl\src\main\java\org\apache\directory\server\core\avltree\KeyTupleAvlCursor.java:[143,8] cannot find symbol
symbol  : method checkNotClosed(java.lang.String)
location: class org.apache.directory.server.core.avltree.KeyTupleAvlCursor<K,V>
[ERROR] \hudson\hudson-slave\workspace\dir-apacheds-jdk16-win\trunk\core-avl\src\main\java\org\apache\directory\server\core\avltree\KeyTupleAvlCursor.java:[165,8] cannot find symbol
symbol  : method checkNotClosed(java.lang.String)
location: class org.apache.directory.server.core.avltree.KeyTupleAvlCursor<K,V>
[ERROR] \hudson\hudson-slave\workspace\dir-apacheds-jdk16-win\trunk\core-avl\src\main\java\org\apache\directory\server\core\avltree\KeyTupleAvlCursor.java:[182,8] cannot find symbol
symbol  : method checkNotClosed(java.lang.String)
location: class org.apache.directory.server.core.avltree.KeyTupleAvlCursor<K,V>
[ERROR] \hudson\hudson-slave\workspace\dir-apacheds-jdk16-win\trunk\core-avl\src\main\java\org\apache\directory\server\core\avltree\KeyTupleAvlCursor.java:[199,8] cannot find symbol
symbol  : method checkNotClosed(java.lang.String)
location: class org.apache.directory.server.core.avltree.KeyTupleAvlCursor<K,V>
[INFO] 27 errors 
[INFO] -------------------------------------------------------------
[JENKINS] Archiving disabled - not archiving F:\hudson\hudson-slave\workspace\dir-apacheds-jdk16-win\trunk\core-avl\pom.xml
[INFO] ------------------------------------------------------------------------
[INFO] Reactor Summary:
[INFO] 
[INFO] ApacheDS .......................................... SUCCESS [7.984s]
[INFO] ApacheDS I18n ..................................... SUCCESS [9.275s]
[INFO] ApacheDS Core Constants ........................... SUCCESS [4.347s]
[INFO] ApacheDS Core API ................................. SUCCESS [28.695s]
[INFO] ApacheDS Core Shared .............................. SUCCESS [4.075s]
[INFO] ApacheDS Interceptors ............................. SUCCESS [0.208s]
[INFO] ApacheDS AdministrativePoint Interceptor .......... SUCCESS [4.083s]
[INFO] ApacheDS Authentication Interceptor ............... SUCCESS [17.760s]
[INFO] ApacheDS Authorization Interceptor ................ SUCCESS [26.538s]
[INFO] ApacheDS ChangeLog Interceptor .................... SUCCESS [8.534s]
[INFO] ApacheDS Collective Attribute Interceptor ......... SUCCESS [1.858s]
[INFO] ApacheDS Event Interceptor ........................ SUCCESS [1.573s]
[INFO] ApacheDS Exception Interceptor .................... SUCCESS [1.748s]
[INFO] ApacheDS Journal Interceptor ...................... SUCCESS [1.675s]
[INFO] ApacheDS Normalization Interceptor ................ SUCCESS [26.396s]
[INFO] ApacheDS Operational Attribute Interceptor ........ SUCCESS [3.342s]
[INFO] ApacheDS Referral Interceptor ..................... SUCCESS [2.644s]
[INFO] ApacheDS Schema Interceptor ....................... SUCCESS [19.800s]
[INFO] ApacheDS Subtree Interceptor ...................... SUCCESS [22.763s]
[INFO] ApacheDS Triggers Interceptor ..................... SUCCESS [2.351s]
[INFO] ApacheDS Core ..................................... SUCCESS [6.147s]
[INFO] ApacheDS Core AVL ................................. FAILURE [1.484s]
[INFO] ApacheDS Generalized (X) DBM Partition ............ SKIPPED
[INFO] ApacheDS LDIF Partition ........................... SKIPPED
[INFO] ApacheDS JDBM Partition ........................... SKIPPED
[INFO] ApacheDS Core Annotations ......................... SKIPPED
[INFO] ApacheDS Core JNDI ................................ SKIPPED
[INFO] ApacheDS Protocol Shared .......................... SKIPPED
[INFO] ApacheDS Protocol Kerberos Codec .................. SKIPPED
[INFO] ApacheDS Interceptors for Kerberos ................ SKIPPED
[INFO] ApacheDS Protocol Dhcp ............................ SKIPPED
[INFO] ApacheDS Protocol Dns ............................. SKIPPED
[INFO] ApacheDS Protocol Kerberos ........................ SKIPPED
[INFO] ApacheDS Protocol Ldap ............................ SKIPPED
[INFO] ApacheDS Protocol Ntp ............................. SKIPPED
[INFO] Apacheds Server Annotations ....................... SKIPPED
[INFO] ApacheDS Server Config ............................ SKIPPED
[INFO] ApacheDS Server JNDI .............................. SKIPPED
[INFO] ApacheDS Server Replication Service ............... SKIPPED
[INFO] ApacheDS Test Framework ........................... SKIPPED
[INFO] ApacheDS Generalized (X) DBM Tools ................ SKIPPED
[INFO] ApacheDS All ...................................... SKIPPED
[INFO] ApacheDS Logger Interceptor ....................... SKIPPED
[INFO] ApacheDS Password Hashing Interceptor ............. SKIPPED
[INFO] ApacheDS Core Integration ......................... SKIPPED
[INFO] ApacheDS Server Integration ....................... SKIPPED
[INFO] ApacheDS DirectoryService-WebApp bridge ........... SKIPPED
[INFO] ApacheDS Jetty HTTP Server Integration ............ SKIPPED
[INFO] ApacheDS Service Builder .......................... SKIPPED
[INFO] ApacheDS Protocol Kerberos Test ................... SKIPPED
[INFO] Apache Directory LDAP Client API test ............. SKIPPED
[INFO] ApacheDS Service .................................. SKIPPED
[INFO] ApacheDS Wrapper .................................. SKIPPED
[INFO] ApacheDS Installers Maven Plugin .................. SKIPPED
[INFO] ApacheDS Installers ............................... SKIPPED
[INFO] ------------------------------------------------------------------------
[INFO] BUILD FAILURE
[INFO] ------------------------------------------------------------------------
[INFO] Total time: 3:33.720s
[INFO] Finished at: Sat Mar 31 05:06:10 BST 2012
[INFO] Final Memory: 167M/294M
[INFO] ------------------------------------------------------------------------
mavenExecutionResult exceptions not empty
message : Failed to execute goal org.apache.maven.plugins:maven-compiler-plugin:2.3.2:compile (default-compile) on project apacheds-core-avl: Compilation failure
cause : Compilation failure
Stack trace : 
org.apache.maven.lifecycle.LifecycleExecutionException: Failed to execute goal org.apache.maven.plugins:maven-compiler-plugin:2.3.2:compile (default-compile) on project apacheds-core-avl: Compilation failure
	at org.apache.maven.lifecycle.internal.MojoExecutor.execute(MojoExecutor.java:213)
	at org.apache.maven.lifecycle.internal.MojoExecutor.execute(MojoExecutor.java:153)
	at org.apache.maven.lifecycle.internal.MojoExecutor.execute(MojoExecutor.java:145)
	at org.apache.maven.lifecycle.internal.LifecycleModuleBuilder.buildProject(LifecycleModuleBuilder.java:84)
	at org.apache.maven.lifecycle.internal.LifecycleModuleBuilder.buildProject(LifecycleModuleBuilder.java:59)
	at org.apache.maven.lifecycle.internal.LifecycleStarter.singleThreadedBuild(LifecycleStarter.java:183)
	at org.apache.maven.lifecycle.internal.LifecycleStarter.execute(LifecycleStarter.java:161)
	at org.apache.maven.DefaultMaven.doExecute(DefaultMaven.java:319)
	at org.apache.maven.DefaultMaven.execute(DefaultMaven.java:156)
	at org.jvnet.hudson.maven3.launcher.Maven3Launcher.main(Maven3Launcher.java:79)
	at sun.reflect.NativeMethodAccessorImpl.invoke0(Native Method)
	at sun.reflect.NativeMethodAccessorImpl.invoke(NativeMethodAccessorImpl.java:39)
	at sun.reflect.DelegatingMethodAccessorImpl.invoke(DelegatingMethodAccessorImpl.java:25)
	at java.lang.reflect.Method.invoke(Method.java:597)
	at org.codehaus.plexus.classworlds.launcher.Launcher.launchStandard(Launcher.java:329)
	at org.codehaus.plexus.classworlds.launcher.Launcher.launch(Launcher.java:239)
	at org.jvnet.hudson.maven3.agent.Maven3Main.launch(Maven3Main.java:158)
	at hudson.maven.Maven3Builder.call(Maven3Builder.java:104)
	at hudson.maven.Maven3Builder.call(Maven3Builder.java:70)
	at hudson.remoting.UserRequest.perform(UserRequest.java:118)
	at hudson.remoting.UserRequest.perform(UserRequest.java:48)
	at hudson.remoting.Request$2.run(Request.java:287)
	at hudson.remoting.InterceptingExecutorService$1.call(InterceptingExecutorService.java:72)
	at java.util.concurrent.FutureTask$Sync.innerRun(FutureTask.java:303)
	at java.util.concurrent.FutureTask.run(FutureTask.java:138)
	at java.util.concurrent.ThreadPoolExecutor$Worker.runTask(ThreadPoolExecutor.java:886)
	at java.util.concurrent.ThreadPoolExecutor$Worker.run(ThreadPoolExecutor.java:908)
	at java.lang.Thread.run(Thread.java:662)
Caused by: org.apache.maven.plugin.CompilationFailureException: Compilation failure
	at org.apache.maven.plugin.AbstractCompilerMojo.execute(AbstractCompilerMojo.java:656)
	at org.apache.maven.plugin.CompilerMojo.execute(CompilerMojo.java:128)
	at org.apache.maven.plugin.DefaultBuildPluginManager.executeMojo(DefaultBuildPluginManager.java:107)
	at org.apache.maven.lifecycle.internal.MojoExecutor.execute(MojoExecutor.java:209)
	... 27 more
Sending e-mails to: notifications@directory.apache.org
channel stopped

Build failed in Jenkins: dir-apacheds-jdk16-win #87

Posted by Apache Jenkins Server <je...@builds.apache.org>.
See <https://builds.apache.org/job/dir-apacheds-jdk16-win/87/changes>

Changes:

[elecharny] o Fixed some compilation error
o Added a parameter for indexes to configure them to use the reverse table, or not

------------------------------------------
[...truncated 1279 lines...]

[INFO] --- maven-install-plugin:2.3.1:install (default-install) @ apacheds-interceptors-operational ---
[INFO] Installing F:\hudson\hudson-slave\workspace\dir-apacheds-jdk16-win\trunk\interceptors\operational\pom.xml to f:\hudson\hudson-slave\maven-repositories\0\org\apache\directory\server\apacheds-interceptors-operational\2.0.0-M7-SNAPSHOT\apacheds-interceptors-operational-2.0.0-M7-SNAPSHOT.pom
[INFO] Installing F:\hudson\hudson-slave\workspace\dir-apacheds-jdk16-win\trunk\interceptors\operational\target\apacheds-interceptors-operational-2.0.0-M7-SNAPSHOT-sources.jar to f:\hudson\hudson-slave\maven-repositories\0\org\apache\directory\server\apacheds-interceptors-operational\2.0.0-M7-SNAPSHOT\apacheds-interceptors-operational-2.0.0-M7-SNAPSHOT-sources.jar
[INFO] 
[INFO] --- maven-bundle-plugin:2.3.7:install (default-install) @ apacheds-interceptors-operational ---
[INFO] Installing org/apache/directory/server/apacheds-interceptors-operational/2.0.0-M7-SNAPSHOT/apacheds-interceptors-operational-2.0.0-M7-SNAPSHOT.jar
[INFO] Writing OBR metadata
[JENKINS] Archiving disabled - not archiving F:\hudson\hudson-slave\workspace\dir-apacheds-jdk16-win\trunk\interceptors\operational\pom.xml
[JENKINS] Archiving disabled - not archiving F:\hudson\hudson-slave\workspace\dir-apacheds-jdk16-win\trunk\interceptors\operational\target\apacheds-interceptors-operational-2.0.0-M7-SNAPSHOT.jar
[JENKINS] Archiving disabled - not archiving F:\hudson\hudson-slave\workspace\dir-apacheds-jdk16-win\trunk\interceptors\operational\target\apacheds-interceptors-operational-2.0.0-M7-SNAPSHOT-sources.jar
[INFO]                                                                         
[INFO] ------------------------------------------------------------------------
[INFO] Building ApacheDS Referral Interceptor 2.0.0-M7-SNAPSHOT
[INFO] ------------------------------------------------------------------------
[INFO] [INFO] Deleting F:\hudson\hudson-slave\workspace\dir-apacheds-jdk16-win\trunk\interceptors\referral\target

[INFO] --- maven-clean-plugin:2.4.1:clean (default-clean) @ apacheds-interceptors-referral ---
[INFO] 
[INFO] --- maven-remote-resources-plugin:1.2.1:process (default) @ apacheds-interceptors-referral ---
[debug] execute contextualize
[INFO] Using 'UTF-8' encoding to copy filtered resources.
[INFO] skip non existing resourceDirectory F:\hudson\hudson-slave\workspace\dir-apacheds-jdk16-win\trunk\interceptors\referral\src\main\resources
[INFO] Copying 3 resources
[INFO] 
[INFO] --- maven-resources-plugin:2.5:resources (default-resources) @ apacheds-interceptors-referral ---
[INFO] 
[INFO] --- maven-compiler-plugin:2.3.2:compile (default-compile) @ apacheds-interceptors-referral ---
[INFO] Compiling 1 source file to F:\hudson\hudson-slave\workspace\dir-apacheds-jdk16-win\trunk\interceptors\referral\target\classes
[debug] execute contextualize
[INFO] Using 'UTF-8' encoding to copy filtered resources.
[INFO] [INFO] skip non existing resourceDirectory F:\hudson\hudson-slave\workspace\dir-apacheds-jdk16-win\trunk\interceptors\referral\src\test\resources
[INFO] Copying 3 resources

[INFO] --- maven-resources-plugin:2.5:testResources (default-testResources) @ apacheds-interceptors-referral ---
[INFO] 
[INFO] --- maven-compiler-plugin:2.3.2:testCompile (default-testCompile) @ apacheds-interceptors-referral ---
[INFO] Nothing to compile - all classes are up to date
[INFO] [INFO] Surefire report directory: F:\hudson\hudson-slave\workspace\dir-apacheds-jdk16-win\trunk\interceptors\referral\target\surefire-reports

-------------------------------------------------------
 T E S T S
-------------------------------------------------------

[INFO] --- maven-surefire-plugin:2.12:test (default-test) @ apacheds-interceptors-referral ---

Results :

Tests run: 0, Failures: 0, Errors: 0, Skipped: 0

[JENKINS] Recording test results
[INFO] 
[INFO] --- maven-bundle-plugin:2.3.7:bundle (default-bundle) @ apacheds-interceptors-referral ---
[INFO] 
[INFO] --- maven-site-plugin:3.0:attach-descriptor (attach-descriptor) @ apacheds-interceptors-referral ---
[INFO] Checking legal files in: apacheds-interceptors-referral-2.0.0-M7-SNAPSHOT.jar
[INFO] 
[INFO] --- tools-maven-plugin:1.4:verify-legal-files (verify-legal-files) @ apacheds-interceptors-referral ---
Apr 3, 2012 10:20:22 AM hudson.maven.ExecutedMojo <init>
WARNING: Failed to getClass for org.apache.maven.plugin.source.SourceJarMojo
[INFO] 
[INFO] --- maven-source-plugin:2.1.2:jar (attach-sources) @ apacheds-interceptors-referral ---
[INFO] META-INF already added, skipping
[INFO] META-INF\DEPENDENCIES already added, skipping
[INFO] META-INF\LICENSE already added, skipping
[INFO] META-INF\NOTICE already added, skipping
[INFO] Building jar: F:\hudson\hudson-slave\workspace\dir-apacheds-jdk16-win\trunk\interceptors\referral\target\apacheds-interceptors-referral-2.0.0-M7-SNAPSHOT-sources.jar
[INFO] META-INF already added, skipping
[INFO] META-INF\DEPENDENCIES already added, skipping
[INFO] META-INF\LICENSE already added, skipping
[INFO] META-INF\NOTICE already added, skipping
[INFO] 
[INFO] Installing F:\hudson\hudson-slave\workspace\dir-apacheds-jdk16-win\trunk\interceptors\referral\target\apacheds-interceptors-referral-2.0.0-M7-SNAPSHOT.jar to f:\hudson\hudson-slave\maven-repositories\0\org\apache\directory\server\apacheds-interceptors-referral\2.0.0-M7-SNAPSHOT\apacheds-interceptors-referral-2.0.0-M7-SNAPSHOT.jar
[INFO] --- maven-install-plugin:2.3.1:install (default-install) @ apacheds-interceptors-referral ---
[INFO] Installing F:\hudson\hudson-slave\workspace\dir-apacheds-jdk16-win\trunk\interceptors\referral\pom.xml to f:\hudson\hudson-slave\maven-repositories\0\org\apache\directory\server\apacheds-interceptors-referral\2.0.0-M7-SNAPSHOT\apacheds-interceptors-referral-2.0.0-M7-SNAPSHOT.pom
[INFO] Installing F:\hudson\hudson-slave\workspace\dir-apacheds-jdk16-win\trunk\interceptors\referral\target\apacheds-interceptors-referral-2.0.0-M7-SNAPSHOT-sources.jar to f:\hudson\hudson-slave\maven-repositories\0\org\apache\directory\server\apacheds-interceptors-referral\2.0.0-M7-SNAPSHOT\apacheds-interceptors-referral-2.0.0-M7-SNAPSHOT-sources.jar
[INFO] 
[INFO] --- maven-bundle-plugin:2.3.7:install (default-install) @ apacheds-interceptors-referral ---
[INFO] Installing org/apache/directory/server/apacheds-interceptors-referral/2.0.0-M7-SNAPSHOT/apacheds-interceptors-referral-2.0.0-M7-SNAPSHOT.jar
[INFO] Writing OBR metadata
[JENKINS] Archiving disabled - not archiving F:\hudson\hudson-slave\workspace\dir-apacheds-jdk16-win\trunk\interceptors\referral\pom.xml
[JENKINS] Archiving disabled - not archiving F:\hudson\hudson-slave\workspace\dir-apacheds-jdk16-win\trunk\interceptors\referral\target\apacheds-interceptors-referral-2.0.0-M7-SNAPSHOT.jar
[JENKINS] Archiving disabled - not archiving F:\hudson\hudson-slave\workspace\dir-apacheds-jdk16-win\trunk\interceptors\referral\target\apacheds-interceptors-referral-2.0.0-M7-SNAPSHOT-sources.jar
[INFO]                                                                         
[INFO] ------------------------------------------------------------------------
[INFO] Building ApacheDS Schema Interceptor 2.0.0-M7-SNAPSHOT
[INFO] ------------------------------------------------------------------------
[INFO] 
[INFO] --- maven-clean-plugin:2.4.1:clean (default-clean) @ apacheds-interceptors-schema ---
[INFO] Deleting F:\hudson\hudson-slave\workspace\dir-apacheds-jdk16-win\trunk\interceptors\schema\target
[INFO] 
[INFO] --- maven-remote-resources-plugin:1.2.1:process (default) @ apacheds-interceptors-schema ---
[INFO] [debug] execute contextualize
[INFO] Using 'UTF-8' encoding to copy filtered resources.

[INFO] --- maven-resources-plugin:2.5:resources (default-resources) @ apacheds-interceptors-schema ---
[INFO] skip non existing resourceDirectory F:\hudson\hudson-slave\workspace\dir-apacheds-jdk16-win\trunk\interceptors\schema\src\main\resources
[INFO] Copying 3 resources
[INFO] 
[INFO] --- maven-compiler-plugin:2.3.2:compile (default-compile) @ apacheds-interceptors-schema ---
[INFO] Compiling 5 source files to F:\hudson\hudson-slave\workspace\dir-apacheds-jdk16-win\trunk\interceptors\schema\target\classes
[debug] execute contextualize
[INFO] [INFO] Using 'UTF-8' encoding to copy filtered resources.
[INFO] skip non existing resourceDirectory F:\hudson\hudson-slave\workspace\dir-apacheds-jdk16-win\trunk\interceptors\schema\src\test\resources
[INFO] Copying 3 resources

[INFO] --- maven-resources-plugin:2.5:testResources (default-testResources) @ apacheds-interceptors-schema ---
[INFO] 
[INFO] --- maven-compiler-plugin:2.3.2:testCompile (default-testCompile) @ apacheds-interceptors-schema ---
[INFO] Compiling 1 source file to F:\hudson\hudson-slave\workspace\dir-apacheds-jdk16-win\trunk\interceptors\schema\target\test-classes
[INFO] [INFO] Surefire report directory: F:\hudson\hudson-slave\workspace\dir-apacheds-jdk16-win\trunk\interceptors\schema\target\surefire-reports

-------------------------------------------------------
 T E S T S
-------------------------------------------------------

[INFO] --- maven-surefire-plugin:2.12:test (default-test) @ apacheds-interceptors-schema ---
Running org.apache.directory.server.core.schema.SchemaServiceTest
log4j:WARN No appenders could be found for logger (org.apache.directory.shared.ldap.schemaextractor.impl.DefaultSchemaLdifExtractor).
log4j:WARN Please initialize the log4j system properly.
log4j:WARN See http://logging.apache.org/log4j/1.2/faq.html#noconfig for more info.
#
# There is insufficient memory for the Java Runtime Environment to continue.
# Native memory allocation (malloc) failed to allocate 1120400 bytes for Chunk::new
# An error report file with more information is saved as:
# F:\hudson\hudson-slave\workspace\dir-apacheds-jdk16-win\trunk\interceptors\schema\hs_err_pid4232.log

Results :

Tests run: 0, Failures: 0, Errors: 0, Skipped: 0

[JENKINS] Recording test results
[JENKINS] Archiving disabled - not archiving F:\hudson\hudson-slave\workspace\dir-apacheds-jdk16-win\trunk\interceptors\schema\pom.xml
[INFO] ------------------------------------------------------------------------
[INFO] Reactor Summary:
[INFO] 
[INFO] ApacheDS .......................................... SUCCESS [9.512s]
[INFO] ApacheDS I18n ..................................... SUCCESS [5.428s]
[INFO] ApacheDS Core Constants ........................... SUCCESS [2.055s]
[INFO] ApacheDS Core API ................................. SUCCESS [36.744s]
[INFO] ApacheDS Core Shared .............................. SUCCESS [7.982s]
[INFO] ApacheDS Interceptors ............................. SUCCESS [0.164s]
[INFO] ApacheDS AdministrativePoint Interceptor .......... SUCCESS [8.689s]
[INFO] ApacheDS Authentication Interceptor ............... SUCCESS [20.889s]
[INFO] ApacheDS Authorization Interceptor ................ SUCCESS [29.360s]
[INFO] ApacheDS ChangeLog Interceptor .................... SUCCESS [10.166s]
[INFO] ApacheDS Collective Attribute Interceptor ......... SUCCESS [4.375s]
[INFO] ApacheDS Event Interceptor ........................ SUCCESS [4.328s]
[INFO] ApacheDS Exception Interceptor .................... SUCCESS [3.388s]
[INFO] ApacheDS Journal Interceptor ...................... SUCCESS [2.788s]
[INFO] ApacheDS Normalization Interceptor ................ SUCCESS [11.172s]
[INFO] ApacheDS Operational Attribute Interceptor ........ SUCCESS [3.305s]
[INFO] ApacheDS Referral Interceptor ..................... SUCCESS [3.014s]
[INFO] ApacheDS Schema Interceptor ....................... FAILURE [25.573s]
[INFO] ApacheDS Subtree Interceptor ...................... SKIPPED
[INFO] ApacheDS Triggers Interceptor ..................... SKIPPED
[INFO] ApacheDS Core ..................................... SKIPPED
[INFO] ApacheDS Core AVL ................................. SKIPPED
[INFO] ApacheDS Generalized (X) DBM Partition ............ SKIPPED
[INFO] ApacheDS LDIF Partition ........................... SKIPPED
[INFO] ApacheDS JDBM Partition ........................... SKIPPED
[INFO] ApacheDS Core Annotations ......................... SKIPPED
[INFO] ApacheDS Core JNDI ................................ SKIPPED
[INFO] ApacheDS Protocol Shared .......................... SKIPPED
[INFO] ApacheDS Protocol Kerberos Codec .................. SKIPPED
[INFO] ApacheDS Interceptors for Kerberos ................ SKIPPED
[INFO] ApacheDS Protocol Dhcp ............................ SKIPPED
[INFO] ApacheDS Protocol Dns ............................. SKIPPED
[INFO] ApacheDS Protocol Kerberos ........................ SKIPPED
[INFO] ApacheDS Protocol Ldap ............................ SKIPPED
[INFO] ApacheDS Protocol Ntp ............................. SKIPPED
[INFO] Apacheds Server Annotations ....................... SKIPPED
[INFO] ApacheDS Server Config ............................ SKIPPED
[INFO] ApacheDS Server JNDI .............................. SKIPPED
[INFO] ApacheDS Server Replication Service ............... SKIPPED
[INFO] ApacheDS Test Framework ........................... SKIPPED
[INFO] ApacheDS Generalized (X) DBM Tools ................ SKIPPED
[INFO] ApacheDS All ...................................... SKIPPED
[INFO] ApacheDS Logger Interceptor ....................... SKIPPED
[INFO] ApacheDS Password Hashing Interceptor ............. SKIPPED
[INFO] ApacheDS Core Integration ......................... SKIPPED
[INFO] ApacheDS Server Integration ....................... SKIPPED
[INFO] ApacheDS DirectoryService-WebApp bridge ........... SKIPPED
[INFO] ApacheDS Jetty HTTP Server Integration ............ SKIPPED
[INFO] ApacheDS Service Builder .......................... SKIPPED
[INFO] ApacheDS Protocol Kerberos Test ................... SKIPPED
[INFO] Apache Directory LDAP Client API test ............. SKIPPED
[INFO] ApacheDS Service .................................. SKIPPED
[INFO] ApacheDS Wrapper .................................. SKIPPED
[INFO] ApacheDS Installers Maven Plugin .................. SKIPPED
[INFO] ApacheDS Installers ............................... SKIPPED
[INFO] ------------------------------------------------------------------------
[INFO] BUILD FAILURE
[INFO] ------------------------------------------------------------------------
[INFO] Total time: 3:20.446s
[INFO] Finished at: Tue Apr 03 10:20:49 BST 2012
[INFO] Final Memory: 141M/275M
[INFO] ------------------------------------------------------------------------
Waiting for Jenkins to finish collecting data
mavenExecutionResult exceptions not empty
message : Failed to execute goal org.apache.maven.plugins:maven-surefire-plugin:2.12:test (default-test) on project apacheds-interceptors-schema: Error occurred in starting fork, check output in log
cause : Error occurred in starting fork, check output in log
Stack trace : 
org.apache.maven.lifecycle.LifecycleExecutionException: Failed to execute goal org.apache.maven.plugins:maven-surefire-plugin:2.12:test (default-test) on project apacheds-interceptors-schema: Error occurred in starting fork, check output in log
	at org.apache.maven.lifecycle.internal.MojoExecutor.execute(MojoExecutor.java:217)
	at org.apache.maven.lifecycle.internal.MojoExecutor.execute(MojoExecutor.java:153)
	at org.apache.maven.lifecycle.internal.MojoExecutor.execute(MojoExecutor.java:145)
	at org.apache.maven.lifecycle.internal.LifecycleModuleBuilder.buildProject(LifecycleModuleBuilder.java:84)
	at org.apache.maven.lifecycle.internal.LifecycleModuleBuilder.buildProject(LifecycleModuleBuilder.java:59)
	at org.apache.maven.lifecycle.internal.LifecycleStarter.singleThreadedBuild(LifecycleStarter.java:183)
	at org.apache.maven.lifecycle.internal.LifecycleStarter.execute(LifecycleStarter.java:161)
	at org.apache.maven.DefaultMaven.doExecute(DefaultMaven.java:319)
	at org.apache.maven.DefaultMaven.execute(DefaultMaven.java:156)
	at org.jvnet.hudson.maven3.launcher.Maven3Launcher.main(Maven3Launcher.java:79)
	at sun.reflect.NativeMethodAccessorImpl.invoke0(Native Method)
	at sun.reflect.NativeMethodAccessorImpl.invoke(NativeMethodAccessorImpl.java:39)
	at sun.reflect.DelegatingMethodAccessorImpl.invoke(DelegatingMethodAccessorImpl.java:25)
	at java.lang.reflect.Method.invoke(Method.java:597)
	at org.codehaus.plexus.classworlds.launcher.Launcher.launchStandard(Launcher.java:329)
	at org.codehaus.plexus.classworlds.launcher.Launcher.launch(Launcher.java:239)
	at org.jvnet.hudson.maven3.agent.Maven3Main.launch(Maven3Main.java:158)
	at hudson.maven.Maven3Builder.call(Maven3Builder.java:104)
	at hudson.maven.Maven3Builder.call(Maven3Builder.java:70)
	at hudson.remoting.UserRequest.perform(UserRequest.java:118)
	at hudson.remoting.UserRequest.perform(UserRequest.java:48)
	at hudson.remoting.Request$2.run(Request.java:287)
	at hudson.remoting.InterceptingExecutorService$1.call(InterceptingExecutorService.java:72)
	at java.util.concurrent.FutureTask$Sync.innerRun(FutureTask.java:303)
	at java.util.concurrent.FutureTask.run(FutureTask.java:138)
	at java.util.concurrent.ThreadPoolExecutor$Worker.runTask(ThreadPoolExecutor.java:886)
	at java.util.concurrent.ThreadPoolExecutor$Worker.run(ThreadPoolExecutor.java:908)
	at java.lang.Thread.run(Thread.java:662)
Caused by: org.apache.maven.plugin.MojoExecutionException: Error occurred in starting fork, check output in log
	at org.apache.maven.plugin.surefire.SurefirePlugin.assertNoException(SurefirePlugin.java:656)
	at org.apache.maven.plugin.surefire.SurefirePlugin.handleSummary(SurefirePlugin.java:645)
	at org.apache.maven.plugin.surefire.AbstractSurefireMojo.executeAfterPreconditionsChecked(AbstractSurefireMojo.java:137)
	at org.apache.maven.plugin.surefire.AbstractSurefireMojo.execute(AbstractSurefireMojo.java:98)
	at org.apache.maven.plugin.DefaultBuildPluginManager.executeMojo(DefaultBuildPluginManager.java:107)
	at org.apache.maven.lifecycle.internal.MojoExecutor.execute(MojoExecutor.java:209)
	... 27 more
Caused by: org.apache.maven.surefire.booter.SurefireBooterForkException: Error occurred in starting fork, check output in log
	at org.apache.maven.plugin.surefire.booterclient.ForkStarter.fork(ForkStarter.java:281)
	at org.apache.maven.plugin.surefire.booterclient.ForkStarter.run(ForkStarter.java:113)
	at org.apache.maven.plugin.surefire.AbstractSurefireMojo.executeProvider(AbstractSurefireMojo.java:199)
	at org.apache.maven.plugin.surefire.AbstractSurefireMojo.executeAllProviders(AbstractSurefireMojo.java:176)
	at org.apache.maven.plugin.surefire.AbstractSurefireMojo.executeAfterPreconditionsChecked(AbstractSurefireMojo.java:135)
	... 30 more
Sending e-mails to: notifications@directory.apache.org
channel stopped

Build failed in Jenkins: dir-apacheds-jdk16-win #86

Posted by Apache Jenkins Server <je...@builds.apache.org>.
See <https://builds.apache.org/job/dir-apacheds-jdk16-win/86/>

------------------------------------------
[...truncated 1553 lines...]
[INFO] 
[INFO] --- maven-bundle-plugin:2.3.7:bundle (default-bundle) @ apacheds-core ---
[INFO] 
[INFO] --- maven-site-plugin:3.0:attach-descriptor (attach-descriptor) @ apacheds-core ---
[INFO] [INFO] Checking legal files in: apacheds-core-2.0.0-M7-SNAPSHOT.jar

[INFO] --- tools-maven-plugin:1.4:verify-legal-files (verify-legal-files) @ apacheds-core ---
Apr 1, 2012 5:06:15 AM hudson.maven.ExecutedMojo <init>
WARNING: Failed to getClass for org.apache.maven.plugin.source.SourceJarMojo
[INFO] 
[INFO] --- maven-source-plugin:2.1.2:jar (attach-sources) @ apacheds-core ---
[INFO] META-INF already added, skipping
[INFO] org already added, skipping
[INFO] org\apache already added, skipping
[INFO] org\apache\directory already added, skipping
[INFO] org\apache\directory\server already added, skipping
[INFO] org\apache\directory\server\core already added, skipping
[INFO] META-INF already added, skipping
[INFO] META-INF\DEPENDENCIES already added, skipping
[INFO] META-INF\LICENSE already added, skipping
[INFO] META-INF\NOTICE already added, skipping
[INFO] Building jar: F:\hudson\hudson-slave\workspace\dir-apacheds-jdk16-win\trunk\core\target\apacheds-core-2.0.0-M7-SNAPSHOT-sources.jar
[INFO] META-INF already added, skipping
[INFO] org already added, skipping
[INFO] org\apache already added, skipping
[INFO] org\apache\directory already added, skipping
[INFO] org\apache\directory\server already added, skipping
[INFO] org\apache\directory\server\core already added, skipping
[INFO] META-INF already added, skipping
[INFO] META-INF\DEPENDENCIES already added, skipping
[INFO] META-INF\LICENSE already added, skipping
[INFO] META-INF\NOTICE already added, skipping
[INFO] [INFO] Installing F:\hudson\hudson-slave\workspace\dir-apacheds-jdk16-win\trunk\core\target\apacheds-core-2.0.0-M7-SNAPSHOT.jar to f:\hudson\hudson-slave\maven-repositories\0\org\apache\directory\server\apacheds-core\2.0.0-M7-SNAPSHOT\apacheds-core-2.0.0-M7-SNAPSHOT.jar

[INFO] --- maven-install-plugin:2.3.1:install (default-install) @ apacheds-core ---
[INFO] Installing F:\hudson\hudson-slave\workspace\dir-apacheds-jdk16-win\trunk\core\pom.xml to f:\hudson\hudson-slave\maven-repositories\0\org\apache\directory\server\apacheds-core\2.0.0-M7-SNAPSHOT\apacheds-core-2.0.0-M7-SNAPSHOT.pom
[INFO] Installing F:\hudson\hudson-slave\workspace\dir-apacheds-jdk16-win\trunk\core\target\apacheds-core-2.0.0-M7-SNAPSHOT-sources.jar to f:\hudson\hudson-slave\maven-repositories\0\org\apache\directory\server\apacheds-core\2.0.0-M7-SNAPSHOT\apacheds-core-2.0.0-M7-SNAPSHOT-sources.jar
[INFO] 
[INFO] --- maven-bundle-plugin:2.3.7:install (default-install) @ apacheds-core ---
[INFO] Installing org/apache/directory/server/apacheds-core/2.0.0-M7-SNAPSHOT/apacheds-core-2.0.0-M7-SNAPSHOT.jar
[INFO] Writing OBR metadata
[JENKINS] Archiving disabled - not archiving F:\hudson\hudson-slave\workspace\dir-apacheds-jdk16-win\trunk\core\pom.xml
[JENKINS] Archiving disabled - not archiving F:\hudson\hudson-slave\workspace\dir-apacheds-jdk16-win\trunk\core\target\apacheds-core-2.0.0-M7-SNAPSHOT.jar
[JENKINS] Archiving disabled - not archiving F:\hudson\hudson-slave\workspace\dir-apacheds-jdk16-win\trunk\core\target\apacheds-core-2.0.0-M7-SNAPSHOT-sources.jar
[INFO]                                                                         
[INFO] ------------------------------------------------------------------------
[INFO] Building ApacheDS Core AVL 2.0.0-M7-SNAPSHOT
[INFO] ------------------------------------------------------------------------
[INFO] Deleting F:\hudson\hudson-slave\workspace\dir-apacheds-jdk16-win\trunk\core-avl\target
[INFO] 
[INFO] --- maven-clean-plugin:2.4.1:clean (default-clean) @ apacheds-core-avl ---
[INFO] 
[INFO] --- maven-remote-resources-plugin:1.2.1:process (default) @ apacheds-core-avl ---
[debug] execute contextualize
[INFO] Using 'UTF-8' encoding to copy filtered resources.
[INFO] skip non existing resourceDirectory F:\hudson\hudson-slave\workspace\dir-apacheds-jdk16-win\trunk\core-avl\src\main\resources
[INFO] Copying 3 resources
[INFO] 
[INFO] --- maven-resources-plugin:2.5:resources (default-resources) @ apacheds-core-avl ---
[INFO] 
[INFO] --- maven-compiler-plugin:2.3.2:compile (default-compile) @ apacheds-core-avl ---
[INFO] Compiling 22 source files to F:\hudson\hudson-slave\workspace\dir-apacheds-jdk16-win\trunk\core-avl\target\classes
[INFO] -------------------------------------------------------------
[ERROR] COMPILATION ERROR : 
[INFO] -------------------------------------------------------------
[ERROR] \hudson\hudson-slave\workspace\dir-apacheds-jdk16-win\trunk\core-avl\src\main\java\org\apache\directory\server\core\avltree\AvlTreeMapNoDupsWrapperCursor.java:[23,52] cannot find symbol
symbol  : class AbstractTupleCursor
location: package org.apache.directory.shared.ldap.model.cursor
[ERROR] \hudson\hudson-slave\workspace\dir-apacheds-jdk16-win\trunk\core-avl\src\main\java\org\apache\directory\server\core\avltree\AvlTreeMapNoDupsWrapperCursor.java:[35,57] cannot find symbol
symbol: class AbstractTupleCursor
public class AvlTreeMapNoDupsWrapperCursor<K, V> extends AbstractTupleCursor<K, V>
[ERROR] \hudson\hudson-slave\workspace\dir-apacheds-jdk16-win\trunk\core-avl\src\main\java\org\apache\directory\server\core\avltree\AvlTreeMapNoDupsWrapperCursor.java:[35,76] a generic class may not extend java.lang.Throwable
[ERROR] \hudson\hudson-slave\workspace\dir-apacheds-jdk16-win\trunk\core-avl\src\main\java\org\apache\directory\server\core\avltree\AvlSingletonOrOrderedSetCursor.java:[25,52] cannot find symbol
symbol  : class AbstractTupleCursor
location: package org.apache.directory.shared.ldap.model.cursor
[ERROR] \hudson\hudson-slave\workspace\dir-apacheds-jdk16-win\trunk\core-avl\src\main\java\org\apache\directory\server\core\avltree\AvlSingletonOrOrderedSetCursor.java:[35,58] cannot find symbol
symbol: class AbstractTupleCursor
public class AvlSingletonOrOrderedSetCursor<K, V> extends AbstractTupleCursor<K, SingletonOrOrderedSet<V>>
[ERROR] \hudson\hudson-slave\workspace\dir-apacheds-jdk16-win\trunk\core-avl\src\main\java\org\apache\directory\server\core\avltree\AvlSingletonOrOrderedSetCursor.java:[35,77] a generic class may not extend java.lang.Throwable
[ERROR] \hudson\hudson-slave\workspace\dir-apacheds-jdk16-win\trunk\core-avl\src\main\java\org\apache\directory\server\core\avltree\KeyTupleAvlCursor.java:[23,52] cannot find symbol
symbol  : class AbstractTupleCursor
location: package org.apache.directory.shared.ldap.model.cursor
[ERROR] \hudson\hudson-slave\workspace\dir-apacheds-jdk16-win\trunk\core-avl\src\main\java\org\apache\directory\server\core\avltree\KeyTupleAvlCursor.java:[35,45] cannot find symbol
symbol: class AbstractTupleCursor
public class KeyTupleAvlCursor<K, V> extends AbstractTupleCursor<K, V>
[ERROR] \hudson\hudson-slave\workspace\dir-apacheds-jdk16-win\trunk\core-avl\src\main\java\org\apache\directory\server\core\avltree\KeyTupleAvlCursor.java:[35,64] a generic class may not extend java.lang.Throwable
[ERROR] \hudson\hudson-slave\workspace\dir-apacheds-jdk16-win\trunk\core-avl\src\main\java\org\apache\directory\server\core\avltree\AvlSingletonOrOrderedSetCursor.java:[75,8] cannot find symbol
symbol  : method checkNotClosed(java.lang.String)
location: class org.apache.directory.server.core.avltree.AvlSingletonOrOrderedSetCursor<K,V>
[ERROR] \hudson\hudson-slave\workspace\dir-apacheds-jdk16-win\trunk\core-avl\src\main\java\org\apache\directory\server\core\avltree\AvlSingletonOrOrderedSetCursor.java:[95,8] cannot find symbol
symbol  : method checkNotClosed(java.lang.String)
location: class org.apache.directory.server.core.avltree.AvlSingletonOrOrderedSetCursor<K,V>
[ERROR] \hudson\hudson-slave\workspace\dir-apacheds-jdk16-win\trunk\core-avl\src\main\java\org\apache\directory\server\core\avltree\AvlSingletonOrOrderedSetCursor.java:[103,8] cannot find symbol
symbol  : method checkNotClosed(java.lang.String)
location: class org.apache.directory.server.core.avltree.AvlSingletonOrOrderedSetCursor<K,V>
[ERROR] \hudson\hudson-slave\workspace\dir-apacheds-jdk16-win\trunk\core-avl\src\main\java\org\apache\directory\server\core\avltree\AvlSingletonOrOrderedSetCursor.java:[122,8] cannot find symbol
symbol  : method checkNotClosed(java.lang.String)
location: class org.apache.directory.server.core.avltree.AvlSingletonOrOrderedSetCursor<K,V>
[ERROR] \hudson\hudson-slave\workspace\dir-apacheds-jdk16-win\trunk\core-avl\src\main\java\org\apache\directory\server\core\avltree\AvlSingletonOrOrderedSetCursor.java:[137,8] cannot find symbol
symbol  : method checkNotClosed(java.lang.String)
location: class org.apache.directory.server.core.avltree.AvlSingletonOrOrderedSetCursor<K,V>
[ERROR] \hudson\hudson-slave\workspace\dir-apacheds-jdk16-win\trunk\core-avl\src\main\java\org\apache\directory\server\core\avltree\AvlSingletonOrOrderedSetCursor.java:[156,8] cannot find symbol
symbol  : method checkNotClosed(java.lang.String)
location: class org.apache.directory.server.core.avltree.AvlSingletonOrOrderedSetCursor<K,V>
[ERROR] \hudson\hudson-slave\workspace\dir-apacheds-jdk16-win\trunk\core-avl\src\main\java\org\apache\directory\server\core\avltree\AvlSingletonOrOrderedSetCursor.java:[192,8] cannot find symbol
symbol  : method checkNotClosed(java.lang.String)
location: class org.apache.directory.server.core.avltree.AvlSingletonOrOrderedSetCursor<K,V>
[ERROR] \hudson\hudson-slave\workspace\dir-apacheds-jdk16-win\trunk\core-avl\src\main\java\org\apache\directory\server\core\avltree\AvlSingletonOrOrderedSetCursor.java:[228,8] cannot find symbol
symbol  : method checkNotClosed(java.lang.String)
location: class org.apache.directory.server.core.avltree.AvlSingletonOrOrderedSetCursor<K,V>
[ERROR] \hudson\hudson-slave\workspace\dir-apacheds-jdk16-win\trunk\core-avl\src\main\java\org\apache\directory\server\core\avltree\AvlSingletonOrOrderedSetCursor.java:[260,8] cannot find symbol
symbol  : method checkNotClosed(java.lang.String)
location: class org.apache.directory.server.core.avltree.AvlSingletonOrOrderedSetCursor<K,V>
[ERROR] \hudson\hudson-slave\workspace\dir-apacheds-jdk16-win\trunk\core-avl\src\main\java\org\apache\directory\server\core\avltree\KeyTupleAvlCursor.java:[85,8] cannot find symbol
symbol  : method checkNotClosed(java.lang.String)
location: class org.apache.directory.server.core.avltree.KeyTupleAvlCursor<K,V>
[ERROR] \hudson\hudson-slave\workspace\dir-apacheds-jdk16-win\trunk\core-avl\src\main\java\org\apache\directory\server\core\avltree\KeyTupleAvlCursor.java:[98,8] cannot find symbol
symbol  : method checkNotClosed(java.lang.String)
location: class org.apache.directory.server.core.avltree.KeyTupleAvlCursor<K,V>
[ERROR] \hudson\hudson-slave\workspace\dir-apacheds-jdk16-win\trunk\core-avl\src\main\java\org\apache\directory\server\core\avltree\KeyTupleAvlCursor.java:[119,8] cannot find symbol
symbol  : method checkNotClosed(java.lang.String)
location: class org.apache.directory.server.core.avltree.KeyTupleAvlCursor<K,V>
[ERROR] \hudson\hudson-slave\workspace\dir-apacheds-jdk16-win\trunk\core-avl\src\main\java\org\apache\directory\server\core\avltree\KeyTupleAvlCursor.java:[127,8] cannot find symbol
symbol  : method checkNotClosed(java.lang.String)
location: class org.apache.directory.server.core.avltree.KeyTupleAvlCursor<K,V>
[ERROR] \hudson\hudson-slave\workspace\dir-apacheds-jdk16-win\trunk\core-avl\src\main\java\org\apache\directory\server\core\avltree\KeyTupleAvlCursor.java:[135,8] cannot find symbol
symbol  : method checkNotClosed(java.lang.String)
location: class org.apache.directory.server.core.avltree.KeyTupleAvlCursor<K,V>
[ERROR] \hudson\hudson-slave\workspace\dir-apacheds-jdk16-win\trunk\core-avl\src\main\java\org\apache\directory\server\core\avltree\KeyTupleAvlCursor.java:[143,8] cannot find symbol
symbol  : method checkNotClosed(java.lang.String)
location: class org.apache.directory.server.core.avltree.KeyTupleAvlCursor<K,V>
[ERROR] \hudson\hudson-slave\workspace\dir-apacheds-jdk16-win\trunk\core-avl\src\main\java\org\apache\directory\server\core\avltree\KeyTupleAvlCursor.java:[165,8] cannot find symbol
symbol  : method checkNotClosed(java.lang.String)
location: class org.apache.directory.server.core.avltree.KeyTupleAvlCursor<K,V>
[ERROR] \hudson\hudson-slave\workspace\dir-apacheds-jdk16-win\trunk\core-avl\src\main\java\org\apache\directory\server\core\avltree\KeyTupleAvlCursor.java:[182,8] cannot find symbol
symbol  : method checkNotClosed(java.lang.String)
location: class org.apache.directory.server.core.avltree.KeyTupleAvlCursor<K,V>
[ERROR] \hudson\hudson-slave\workspace\dir-apacheds-jdk16-win\trunk\core-avl\src\main\java\org\apache\directory\server\core\avltree\KeyTupleAvlCursor.java:[199,8] cannot find symbol
symbol  : method checkNotClosed(java.lang.String)
location: class org.apache.directory.server.core.avltree.KeyTupleAvlCursor<K,V>
[INFO] 27 errors 
[INFO] -------------------------------------------------------------
[JENKINS] Archiving disabled - not archiving F:\hudson\hudson-slave\workspace\dir-apacheds-jdk16-win\trunk\core-avl\pom.xml
[INFO] ------------------------------------------------------------------------
[INFO] Reactor Summary:
[INFO] 
[INFO] ApacheDS .......................................... SUCCESS [11.624s]
[INFO] ApacheDS I18n ..................................... SUCCESS [5.441s]
[INFO] ApacheDS Core Constants ........................... SUCCESS [1.713s]
[INFO] ApacheDS Core API ................................. SUCCESS [22.726s]
[INFO] ApacheDS Core Shared .............................. SUCCESS [7.602s]
[INFO] ApacheDS Interceptors ............................. SUCCESS [0.091s]
[INFO] ApacheDS AdministrativePoint Interceptor .......... SUCCESS [2.392s]
[INFO] ApacheDS Authentication Interceptor ............... SUCCESS [13.592s]
[INFO] ApacheDS Authorization Interceptor ................ SUCCESS [26.251s]
[INFO] ApacheDS ChangeLog Interceptor .................... SUCCESS [21.274s]
[INFO] ApacheDS Collective Attribute Interceptor ......... SUCCESS [1.750s]
[INFO] ApacheDS Event Interceptor ........................ SUCCESS [1.679s]
[INFO] ApacheDS Exception Interceptor .................... SUCCESS [6.055s]
[INFO] ApacheDS Journal Interceptor ...................... SUCCESS [2.397s]
[INFO] ApacheDS Normalization Interceptor ................ SUCCESS [12.438s]
[INFO] ApacheDS Operational Attribute Interceptor ........ SUCCESS [2.911s]
[INFO] ApacheDS Referral Interceptor ..................... SUCCESS [2.477s]
[INFO] ApacheDS Schema Interceptor ....................... SUCCESS [25.552s]
[INFO] ApacheDS Subtree Interceptor ...................... SUCCESS [21.997s]
[INFO] ApacheDS Triggers Interceptor ..................... SUCCESS [6.740s]
[INFO] ApacheDS Core ..................................... SUCCESS [5.750s]
[INFO] ApacheDS Core AVL ................................. FAILURE [5.371s]
[INFO] ApacheDS Generalized (X) DBM Partition ............ SKIPPED
[INFO] ApacheDS LDIF Partition ........................... SKIPPED
[INFO] ApacheDS JDBM Partition ........................... SKIPPED
[INFO] ApacheDS Core Annotations ......................... SKIPPED
[INFO] ApacheDS Core JNDI ................................ SKIPPED
[INFO] ApacheDS Protocol Shared .......................... SKIPPED
[INFO] ApacheDS Protocol Kerberos Codec .................. SKIPPED
[INFO] ApacheDS Interceptors for Kerberos ................ SKIPPED
[INFO] ApacheDS Protocol Dhcp ............................ SKIPPED
[INFO] ApacheDS Protocol Dns ............................. SKIPPED
[INFO] ApacheDS Protocol Kerberos ........................ SKIPPED
[INFO] ApacheDS Protocol Ldap ............................ SKIPPED
[INFO] ApacheDS Protocol Ntp ............................. SKIPPED
[INFO] Apacheds Server Annotations ....................... SKIPPED
[INFO] ApacheDS Server Config ............................ SKIPPED
[INFO] ApacheDS Server JNDI .............................. SKIPPED
[INFO] ApacheDS Server Replication Service ............... SKIPPED
[INFO] ApacheDS Test Framework ........................... SKIPPED
[INFO] ApacheDS Generalized (X) DBM Tools ................ SKIPPED
[INFO] ApacheDS All ...................................... SKIPPED
[INFO] ApacheDS Logger Interceptor ....................... SKIPPED
[INFO] ApacheDS Password Hashing Interceptor ............. SKIPPED
[INFO] ApacheDS Core Integration ......................... SKIPPED
[INFO] ApacheDS Server Integration ....................... SKIPPED
[INFO] ApacheDS DirectoryService-WebApp bridge ........... SKIPPED
[INFO] ApacheDS Jetty HTTP Server Integration ............ SKIPPED
[INFO] ApacheDS Service Builder .......................... SKIPPED
[INFO] ApacheDS Protocol Kerberos Test ................... SKIPPED
[INFO] Apache Directory LDAP Client API test ............. SKIPPED
[INFO] ApacheDS Service .................................. SKIPPED
[INFO] ApacheDS Wrapper .................................. SKIPPED
[INFO] ApacheDS Installers Maven Plugin .................. SKIPPED
[INFO] ApacheDS Installers ............................... SKIPPED
[INFO] ------------------------------------------------------------------------
[INFO] BUILD FAILURE
[INFO] ------------------------------------------------------------------------
[INFO] Total time: 3:52.102s
[INFO] Finished at: Sun Apr 01 05:06:21 BST 2012
[INFO] Final Memory: 169M/291M
[INFO] ------------------------------------------------------------------------
mavenExecutionResult exceptions not empty
message : Failed to execute goal org.apache.maven.plugins:maven-compiler-plugin:2.3.2:compile (default-compile) on project apacheds-core-avl: Compilation failure
cause : Compilation failure
Stack trace : 
org.apache.maven.lifecycle.LifecycleExecutionException: Failed to execute goal org.apache.maven.plugins:maven-compiler-plugin:2.3.2:compile (default-compile) on project apacheds-core-avl: Compilation failure
	at org.apache.maven.lifecycle.internal.MojoExecutor.execute(MojoExecutor.java:213)
	at org.apache.maven.lifecycle.internal.MojoExecutor.execute(MojoExecutor.java:153)
	at org.apache.maven.lifecycle.internal.MojoExecutor.execute(MojoExecutor.java:145)
	at org.apache.maven.lifecycle.internal.LifecycleModuleBuilder.buildProject(LifecycleModuleBuilder.java:84)
	at org.apache.maven.lifecycle.internal.LifecycleModuleBuilder.buildProject(LifecycleModuleBuilder.java:59)
	at org.apache.maven.lifecycle.internal.LifecycleStarter.singleThreadedBuild(LifecycleStarter.java:183)
	at org.apache.maven.lifecycle.internal.LifecycleStarter.execute(LifecycleStarter.java:161)
	at org.apache.maven.DefaultMaven.doExecute(DefaultMaven.java:319)
	at org.apache.maven.DefaultMaven.execute(DefaultMaven.java:156)
	at org.jvnet.hudson.maven3.launcher.Maven3Launcher.main(Maven3Launcher.java:79)
	at sun.reflect.NativeMethodAccessorImpl.invoke0(Native Method)
	at sun.reflect.NativeMethodAccessorImpl.invoke(NativeMethodAccessorImpl.java:39)
	at sun.reflect.DelegatingMethodAccessorImpl.invoke(DelegatingMethodAccessorImpl.java:25)
	at java.lang.reflect.Method.invoke(Method.java:597)
	at org.codehaus.plexus.classworlds.launcher.Launcher.launchStandard(Launcher.java:329)
	at org.codehaus.plexus.classworlds.launcher.Launcher.launch(Launcher.java:239)
	at org.jvnet.hudson.maven3.agent.Maven3Main.launch(Maven3Main.java:158)
	at hudson.maven.Maven3Builder.call(Maven3Builder.java:104)
	at hudson.maven.Maven3Builder.call(Maven3Builder.java:70)
	at hudson.remoting.UserRequest.perform(UserRequest.java:118)
	at hudson.remoting.UserRequest.perform(UserRequest.java:48)
	at hudson.remoting.Request$2.run(Request.java:287)
	at hudson.remoting.InterceptingExecutorService$1.call(InterceptingExecutorService.java:72)
	at java.util.concurrent.FutureTask$Sync.innerRun(FutureTask.java:303)
	at java.util.concurrent.FutureTask.run(FutureTask.java:138)
	at java.util.concurrent.ThreadPoolExecutor$Worker.runTask(ThreadPoolExecutor.java:886)
	at java.util.concurrent.ThreadPoolExecutor$Worker.run(ThreadPoolExecutor.java:908)
	at java.lang.Thread.run(Thread.java:662)
Caused by: org.apache.maven.plugin.CompilationFailureException: Compilation failure
	at org.apache.maven.plugin.AbstractCompilerMojo.execute(AbstractCompilerMojo.java:656)
	at org.apache.maven.plugin.CompilerMojo.execute(CompilerMojo.java:128)
	at org.apache.maven.plugin.DefaultBuildPluginManager.executeMojo(DefaultBuildPluginManager.java:107)
	at org.apache.maven.lifecycle.internal.MojoExecutor.execute(MojoExecutor.java:209)
	... 27 more
Sending e-mails to: notifications@directory.apache.org
channel stopped