You are viewing a plain text version of this content. The canonical link for it is here.
Posted to commits@sling.apache.org by Apache Jenkins Server <je...@builds.apache.org> on 2017/04/10 17:20:16 UTC
Build failed in Jenkins:
sling-bundles-extensions-healthcheck-core-1.8 #10
See <https://builds.apache.org/job/sling-bundles-extensions-healthcheck-core-1.8/10/display/redirect?page=changes>
Changes:
[justin] SLING-6773 - separate HC API from Core
------------------------------------------
Started by an SCM change
[EnvInject] - Loading node environment variables.
Building remotely on H24 (ubuntu xenial) in workspace <https://builds.apache.org/job/sling-bundles-extensions-healthcheck-core-1.8/ws/>
Checking out a fresh workspace because there's no workspace at <https://builds.apache.org/job/sling-bundles-extensions-healthcheck-core-1.8/ws/>
Cleaning local Directory .
Checking out https://svn.apache.org/repos/asf/sling/trunk/bundles/extensions/healthcheck/core at revision '2017-04-10T17:19:20.079 +0000'
A src
A src/test
A src/test/java
A src/test/java/org
A src/test/java/org/apache
A src/test/java/org/apache/sling
A src/test/java/org/apache/sling/hc
A src/test/java/org/apache/sling/hc/core
A src/test/java/org/apache/sling/hc/core/impl
A src/test/java/org/apache/sling/hc/core/impl/JmxScriptBindingsProviderTest.java
AU src/test/java/org/apache/sling/hc/core/impl/ScriptableHealthCheckTest.java
A src/test/java/org/apache/sling/hc/core/impl/executor
AU src/test/java/org/apache/sling/hc/core/impl/executor/HealthCheckResultCacheTest.java
AU src/test/java/org/apache/sling/hc/core/impl/executor/HealthCheckExecutorImplTest.java
A src/test/java/org/apache/sling/hc/core/impl/servlet
A src/test/java/org/apache/sling/hc/core/impl/servlet/HealthCheckExecutorServletTest.java
A src/test/java/org/apache/sling/hc/core/impl/CompositeHealthCheckTest.java
AU src/test/java/org/apache/sling/hc/core/impl/JmxAttributeHealthCheckTest.java
A src/test/java/org/apache/sling/hc/core/it
A src/test/java/org/apache/sling/hc/core/it/ExtendedHealthCheckExecutorIT.java
A src/test/java/org/apache/sling/hc/core/it/JmxAdjustableStatusForTestingIT.java
A src/test/java/org/apache/sling/hc/core/it/U.java
A src/test/java/org/apache/sling/hc/core/it/HealthCheckExecutorSelectionIT.java
A src/test/java/org/apache/sling/hc/core/it/HealthCheckServletIT.java
A src/test/java/org/apache/sling/hc/core/it/HealthCheckFilterIT.java
A src/test/java/org/apache/sling/hc/core/it/MockHttpService.java
A src/test/java/org/apache/sling/hc/core/it/AsyncHealthCheckIT.java
A src/test/java/org/apache/sling/hc/api
A src/test/java/org/apache/sling/hc/util
A src/test/java/org/apache/sling/hc/jmx
A src/test/java/org/apache/sling/hc/jmx/impl
AU src/test/java/org/apache/sling/hc/jmx/impl/HealthCheckMBeanTest.java
A src/main
A src/main/java
A src/main/java/org
A src/main/java/org/apache
A src/main/java/org/apache/sling
A src/main/java/org/apache/sling/hc
A src/main/java/org/apache/sling/hc/core
A src/main/java/org/apache/sling/hc/core/impl
A src/main/java/org/apache/sling/hc/core/impl/CompositeResult.java
A src/main/java/org/apache/sling/hc/core/impl/servlet
A src/main/java/org/apache/sling/hc/core/impl/servlet/ResultJsonSerializer.java
A src/main/java/org/apache/sling/hc/core/impl/servlet/HealthCheckExecutorServlet.java
A src/main/java/org/apache/sling/hc/core/impl/servlet/ResultTxtSerializer.java
A src/main/java/org/apache/sling/hc/core/impl/servlet/ResultHtmlSerializer.java
A src/main/java/org/apache/sling/hc/core/impl/CompositeHealthCheck.java
AU src/main/java/org/apache/sling/hc/core/impl/JmxAdjustableStatusForTesting.java
AU src/main/java/org/apache/sling/hc/core/impl/JmxAttributeHealthCheck.java
AU src/main/java/org/apache/sling/hc/core/impl/JmxScriptBindingsProvider.java
AU src/main/java/org/apache/sling/hc/core/impl/ScriptableHealthCheck.java
A src/main/java/org/apache/sling/hc/core/impl/executor
AU src/main/java/org/apache/sling/hc/core/impl/executor/ExecutionResult.java
AU src/main/java/org/apache/sling/hc/core/impl/executor/ExtendedHealthCheckExecutor.java
AU src/main/java/org/apache/sling/hc/core/impl/executor/HealthCheckExecutorImpl.java
AU src/main/java/org/apache/sling/hc/core/impl/executor/HealthCheckResultCache.java
AU src/main/java/org/apache/sling/hc/core/impl/executor/HealthCheckFuture.java
A src/main/java/org/apache/sling/hc/core/impl/executor/AsyncHealthCheckExecutor.java
A src/main/java/org/apache/sling/hc/api
A src/main/java/org/apache/sling/hc/api/execution
A src/main/java/org/apache/sling/hc/util
A src/main/java/org/apache/sling/hc/jmx
A src/main/java/org/apache/sling/hc/jmx/impl
AU src/main/java/org/apache/sling/hc/jmx/impl/HealthCheckMBean.java
AU src/main/java/org/apache/sling/hc/jmx/impl/HealthCheckMBeanCreator.java
A pom.xml
U .
At revision 1790879
Parsing POMs
Modules changed, recalculating dependency graph
Established TCP socket on 46481
maven33-agent.jar already up to date
maven33-interceptor.jar already up to date
maven3-interceptor-commons.jar already up to date
[sling-bundles-extensions-healthcheck-core-1.8] $ /home/jenkins/tools/java/latest1.8/bin/java -Xmx2g -Xms256m -cp /home/jenkins/jenkins-slave/maven33-agent.jar:/home/jenkins/tools/maven/apache-maven-3.3.9/boot/plexus-classworlds-2.5.2.jar:/home/jenkins/tools/maven/apache-maven-3.3.9/conf/logging jenkins.maven3.agent.Maven33Main /home/jenkins/tools/maven/apache-maven-3.3.9 /home/jenkins/jenkins-slave/slave.jar /home/jenkins/jenkins-slave/maven33-interceptor.jar /home/jenkins/jenkins-slave/maven3-interceptor-commons.jar 46481
<===[JENKINS REMOTING CAPACITY]===> channel started
Executing Maven: -B -f <https://builds.apache.org/job/sling-bundles-extensions-healthcheck-core-1.8/ws/pom.xml> -Dmaven.repo.local=/home/jenkins/jenkins-slave/maven-repositories/1 -U clean verify
[INFO] Scanning for projects...
[INFO]
[INFO] ------------------------------------------------------------------------
[INFO] Building Apache Sling Health Check Core 1.2.7-SNAPSHOT
[INFO] ------------------------------------------------------------------------
[INFO] Downloading: http://repository.apache.org/snapshots/org/apache/sling/org.apache.sling.hc.api/0.0.99-SNAPSHOT/maven-metadata.xml
[INFO] Downloading: http://repository.apache.org/snapshots/org/apache/sling/org.apache.sling.hc.api/0.0.99-SNAPSHOT/org.apache.sling.hc.api-0.0.99-SNAPSHOT.pom
[WARNING] The POM for org.apache.sling:org.apache.sling.hc.api:jar:0.0.99-SNAPSHOT is missing, no dependency information available
[INFO] Downloading: https://repo.maven.apache.org/maven2/org/slf4j/slf4j-api/1.6.2/slf4j-api-1.6.2.pom
[INFO] Downloaded: https://repo.maven.apache.org/maven2/org/slf4j/slf4j-api/1.6.2/slf4j-api-1.6.2.pom (3 KB at 16.0 KB/sec)
[INFO] Downloading: https://repo.maven.apache.org/maven2/org/slf4j/slf4j-simple/1.6.2/slf4j-simple-1.6.2.pom
[INFO] Downloaded: https://repo.maven.apache.org/maven2/org/slf4j/slf4j-simple/1.6.2/slf4j-simple-1.6.2.pom (2 KB at 8.7 KB/sec)
[INFO] Downloading: https://repo.maven.apache.org/maven2/org/ops4j/pax/exam/pax-exam-container-forked/4.6.0/pax-exam-container-forked-4.6.0.pom
[INFO] Downloaded: https://repo.maven.apache.org/maven2/org/ops4j/pax/exam/pax-exam-container-forked/4.6.0/pax-exam-container-forked-4.6.0.pom (7 KB at 39.1 KB/sec)
[INFO] Downloading: https://repo.maven.apache.org/maven2/org/ops4j/pax/exam/pax-exam-link-mvn/4.6.0/pax-exam-link-mvn-4.6.0.pom
[INFO] Downloaded: https://repo.maven.apache.org/maven2/org/ops4j/pax/exam/pax-exam-link-mvn/4.6.0/pax-exam-link-mvn-4.6.0.pom (2 KB at 7.5 KB/sec)
[INFO] Downloading: https://repo.maven.apache.org/maven2/org/ops4j/pax/url/pax-url-aether/2.4.1/pax-url-aether-2.4.1.pom
[INFO] Downloaded: https://repo.maven.apache.org/maven2/org/ops4j/pax/url/pax-url-aether/2.4.1/pax-url-aether-2.4.1.pom (12 KB at 467.0 KB/sec)
[INFO] Downloading: https://repo.maven.apache.org/maven2/org/ops4j/pax/url/2.4.1/url-2.4.1.pom
[INFO] Downloaded: https://repo.maven.apache.org/maven2/org/ops4j/pax/url/2.4.1/url-2.4.1.pom (17 KB at 670.6 KB/sec)
[INFO] Downloading: https://repo.maven.apache.org/maven2/org/ops4j/pax/url/pax-url-link/2.4.1/pax-url-link-2.4.1.pom
[INFO] Downloaded: https://repo.maven.apache.org/maven2/org/ops4j/pax/url/pax-url-link/2.4.1/pax-url-link-2.4.1.pom (3 KB at 129.7 KB/sec)
[INFO] Downloading: https://repo.maven.apache.org/maven2/org/ops4j/pax/url/pax-url-commons/2.4.1/pax-url-commons-2.4.1.pom
[INFO] Downloaded: https://repo.maven.apache.org/maven2/org/ops4j/pax/url/pax-url-commons/2.4.1/pax-url-commons-2.4.1.pom (3 KB at 126.8 KB/sec)
[INFO] Downloading: https://repo.maven.apache.org/maven2/org/ops4j/pax/swissbox/pax-swissbox-property/1.8.1/pax-swissbox-property-1.8.1.pom
[INFO] Downloaded: https://repo.maven.apache.org/maven2/org/ops4j/pax/swissbox/pax-swissbox-property/1.8.1/pax-swissbox-property-1.8.1.pom (2 KB at 91.0 KB/sec)
[INFO] Downloading: https://repo.maven.apache.org/maven2/org/ops4j/pax/url/pax-url-classpath/2.4.1/pax-url-classpath-2.4.1.pom
[INFO] Downloaded: https://repo.maven.apache.org/maven2/org/ops4j/pax/url/pax-url-classpath/2.4.1/pax-url-classpath-2.4.1.pom (3 KB at 14.3 KB/sec)
[INFO] Downloading: https://repo.maven.apache.org/maven2/org/ops4j/pax/swissbox/pax-swissbox-optional-jcl/1.8.1/pax-swissbox-optional-jcl-1.8.1.pom
[INFO] Downloaded: https://repo.maven.apache.org/maven2/org/ops4j/pax/swissbox/pax-swissbox-optional-jcl/1.8.1/pax-swissbox-optional-jcl-1.8.1.pom (2 KB at 15.9 KB/sec)
[INFO] Downloading: http://repository.apache.org/snapshots/org/apache/sling/org.apache.sling.commons.johnzon/0.1.0-SNAPSHOT/maven-metadata.xml
[INFO] Downloaded: http://repository.apache.org/snapshots/org/apache/sling/org.apache.sling.commons.johnzon/0.1.0-SNAPSHOT/maven-metadata.xml (1012 B at 2.7 KB/sec)
[INFO] Downloading: https://repo.maven.apache.org/maven2/org/apache/sling/org.apache.sling.commons.scheduler/2.3.2/org.apache.sling.commons.scheduler-2.3.2.pom
[INFO] Downloaded: https://repo.maven.apache.org/maven2/org/apache/sling/org.apache.sling.commons.scheduler/2.3.2/org.apache.sling.commons.scheduler-2.3.2.pom (5 KB at 260.7 KB/sec)
[INFO] Downloading: http://repository.apache.org/snapshots/org/apache/sling/org.apache.sling.hc.api/0.0.99-SNAPSHOT/org.apache.sling.hc.api-0.0.99-SNAPSHOT.jar
[INFO] Downloading: https://repo.maven.apache.org/maven2/org/slf4j/slf4j-api/1.6.2/slf4j-api-1.6.2.jar
[INFO] Downloading: https://repo.maven.apache.org/maven2/org/slf4j/slf4j-simple/1.6.2/slf4j-simple-1.6.2.jar
[INFO] Downloading: https://repo.maven.apache.org/maven2/org/ops4j/pax/exam/pax-exam-container-forked/4.6.0/pax-exam-container-forked-4.6.0.jar
[INFO] Downloading: https://repo.maven.apache.org/maven2/org/ops4j/pax/exam/pax-exam-link-mvn/4.6.0/pax-exam-link-mvn-4.6.0.jar
[INFO] Downloading: https://repo.maven.apache.org/maven2/org/ops4j/pax/url/pax-url-link/2.4.1/pax-url-link-2.4.1.jar
[INFO] Downloaded: https://repo.maven.apache.org/maven2/org/slf4j/slf4j-api/1.6.2/slf4j-api-1.6.2.jar (26 KB at 583.4 KB/sec)
[INFO] Downloading: https://repo.maven.apache.org/maven2/org/ops4j/pax/url/pax-url-classpath/2.4.1/pax-url-classpath-2.4.1.jar
[INFO] Downloaded: https://repo.maven.apache.org/maven2/org/ops4j/pax/url/pax-url-classpath/2.4.1/pax-url-classpath-2.4.1.jar (9 KB at 129.5 KB/sec)
[INFO] Downloading: https://repo.maven.apache.org/maven2/org/ops4j/pax/swissbox/pax-swissbox-optional-jcl/1.8.1/pax-swissbox-optional-jcl-1.8.1.jar
[INFO] Downloaded: https://repo.maven.apache.org/maven2/org/slf4j/slf4j-simple/1.6.2/slf4j-simple-1.6.2.jar (8 KB at 92.4 KB/sec)
[INFO] Downloading: https://repo.maven.apache.org/maven2/org/ops4j/pax/url/pax-url-wrap/2.4.3/pax-url-wrap-2.4.3.jar
[INFO] Downloaded: https://repo.maven.apache.org/maven2/org/ops4j/pax/exam/pax-exam-link-mvn/4.6.0/pax-exam-link-mvn-4.6.0.jar (11 KB at 128.7 KB/sec)
[INFO] Downloading: https://repo.maven.apache.org/maven2/org/apache/sling/org.apache.sling.commons.scheduler/2.3.2/org.apache.sling.commons.scheduler-2.3.2.jar
[INFO] Downloaded: https://repo.maven.apache.org/maven2/org/ops4j/pax/url/pax-url-link/2.4.1/pax-url-link-2.4.1.jar (8 KB at 88.1 KB/sec)
[INFO] Downloaded: https://repo.maven.apache.org/maven2/org/ops4j/pax/swissbox/pax-swissbox-optional-jcl/1.8.1/pax-swissbox-optional-jcl-1.8.1.jar (7 KB at 79.0 KB/sec)
[INFO] Downloaded: https://repo.maven.apache.org/maven2/org/ops4j/pax/url/pax-url-wrap/2.4.3/pax-url-wrap-2.4.3.jar (12 KB at 118.1 KB/sec)
[INFO] Downloaded: https://repo.maven.apache.org/maven2/org/apache/sling/org.apache.sling.commons.scheduler/2.3.2/org.apache.sling.commons.scheduler-2.3.2.jar (532 KB at 3034.5 KB/sec)
[INFO] Downloaded: https://repo.maven.apache.org/maven2/org/ops4j/pax/exam/pax-exam-container-forked/4.6.0/pax-exam-container-forked-4.6.0.jar (31 KB at 132.5 KB/sec)
[JENKINS] Archiving disabled
[INFO] ------------------------------------------------------------------------
[JENKINS] Archiving disabled[INFO] BUILD FAILURE
[INFO] ------------------------------------------------------------------------
[INFO] Total time: 5.505 s
[INFO] Finished at: 2017-04-10T17:20:15+00:00
[INFO] Final Memory: 20M/281M
[INFO] ------------------------------------------------------------------------
[ERROR] Failed to execute goal on project org.apache.sling.hc.core: Could not resolve dependencies for project org.apache.sling:org.apache.sling.hc.core:bundle:1.2.7-SNAPSHOT: Could not find artifact org.apache.sling:org.apache.sling.hc.api:jar:0.0.99-SNAPSHOT in Nexus (http://repository.apache.org/snapshots) -> [Help 1]
[ERROR]
[ERROR] To see the full stack trace of the errors, re-run Maven with the -e switch.
[ERROR] Re-run Maven using the -X switch to enable full debug logging.
[ERROR]
[ERROR] For more information about the errors and possible solutions, please read the following articles:
[ERROR] [Help 1] http://cwiki.apache.org/confluence/display/MAVEN/DependencyResolutionException
channel stopped
Recording test results
Jenkins build is back to normal :
sling-bundles-extensions-healthcheck-core-1.8 #15
Posted by Apache Jenkins Server <je...@builds.apache.org>.
See <https://builds.apache.org/job/sling-bundles-extensions-healthcheck-core-1.8/15/display/redirect>
Build failed in Jenkins:
sling-bundles-extensions-healthcheck-core-1.8 #14
Posted by Apache Jenkins Server <je...@builds.apache.org>.
See <https://builds.apache.org/job/sling-bundles-extensions-healthcheck-core-1.8/14/display/redirect>
------------------------------------------
Started by an SCM change
[EnvInject] - Loading node environment variables.
Building remotely on qnode2 (ubuntu) in workspace <https://builds.apache.org/job/sling-bundles-extensions-healthcheck-core-1.8/ws/>
Updating https://svn.apache.org/repos/asf/sling/trunk/bundles/extensions/healthcheck/core at revision '2017-04-27T14:47:45.772 +0000'
D src/main/java/org/apache/sling/hc/util
D src/main/java/org/apache/sling/hc/api
At revision 1792907
No changes for https://svn.apache.org/repos/asf/sling/trunk/bundles/extensions/healthcheck/core since the previous build
Parsing POMs
Established TCP socket on 40141
maven33-agent.jar already up to date
maven33-interceptor.jar already up to date
maven3-interceptor-commons.jar already up to date
[sling-bundles-extensions-healthcheck-core-1.8] $ /home/jenkins/tools/java/latest1.8/bin/java -Xmx2g -Xms256m -cp /home/jenkins/jenkins-slave/maven33-agent.jar:/home/jenkins/tools/maven/apache-maven-3.3.9/boot/plexus-classworlds-2.5.2.jar:/home/jenkins/tools/maven/apache-maven-3.3.9/conf/logging jenkins.maven3.agent.Maven33Main /home/jenkins/tools/maven/apache-maven-3.3.9 /home/jenkins/jenkins-slave/slave.jar /home/jenkins/jenkins-slave/maven33-interceptor.jar /home/jenkins/jenkins-slave/maven3-interceptor-commons.jar 40141
<===[JENKINS REMOTING CAPACITY]===> channel started
Executing Maven: -B -f <https://builds.apache.org/job/sling-bundles-extensions-healthcheck-core-1.8/ws/pom.xml> -Dmaven.repo.local=/home/jenkins/jenkins-slave/maven-repositories/1 -U clean verify
[INFO] Scanning for projects...
[INFO]
[INFO] ------------------------------------------------------------------------
[INFO] Building Apache Sling Health Check Core 1.2.7-SNAPSHOT
[INFO] ------------------------------------------------------------------------
[INFO] Downloading: http://repository.apache.org/snapshots/org/apache/sling/org.apache.sling.hc.api/0.0.99-SNAPSHOT/maven-metadata.xml
[INFO] Downloading: http://repository.apache.org/snapshots/org/apache/sling/org.apache.sling.hc.api/0.0.99-SNAPSHOT/org.apache.sling.hc.api-0.0.99-SNAPSHOT.pom
[WARNING] The POM for org.apache.sling:org.apache.sling.hc.api:jar:0.0.99-SNAPSHOT is missing, no dependency information available
[INFO] Downloading: https://repo.maven.apache.org/maven2/rhino/js/1.6R6/js-1.6R6.pom
[INFO] Downloaded: https://repo.maven.apache.org/maven2/rhino/js/1.6R6/js-1.6R6.pom (786 B at 2.3 KB/sec)
[INFO] Downloading: https://repo.maven.apache.org/maven2/org/ops4j/pax/exam/pax-exam-container-forked/4.6.0/pax-exam-container-forked-4.6.0.pom
[INFO] Downloaded: https://repo.maven.apache.org/maven2/org/ops4j/pax/exam/pax-exam-container-forked/4.6.0/pax-exam-container-forked-4.6.0.pom (7 KB at 282.0 KB/sec)
[INFO] Downloading: https://repo.maven.apache.org/maven2/org/ops4j/pax/exam/4.6.0/exam-4.6.0.pom
[INFO] Downloaded: https://repo.maven.apache.org/maven2/org/ops4j/pax/exam/4.6.0/exam-4.6.0.pom (40 KB at 1073.4 KB/sec)
[INFO] Downloading: https://repo.maven.apache.org/maven2/org/ops4j/pax/exam-reactor/4.6.0/exam-reactor-4.6.0.pom
[INFO] Downloaded: https://repo.maven.apache.org/maven2/org/ops4j/pax/exam-reactor/4.6.0/exam-reactor-4.6.0.pom (4 KB at 213.2 KB/sec)
[INFO] Downloading: https://repo.maven.apache.org/maven2/org/ops4j/pax/exam/pax-exam/4.6.0/pax-exam-4.6.0.pom
[INFO] Downloaded: https://repo.maven.apache.org/maven2/org/ops4j/pax/exam/pax-exam/4.6.0/pax-exam-4.6.0.pom (3 KB at 128.9 KB/sec)
[INFO] Downloading: https://repo.maven.apache.org/maven2/org/ops4j/pax/exam/pax-exam-spi/4.6.0/pax-exam-spi-4.6.0.pom
[INFO] Downloaded: https://repo.maven.apache.org/maven2/org/ops4j/pax/exam/pax-exam-spi/4.6.0/pax-exam-spi-4.6.0.pom (4 KB at 217.5 KB/sec)
[INFO] Downloading: https://repo.maven.apache.org/maven2/org/ops4j/pax/swissbox/pax-swissbox-framework/1.8.1/pax-swissbox-framework-1.8.1.pom
[INFO] Downloaded: https://repo.maven.apache.org/maven2/org/ops4j/pax/swissbox/pax-swissbox-framework/1.8.1/pax-swissbox-framework-1.8.1.pom (4 KB at 157.5 KB/sec)
[INFO] Downloading: https://repo.maven.apache.org/maven2/org/ops4j/pax/swissbox/1.8.1/swissbox-1.8.1.pom
[INFO] Downloaded: https://repo.maven.apache.org/maven2/org/ops4j/pax/swissbox/1.8.1/swissbox-1.8.1.pom (8 KB at 247.6 KB/sec)
[INFO] Downloading: https://repo.maven.apache.org/maven2/org/ops4j/pax/swissbox/pax-swissbox-tracker/1.8.1/pax-swissbox-tracker-1.8.1.pom
[INFO] Downloaded: https://repo.maven.apache.org/maven2/org/ops4j/pax/swissbox/pax-swissbox-tracker/1.8.1/pax-swissbox-tracker-1.8.1.pom (2 KB at 120.2 KB/sec)
[INFO] Downloading: https://repo.maven.apache.org/maven2/org/ops4j/pax/swissbox/pax-swissbox-lifecycle/1.8.1/pax-swissbox-lifecycle-1.8.1.pom
[INFO] Downloaded: https://repo.maven.apache.org/maven2/org/ops4j/pax/swissbox/pax-swissbox-lifecycle/1.8.1/pax-swissbox-lifecycle-1.8.1.pom (2 KB at 61.5 KB/sec)
[INFO] Downloading: https://repo.maven.apache.org/maven2/org/ops4j/pax/exam/pax-exam-junit4/4.6.0/pax-exam-junit4-4.6.0.pom
[INFO] Downloaded: https://repo.maven.apache.org/maven2/org/ops4j/pax/exam/pax-exam-junit4/4.6.0/pax-exam-junit4-4.6.0.pom (2 KB at 77.8 KB/sec)
[INFO] Downloading: https://repo.maven.apache.org/maven2/org/ops4j/pax/exam/pax-exam-link-mvn/4.6.0/pax-exam-link-mvn-4.6.0.pom
[INFO] Downloaded: https://repo.maven.apache.org/maven2/org/ops4j/pax/exam/pax-exam-link-mvn/4.6.0/pax-exam-link-mvn-4.6.0.pom (2 KB at 82.7 KB/sec)
[INFO] Downloading: https://repo.maven.apache.org/maven2/org/ops4j/pax/url/pax-url-aether/2.4.1/pax-url-aether-2.4.1.pom
[INFO] Downloaded: https://repo.maven.apache.org/maven2/org/ops4j/pax/url/pax-url-aether/2.4.1/pax-url-aether-2.4.1.pom (12 KB at 686.8 KB/sec)
[INFO] Downloading: https://repo.maven.apache.org/maven2/org/ops4j/pax/url/2.4.1/url-2.4.1.pom
[INFO] Downloaded: https://repo.maven.apache.org/maven2/org/ops4j/pax/url/2.4.1/url-2.4.1.pom (17 KB at 847.0 KB/sec)
[INFO] Downloading: https://repo.maven.apache.org/maven2/org/ops4j/pax/url/pax-url-link/2.4.1/pax-url-link-2.4.1.pom
[INFO] Downloaded: https://repo.maven.apache.org/maven2/org/ops4j/pax/url/pax-url-link/2.4.1/pax-url-link-2.4.1.pom (3 KB at 166.8 KB/sec)
[INFO] Downloading: https://repo.maven.apache.org/maven2/org/ops4j/pax/url/pax-url-commons/2.4.1/pax-url-commons-2.4.1.pom
[INFO] Downloaded: https://repo.maven.apache.org/maven2/org/ops4j/pax/url/pax-url-commons/2.4.1/pax-url-commons-2.4.1.pom (3 KB at 126.8 KB/sec)
[INFO] Downloading: https://repo.maven.apache.org/maven2/org/ops4j/pax/swissbox/pax-swissbox-property/1.8.1/pax-swissbox-property-1.8.1.pom
[INFO] Downloaded: https://repo.maven.apache.org/maven2/org/ops4j/pax/swissbox/pax-swissbox-property/1.8.1/pax-swissbox-property-1.8.1.pom (2 KB at 102.4 KB/sec)
[INFO] Downloading: https://repo.maven.apache.org/maven2/org/ops4j/pax/url/pax-url-classpath/2.4.1/pax-url-classpath-2.4.1.pom
[INFO] Downloaded: https://repo.maven.apache.org/maven2/org/ops4j/pax/url/pax-url-classpath/2.4.1/pax-url-classpath-2.4.1.pom (3 KB at 168.0 KB/sec)
[INFO] Downloading: https://repo.maven.apache.org/maven2/org/ops4j/pax/swissbox/pax-swissbox-optional-jcl/1.8.1/pax-swissbox-optional-jcl-1.8.1.pom
[INFO] Downloaded: https://repo.maven.apache.org/maven2/org/ops4j/pax/swissbox/pax-swissbox-optional-jcl/1.8.1/pax-swissbox-optional-jcl-1.8.1.pom (2 KB at 97.7 KB/sec)
[INFO] Downloading: https://repo.maven.apache.org/maven2/org/ops4j/pax/url/pax-url-aether/2.4.3/pax-url-aether-2.4.3.pom
[INFO] Downloaded: https://repo.maven.apache.org/maven2/org/ops4j/pax/url/pax-url-aether/2.4.3/pax-url-aether-2.4.3.pom (12 KB at 686.8 KB/sec)
[INFO] Downloading: https://repo.maven.apache.org/maven2/org/ops4j/pax/url/2.4.3/url-2.4.3.pom
[INFO] Downloaded: https://repo.maven.apache.org/maven2/org/ops4j/pax/url/2.4.3/url-2.4.3.pom (17 KB at 946.7 KB/sec)
[INFO] Downloading: https://repo.maven.apache.org/maven2/org/ops4j/pax/url/pax-url-wrap/2.4.3/pax-url-wrap-2.4.3.pom
[INFO] Downloaded: https://repo.maven.apache.org/maven2/org/ops4j/pax/url/pax-url-wrap/2.4.3/pax-url-wrap-2.4.3.pom (3 KB at 182.0 KB/sec)
[INFO] Downloading: https://repo.maven.apache.org/maven2/org/ops4j/base/ops4j-base-net/1.4.0/ops4j-base-net-1.4.0.pom
[INFO] Downloaded: https://repo.maven.apache.org/maven2/org/ops4j/base/ops4j-base-net/1.4.0/ops4j-base-net-1.4.0.pom (2 KB at 88.3 KB/sec)
[INFO] Downloading: https://repo.maven.apache.org/maven2/org/ops4j/base/ops4j-base-monitors/1.4.0/ops4j-base-monitors-1.4.0.pom
[INFO] Downloaded: https://repo.maven.apache.org/maven2/org/ops4j/base/ops4j-base-monitors/1.4.0/ops4j-base-monitors-1.4.0.pom (1005 B at 75.5 KB/sec)
[INFO] Downloading: https://repo.maven.apache.org/maven2/org/ops4j/pax/url/pax-url-commons/2.4.3/pax-url-commons-2.4.3.pom
[INFO] Downloaded: https://repo.maven.apache.org/maven2/org/ops4j/pax/url/pax-url-commons/2.4.3/pax-url-commons-2.4.3.pom (3 KB at 144.9 KB/sec)
[INFO] Downloading: https://repo.maven.apache.org/maven2/org/apache/felix/org.apache.felix.framework/5.4.0/org.apache.felix.framework-5.4.0.pom
[INFO] Downloaded: https://repo.maven.apache.org/maven2/org/apache/felix/org.apache.felix.framework/5.4.0/org.apache.felix.framework-5.4.0.pom (6 KB at 314.0 KB/sec)
[INFO] Downloading: https://repo.maven.apache.org/maven2/org/apache/sling/org.apache.sling.scripting.api/2.1.0/org.apache.sling.scripting.api-2.1.0.pom
[INFO] Downloaded: https://repo.maven.apache.org/maven2/org/apache/sling/org.apache.sling.scripting.api/2.1.0/org.apache.sling.scripting.api-2.1.0.pom (4 KB at 263.9 KB/sec)
[INFO] Downloading: https://repo.maven.apache.org/maven2/org/livetribe/livetribe-jsr223/2.0.6/livetribe-jsr223-2.0.6.pom
[INFO] Downloaded: https://repo.maven.apache.org/maven2/org/livetribe/livetribe-jsr223/2.0.6/livetribe-jsr223-2.0.6.pom (2 KB at 107.4 KB/sec)
[INFO] Downloading: https://repo.maven.apache.org/maven2/org/livetribe/livetribe/1.2/livetribe-1.2.pom
[INFO] Downloaded: https://repo.maven.apache.org/maven2/org/livetribe/livetribe/1.2/livetribe-1.2.pom (9 KB at 583.7 KB/sec)
[INFO] Downloading: https://repo.maven.apache.org/maven2/org/apache/sling/org.apache.sling.commons.threads/3.1.0/org.apache.sling.commons.threads-3.1.0.pom
[INFO] Downloaded: https://repo.maven.apache.org/maven2/org/apache/sling/org.apache.sling.commons.threads/3.1.0/org.apache.sling.commons.threads-3.1.0.pom (4 KB at 250.6 KB/sec)
[INFO] Downloading: https://repo.maven.apache.org/maven2/org/apache/sling/sling/9/sling-9.pom
[INFO] Downloaded: https://repo.maven.apache.org/maven2/org/apache/sling/sling/9/sling-9.pom (21 KB at 1152.1 KB/sec)
[INFO] Downloading: http://repository.apache.org/snapshots/org/apache/sling/org.apache.sling.commons.johnzon/0.1.0-SNAPSHOT/maven-metadata.xml
[INFO] Downloaded: http://repository.apache.org/snapshots/org/apache/sling/org.apache.sling.commons.johnzon/0.1.0-SNAPSHOT/maven-metadata.xml (1012 B at 2.5 KB/sec)
[INFO] Downloading: http://repository.apache.org/snapshots/org/apache/sling/org.apache.sling.commons.johnzon/0.1.0-SNAPSHOT/org.apache.sling.commons.johnzon-0.1.0-20170327.093309-3.pom
[INFO] Downloaded: http://repository.apache.org/snapshots/org/apache/sling/org.apache.sling.commons.johnzon/0.1.0-SNAPSHOT/org.apache.sling.commons.johnzon-0.1.0-20170327.093309-3.pom (4 KB at 8.2 KB/sec)
[INFO] Downloading: https://repo.maven.apache.org/maven2/org/apache/sling/org.apache.sling.commons.scheduler/2.3.2/org.apache.sling.commons.scheduler-2.3.2.pom
[INFO] Downloaded: https://repo.maven.apache.org/maven2/org/apache/sling/org.apache.sling.commons.scheduler/2.3.2/org.apache.sling.commons.scheduler-2.3.2.pom (5 KB at 361.0 KB/sec)
[INFO] Downloading: https://repo.maven.apache.org/maven2/org/quartz-scheduler/quartz/2.1.1/quartz-2.1.1.pom
[INFO] Downloaded: https://repo.maven.apache.org/maven2/org/quartz-scheduler/quartz/2.1.1/quartz-2.1.1.pom (6 KB at 376.4 KB/sec)
[INFO] Downloading: https://repo.maven.apache.org/maven2/org/quartz-scheduler/quartz-parent/2.1.1/quartz-parent-2.1.1.pom
[INFO] Downloaded: https://repo.maven.apache.org/maven2/org/quartz-scheduler/quartz-parent/2.1.1/quartz-parent-2.1.1.pom (13 KB at 808.3 KB/sec)
[INFO] Downloading: http://repository.apache.org/snapshots/org/apache/sling/org.apache.sling.hc.api/0.0.99-SNAPSHOT/org.apache.sling.hc.api-0.0.99-SNAPSHOT.jar
[INFO] Downloading: http://repository.apache.org/snapshots/org/apache/sling/org.apache.sling.commons.johnzon/0.1.0-SNAPSHOT/org.apache.sling.commons.johnzon-0.1.0-20170327.093309-3.jar
[INFO] Downloaded: http://repository.apache.org/snapshots/org/apache/sling/org.apache.sling.commons.johnzon/0.1.0-SNAPSHOT/org.apache.sling.commons.johnzon-0.1.0-20170327.093309-3.jar (106 KB at 153.7 KB/sec)
[INFO] Downloading: https://repo.maven.apache.org/maven2/rhino/js/1.6R6/js-1.6R6.jar
[INFO] Downloading: https://repo.maven.apache.org/maven2/org/ops4j/pax/exam/pax-exam-container-forked/4.6.0/pax-exam-container-forked-4.6.0.jar
[INFO] Downloading: https://repo.maven.apache.org/maven2/org/ops4j/pax/exam/pax-exam/4.6.0/pax-exam-4.6.0.jar
[INFO] Downloading: https://repo.maven.apache.org/maven2/org/ops4j/pax/swissbox/pax-swissbox-framework/1.8.1/pax-swissbox-framework-1.8.1.jar
[INFO] Downloading: https://repo.maven.apache.org/maven2/org/ops4j/pax/exam/pax-exam-spi/4.6.0/pax-exam-spi-4.6.0.jar
[INFO] Downloaded: https://repo.maven.apache.org/maven2/org/ops4j/pax/exam/pax-exam-container-forked/4.6.0/pax-exam-container-forked-4.6.0.jar (31 KB at 701.6 KB/sec)
[INFO] Downloading: https://repo.maven.apache.org/maven2/org/ops4j/pax/swissbox/pax-swissbox-tracker/1.8.1/pax-swissbox-tracker-1.8.1.jar
[INFO] Downloaded: https://repo.maven.apache.org/maven2/org/ops4j/pax/exam/pax-exam-spi/4.6.0/pax-exam-spi-4.6.0.jar (67 KB at 682.3 KB/sec)
[INFO] Downloading: https://repo.maven.apache.org/maven2/org/ops4j/pax/swissbox/pax-swissbox-lifecycle/1.8.1/pax-swissbox-lifecycle-1.8.1.jar
[INFO] Downloaded: https://repo.maven.apache.org/maven2/org/ops4j/pax/swissbox/pax-swissbox-lifecycle/1.8.1/pax-swissbox-lifecycle-1.8.1.jar (7 KB at 56.3 KB/sec)
[INFO] Downloading: https://repo.maven.apache.org/maven2/org/ops4j/pax/exam/pax-exam-junit4/4.6.0/pax-exam-junit4-4.6.0.jar
[INFO] Downloaded: https://repo.maven.apache.org/maven2/org/ops4j/pax/swissbox/pax-swissbox-framework/1.8.1/pax-swissbox-framework-1.8.1.jar (14 KB at 107.3 KB/sec)
[INFO] Downloading: https://repo.maven.apache.org/maven2/org/ops4j/pax/exam/pax-exam-link-mvn/4.6.0/pax-exam-link-mvn-4.6.0.jar
[INFO] Downloaded: https://repo.maven.apache.org/maven2/org/ops4j/pax/swissbox/pax-swissbox-tracker/1.8.1/pax-swissbox-tracker-1.8.1.jar (15 KB at 109.3 KB/sec)
[INFO] Downloading: https://repo.maven.apache.org/maven2/org/ops4j/pax/url/pax-url-link/2.4.1/pax-url-link-2.4.1.jar
[INFO] Downloaded: https://repo.maven.apache.org/maven2/org/ops4j/pax/exam/pax-exam-junit4/4.6.0/pax-exam-junit4-4.6.0.jar (34 KB at 222.8 KB/sec)
[INFO] Downloading: https://repo.maven.apache.org/maven2/org/ops4j/pax/url/pax-url-classpath/2.4.1/pax-url-classpath-2.4.1.jar
[INFO] Downloaded: https://repo.maven.apache.org/maven2/org/ops4j/pax/url/pax-url-link/2.4.1/pax-url-link-2.4.1.jar (8 KB at 42.7 KB/sec)
[INFO] Downloading: https://repo.maven.apache.org/maven2/org/ops4j/pax/swissbox/pax-swissbox-optional-jcl/1.8.1/pax-swissbox-optional-jcl-1.8.1.jar
[INFO] Downloaded: https://repo.maven.apache.org/maven2/org/ops4j/pax/exam/pax-exam/4.6.0/pax-exam-4.6.0.jar (78 KB at 389.5 KB/sec)
[INFO] Downloaded: https://repo.maven.apache.org/maven2/org/ops4j/pax/url/pax-url-classpath/2.4.1/pax-url-classpath-2.4.1.jar (9 KB at 48.6 KB/sec)
[INFO] Downloading: https://repo.maven.apache.org/maven2/org/ops4j/pax/url/pax-url-aether/2.4.3/pax-url-aether-2.4.3.jar
[INFO] Downloading: https://repo.maven.apache.org/maven2/org/ops4j/pax/url/pax-url-wrap/2.4.3/pax-url-wrap-2.4.3.jar
[INFO] Downloaded: https://repo.maven.apache.org/maven2/org/ops4j/pax/exam/pax-exam-link-mvn/4.6.0/pax-exam-link-mvn-4.6.0.jar (11 KB at 53.3 KB/sec)
[INFO] Downloading: https://repo.maven.apache.org/maven2/org/ops4j/pax/url/pax-url-commons/2.4.3/pax-url-commons-2.4.3.jar
[INFO] Downloaded: https://repo.maven.apache.org/maven2/org/ops4j/pax/swissbox/pax-swissbox-optional-jcl/1.8.1/pax-swissbox-optional-jcl-1.8.1.jar (7 KB at 32.0 KB/sec)
[INFO] Downloading: https://repo.maven.apache.org/maven2/org/apache/felix/org.apache.felix.framework/5.4.0/org.apache.felix.framework-5.4.0.jar
[INFO] Downloaded: https://repo.maven.apache.org/maven2/org/ops4j/pax/url/pax-url-commons/2.4.3/pax-url-commons-2.4.3.jar (10 KB at 43.1 KB/sec)
[INFO] Downloading: https://repo.maven.apache.org/maven2/org/apache/sling/org.apache.sling.scripting.api/2.1.0/org.apache.sling.scripting.api-2.1.0.jar
[INFO] Downloaded: https://repo.maven.apache.org/maven2/org/apache/sling/org.apache.sling.scripting.api/2.1.0/org.apache.sling.scripting.api-2.1.0.jar (28 KB at 120.9 KB/sec)
[INFO] Downloading: https://repo.maven.apache.org/maven2/org/livetribe/livetribe-jsr223/2.0.6/livetribe-jsr223-2.0.6.jar
[INFO] Downloaded: https://repo.maven.apache.org/maven2/org/ops4j/pax/url/pax-url-wrap/2.4.3/pax-url-wrap-2.4.3.jar (12 KB at 47.7 KB/sec)
[INFO] Downloading: https://repo.maven.apache.org/maven2/org/apache/sling/org.apache.sling.commons.threads/3.1.0/org.apache.sling.commons.threads-3.1.0.jar
[INFO] Downloaded: https://repo.maven.apache.org/maven2/org/livetribe/livetribe-jsr223/2.0.6/livetribe-jsr223-2.0.6.jar (15 KB at 59.2 KB/sec)
[INFO] Downloading: https://repo.maven.apache.org/maven2/org/apache/sling/org.apache.sling.commons.scheduler/2.3.2/org.apache.sling.commons.scheduler-2.3.2.jar
[INFO] Downloaded: https://repo.maven.apache.org/maven2/org/apache/sling/org.apache.sling.commons.threads/3.1.0/org.apache.sling.commons.threads-3.1.0.jar (31 KB at 116.1 KB/sec)
[INFO] Downloading: https://repo.maven.apache.org/maven2/org/quartz-scheduler/quartz/2.1.1/quartz-2.1.1.jar
[INFO] Downloaded: https://repo.maven.apache.org/maven2/rhino/js/1.6R6/js-1.6R6.jar (794 KB at 2691.0 KB/sec)
[INFO] Downloaded: https://repo.maven.apache.org/maven2/org/apache/felix/org.apache.felix.framework/5.4.0/org.apache.felix.framework-5.4.0.jar (663 KB at 2238.6 KB/sec)
[INFO] Downloaded: https://repo.maven.apache.org/maven2/org/apache/sling/org.apache.sling.commons.scheduler/2.3.2/org.apache.sling.commons.scheduler-2.3.2.jar (532 KB at 1619.0 KB/sec)
[INFO] Downloaded: https://repo.maven.apache.org/maven2/org/quartz-scheduler/quartz/2.1.1/quartz-2.1.1.jar (542 KB at 1529.3 KB/sec)
[INFO] Downloaded: https://repo.maven.apache.org/maven2/org/ops4j/pax/url/pax-url-aether/2.4.3/pax-url-aether-2.4.3.jar (2861 KB at 5247.9 KB/sec)
[JENKINS] Archiving disabled
[JENKINS] Archiving disabled
[INFO] ------------------------------------------------------------------------
[INFO] BUILD FAILURE
[INFO] ------------------------------------------------------------------------
[INFO] Total time: 15.692 s
[INFO] Finished at: 2017-04-27T14:48:28+00:00
[INFO] Final Memory: 20M/292M
[INFO] ------------------------------------------------------------------------
Waiting for Jenkins to finish collecting data
[ERROR] Failed to execute goal on project org.apache.sling.hc.core: Could not resolve dependencies for project org.apache.sling:org.apache.sling.hc.core:bundle:1.2.7-SNAPSHOT: Could not find artifact org.apache.sling:org.apache.sling.hc.api:jar:0.0.99-SNAPSHOT in Nexus (http://repository.apache.org/snapshots) -> [Help 1]
[ERROR]
[ERROR] To see the full stack trace of the errors, re-run Maven with the -e switch.
[ERROR] Re-run Maven using the -X switch to enable full debug logging.
[ERROR]
[ERROR] For more information about the errors and possible solutions, please read the following articles:
[ERROR] [Help 1] http://cwiki.apache.org/confluence/display/MAVEN/DependencyResolutionException
channel stopped
Recording test results
Build failed in Jenkins:
sling-bundles-extensions-healthcheck-core-1.8 #13
Posted by Apache Jenkins Server <je...@builds.apache.org>.
See <https://builds.apache.org/job/sling-bundles-extensions-healthcheck-core-1.8/13/display/redirect?page=changes>
Changes:
[cziegeler] Remove empty directories
------------------------------------------
Started by upstream project "sling-bundles-extensions-healthcheck-api-1.8" build number 2
originally caused by:
Started by an SCM change
[EnvInject] - Loading node environment variables.
Building remotely on ubuntu-us1 (ubuntu trusty) in workspace <https://builds.apache.org/job/sling-bundles-extensions-healthcheck-core-1.8/ws/>
Checking out a fresh workspace because there's no workspace at <https://builds.apache.org/job/sling-bundles-extensions-healthcheck-core-1.8/ws/>
Cleaning local Directory .
Checking out https://svn.apache.org/repos/asf/sling/trunk/bundles/extensions/healthcheck/core at revision '2017-04-27T14:20:20.413 +0000'
A src
A src/main
A src/main/java
A src/main/java/org
A src/main/java/org/apache
A src/main/java/org/apache/sling
A src/main/java/org/apache/sling/hc
A src/main/java/org/apache/sling/hc/jmx
A src/main/java/org/apache/sling/hc/jmx/impl
AU src/main/java/org/apache/sling/hc/jmx/impl/HealthCheckMBean.java
AU src/main/java/org/apache/sling/hc/jmx/impl/HealthCheckMBeanCreator.java
A src/main/java/org/apache/sling/hc/core
A src/main/java/org/apache/sling/hc/core/impl
AU src/main/java/org/apache/sling/hc/core/impl/JmxScriptBindingsProvider.java
AU src/main/java/org/apache/sling/hc/core/impl/ScriptableHealthCheck.java
A src/main/java/org/apache/sling/hc/core/impl/executor
AU src/main/java/org/apache/sling/hc/core/impl/executor/ExecutionResult.java
AU src/main/java/org/apache/sling/hc/core/impl/executor/ExtendedHealthCheckExecutor.java
AU src/main/java/org/apache/sling/hc/core/impl/executor/HealthCheckExecutorImpl.java
AU src/main/java/org/apache/sling/hc/core/impl/executor/HealthCheckResultCache.java
AU src/main/java/org/apache/sling/hc/core/impl/executor/HealthCheckFuture.java
A src/main/java/org/apache/sling/hc/core/impl/executor/AsyncHealthCheckExecutor.java
A src/main/java/org/apache/sling/hc/core/impl/CompositeResult.java
A src/main/java/org/apache/sling/hc/core/impl/servlet
A src/main/java/org/apache/sling/hc/core/impl/servlet/HealthCheckExecutorServlet.java
A src/main/java/org/apache/sling/hc/core/impl/servlet/ResultTxtSerializer.java
A src/main/java/org/apache/sling/hc/core/impl/servlet/ResultHtmlSerializer.java
A src/main/java/org/apache/sling/hc/core/impl/servlet/ResultJsonSerializer.java
A src/main/java/org/apache/sling/hc/core/impl/CompositeHealthCheck.java
AU src/main/java/org/apache/sling/hc/core/impl/JmxAdjustableStatusForTesting.java
AU src/main/java/org/apache/sling/hc/core/impl/JmxAttributeHealthCheck.java
A src/test
A src/test/java
A src/test/java/org
A src/test/java/org/apache
A src/test/java/org/apache/sling
A src/test/java/org/apache/sling/hc
A src/test/java/org/apache/sling/hc/core
A src/test/java/org/apache/sling/hc/core/impl
A src/test/java/org/apache/sling/hc/core/impl/JmxScriptBindingsProviderTest.java
AU src/test/java/org/apache/sling/hc/core/impl/ScriptableHealthCheckTest.java
A src/test/java/org/apache/sling/hc/core/impl/executor
AU src/test/java/org/apache/sling/hc/core/impl/executor/HealthCheckExecutorImplTest.java
AU src/test/java/org/apache/sling/hc/core/impl/executor/HealthCheckResultCacheTest.java
A src/test/java/org/apache/sling/hc/core/impl/servlet
A src/test/java/org/apache/sling/hc/core/impl/servlet/HealthCheckExecutorServletTest.java
A src/test/java/org/apache/sling/hc/core/impl/CompositeHealthCheckTest.java
AU src/test/java/org/apache/sling/hc/core/impl/JmxAttributeHealthCheckTest.java
A src/test/java/org/apache/sling/hc/core/it
A src/test/java/org/apache/sling/hc/core/it/HealthCheckFilterIT.java
A src/test/java/org/apache/sling/hc/core/it/MockHttpService.java
A src/test/java/org/apache/sling/hc/core/it/AsyncHealthCheckIT.java
A src/test/java/org/apache/sling/hc/core/it/ExtendedHealthCheckExecutorIT.java
A src/test/java/org/apache/sling/hc/core/it/JmxAdjustableStatusForTestingIT.java
A src/test/java/org/apache/sling/hc/core/it/U.java
A src/test/java/org/apache/sling/hc/core/it/HealthCheckExecutorSelectionIT.java
A src/test/java/org/apache/sling/hc/core/it/HealthCheckServletIT.java
A src/test/java/org/apache/sling/hc/api
A src/test/java/org/apache/sling/hc/util
A src/test/java/org/apache/sling/hc/jmx
A src/test/java/org/apache/sling/hc/jmx/impl
AU src/test/java/org/apache/sling/hc/jmx/impl/HealthCheckMBeanTest.java
A pom.xml
U .
At revision 1792902
Parsing POMs
Established TCP socket on 55745
maven33-agent.jar already up to date
maven33-interceptor.jar already up to date
maven3-interceptor-commons.jar already up to date
[sling-bundles-extensions-healthcheck-core-1.8] $ /home/jenkins/tools/java/latest1.8/bin/java -Xmx2g -Xms256m -cp /home/jenkins/jenkins-slave/maven33-agent.jar:/home/jenkins/tools/maven/apache-maven-3.3.9/boot/plexus-classworlds-2.5.2.jar:/home/jenkins/tools/maven/apache-maven-3.3.9/conf/logging jenkins.maven3.agent.Maven33Main /home/jenkins/tools/maven/apache-maven-3.3.9 /home/jenkins/jenkins-slave/slave.jar /home/jenkins/jenkins-slave/maven33-interceptor.jar /home/jenkins/jenkins-slave/maven3-interceptor-commons.jar 55745
<===[JENKINS REMOTING CAPACITY]===> channel started
Executing Maven: -B -f <https://builds.apache.org/job/sling-bundles-extensions-healthcheck-core-1.8/ws/pom.xml> -Dmaven.repo.local=/home/jenkins/jenkins-slave/maven-repositories/0 -U clean verify
[INFO] Scanning for projects...
[INFO]
[INFO] ------------------------------------------------------------------------
[INFO] Building Apache Sling Health Check Core 1.2.7-SNAPSHOT
[INFO] ------------------------------------------------------------------------
[INFO] Downloading: http://repository.apache.org/snapshots/org/apache/sling/org.apache.sling.hc.api/0.0.99-SNAPSHOT/maven-metadata.xml
[INFO] Downloading: http://repository.apache.org/snapshots/org/apache/sling/org.apache.sling.hc.api/0.0.99-SNAPSHOT/org.apache.sling.hc.api-0.0.99-SNAPSHOT.pom
[WARNING] The POM for org.apache.sling:org.apache.sling.hc.api:jar:0.0.99-SNAPSHOT is missing, no dependency information available
[INFO] Downloading: http://repository.apache.org/snapshots/org/apache/sling/org.apache.sling.commons.johnzon/0.1.0-SNAPSHOT/maven-metadata.xml
[INFO] Downloaded: http://repository.apache.org/snapshots/org/apache/sling/org.apache.sling.commons.johnzon/0.1.0-SNAPSHOT/maven-metadata.xml (1012 B at 22.0 KB/sec)
[INFO] Downloading: http://repository.apache.org/snapshots/org/apache/sling/org.apache.sling.hc.api/0.0.99-SNAPSHOT/org.apache.sling.hc.api-0.0.99-SNAPSHOT.jar
[JENKINS] Archiving disabled
[JENKINS] Archiving disabled
[INFO] ------------------------------------------------------------------------
[INFO] BUILD FAILURE
[INFO] ------------------------------------------------------------------------
[INFO] Total time: 7.775 s
[INFO] Finished at: 2017-04-27T14:20:57+00:00
[INFO] Final Memory: 17M/288M
[INFO] ------------------------------------------------------------------------
Waiting for Jenkins to finish collecting data
[ERROR] Failed to execute goal on project org.apache.sling.hc.core: Could not resolve dependencies for project org.apache.sling:org.apache.sling.hc.core:bundle:1.2.7-SNAPSHOT: Could not find artifact org.apache.sling:org.apache.sling.hc.api:jar:0.0.99-SNAPSHOT in Nexus (http://repository.apache.org/snapshots) -> [Help 1]
[ERROR]
[ERROR] To see the full stack trace of the errors, re-run Maven with the -e switch.
[ERROR] Re-run Maven using the -X switch to enable full debug logging.
[ERROR]
[ERROR] For more information about the errors and possible solutions, please read the following articles:
[ERROR] [Help 1] http://cwiki.apache.org/confluence/display/MAVEN/DependencyResolutionException
channel stopped
Recording test results
Build failed in Jenkins:
sling-bundles-extensions-healthcheck-core-1.8 #12
Posted by Apache Jenkins Server <je...@builds.apache.org>.
See <https://builds.apache.org/job/sling-bundles-extensions-healthcheck-core-1.8/12/display/redirect>
------------------------------------------
Started by upstream project "sling-bundles-commons-johnzon-1.8" build number 3
originally caused by:
Started by an SCM change
[EnvInject] - Loading node environment variables.
Building remotely on qnode2 (ubuntu) in workspace <https://builds.apache.org/job/sling-bundles-extensions-healthcheck-core-1.8/ws/>
Checking out a fresh workspace because there's no workspace at <https://builds.apache.org/job/sling-bundles-extensions-healthcheck-core-1.8/ws/>
Cleaning local Directory .
Checking out https://svn.apache.org/repos/asf/sling/trunk/bundles/extensions/healthcheck/core at revision '2017-04-27T08:23:39.993 +0000'
A src
A src/test
A src/test/java
A src/test/java/org
A src/test/java/org/apache
A src/test/java/org/apache/sling
A src/test/java/org/apache/sling/hc
A src/test/java/org/apache/sling/hc/core
A src/test/java/org/apache/sling/hc/core/impl
A src/test/java/org/apache/sling/hc/core/impl/JmxScriptBindingsProviderTest.java
AU src/test/java/org/apache/sling/hc/core/impl/ScriptableHealthCheckTest.java
A src/test/java/org/apache/sling/hc/core/impl/executor
AU src/test/java/org/apache/sling/hc/core/impl/executor/HealthCheckExecutorImplTest.java
AU src/test/java/org/apache/sling/hc/core/impl/executor/HealthCheckResultCacheTest.java
A src/test/java/org/apache/sling/hc/core/impl/servlet
A src/test/java/org/apache/sling/hc/core/impl/servlet/HealthCheckExecutorServletTest.java
A src/test/java/org/apache/sling/hc/core/impl/CompositeHealthCheckTest.java
AU src/test/java/org/apache/sling/hc/core/impl/JmxAttributeHealthCheckTest.java
A src/test/java/org/apache/sling/hc/core/it
A src/test/java/org/apache/sling/hc/core/it/MockHttpService.java
A src/test/java/org/apache/sling/hc/core/it/AsyncHealthCheckIT.java
A src/test/java/org/apache/sling/hc/core/it/ExtendedHealthCheckExecutorIT.java
A src/test/java/org/apache/sling/hc/core/it/JmxAdjustableStatusForTestingIT.java
A src/test/java/org/apache/sling/hc/core/it/U.java
A src/test/java/org/apache/sling/hc/core/it/HealthCheckExecutorSelectionIT.java
A src/test/java/org/apache/sling/hc/core/it/HealthCheckServletIT.java
A src/test/java/org/apache/sling/hc/core/it/HealthCheckFilterIT.java
A src/test/java/org/apache/sling/hc/api
A src/test/java/org/apache/sling/hc/util
A src/test/java/org/apache/sling/hc/jmx
A src/test/java/org/apache/sling/hc/jmx/impl
AU src/test/java/org/apache/sling/hc/jmx/impl/HealthCheckMBeanTest.java
A src/main
A src/main/java
A src/main/java/org
A src/main/java/org/apache
A src/main/java/org/apache/sling
A src/main/java/org/apache/sling/hc
A src/main/java/org/apache/sling/hc/core
A src/main/java/org/apache/sling/hc/core/impl
A src/main/java/org/apache/sling/hc/core/impl/servlet
A src/main/java/org/apache/sling/hc/core/impl/servlet/HealthCheckExecutorServlet.java
A src/main/java/org/apache/sling/hc/core/impl/servlet/ResultTxtSerializer.java
A src/main/java/org/apache/sling/hc/core/impl/servlet/ResultHtmlSerializer.java
A src/main/java/org/apache/sling/hc/core/impl/servlet/ResultJsonSerializer.java
A src/main/java/org/apache/sling/hc/core/impl/CompositeHealthCheck.java
AU src/main/java/org/apache/sling/hc/core/impl/JmxAdjustableStatusForTesting.java
AU src/main/java/org/apache/sling/hc/core/impl/JmxAttributeHealthCheck.java
AU src/main/java/org/apache/sling/hc/core/impl/JmxScriptBindingsProvider.java
AU src/main/java/org/apache/sling/hc/core/impl/ScriptableHealthCheck.java
A src/main/java/org/apache/sling/hc/core/impl/executor
AU src/main/java/org/apache/sling/hc/core/impl/executor/HealthCheckFuture.java
A src/main/java/org/apache/sling/hc/core/impl/executor/AsyncHealthCheckExecutor.java
AU src/main/java/org/apache/sling/hc/core/impl/executor/ExecutionResult.java
AU src/main/java/org/apache/sling/hc/core/impl/executor/ExtendedHealthCheckExecutor.java
AU src/main/java/org/apache/sling/hc/core/impl/executor/HealthCheckExecutorImpl.java
AU src/main/java/org/apache/sling/hc/core/impl/executor/HealthCheckResultCache.java
A src/main/java/org/apache/sling/hc/core/impl/CompositeResult.java
A src/main/java/org/apache/sling/hc/api
A src/main/java/org/apache/sling/hc/api/execution
A src/main/java/org/apache/sling/hc/util
A src/main/java/org/apache/sling/hc/jmx
A src/main/java/org/apache/sling/hc/jmx/impl
AU src/main/java/org/apache/sling/hc/jmx/impl/HealthCheckMBean.java
AU src/main/java/org/apache/sling/hc/jmx/impl/HealthCheckMBeanCreator.java
A pom.xml
U .
At revision 1792849
No changes for https://svn.apache.org/repos/asf/sling/trunk/bundles/extensions/healthcheck/core since the previous build
Parsing POMs
Established TCP socket on 41353
maven33-agent.jar already up to date
maven33-interceptor.jar already up to date
maven3-interceptor-commons.jar already up to date
[sling-bundles-extensions-healthcheck-core-1.8] $ /home/jenkins/tools/java/latest1.8/bin/java -Xmx2g -Xms256m -cp /home/jenkins/jenkins-slave/maven33-agent.jar:/home/jenkins/tools/maven/apache-maven-3.3.9/boot/plexus-classworlds-2.5.2.jar:/home/jenkins/tools/maven/apache-maven-3.3.9/conf/logging jenkins.maven3.agent.Maven33Main /home/jenkins/tools/maven/apache-maven-3.3.9 /home/jenkins/jenkins-slave/slave.jar /home/jenkins/jenkins-slave/maven33-interceptor.jar /home/jenkins/jenkins-slave/maven3-interceptor-commons.jar 41353
<===[JENKINS REMOTING CAPACITY]===> channel started
Executing Maven: -B -f <https://builds.apache.org/job/sling-bundles-extensions-healthcheck-core-1.8/ws/pom.xml> -Dmaven.repo.local=/home/jenkins/jenkins-slave/maven-repositories/0 -U clean verify
[INFO] Scanning for projects...
[INFO]
[INFO] ------------------------------------------------------------------------
[INFO] Building Apache Sling Health Check Core 1.2.7-SNAPSHOT
[INFO] ------------------------------------------------------------------------
[INFO] Downloading: http://repository.apache.org/snapshots/org/apache/sling/org.apache.sling.hc.api/0.0.99-SNAPSHOT/maven-metadata.xml
[INFO] Downloading: http://repository.apache.org/snapshots/org/apache/sling/org.apache.sling.hc.api/0.0.99-SNAPSHOT/org.apache.sling.hc.api-0.0.99-SNAPSHOT.pom
[WARNING] The POM for org.apache.sling:org.apache.sling.hc.api:jar:0.0.99-SNAPSHOT is missing, no dependency information available
[INFO] Downloading: https://repo.maven.apache.org/maven2/org/slf4j/slf4j-api/1.6.2/slf4j-api-1.6.2.pom
[INFO] Downloaded: https://repo.maven.apache.org/maven2/org/slf4j/slf4j-api/1.6.2/slf4j-api-1.6.2.pom (3 KB at 10.3 KB/sec)
[INFO] Downloading: https://repo.maven.apache.org/maven2/org/slf4j/slf4j-simple/1.6.2/slf4j-simple-1.6.2.pom
[INFO] Downloaded: https://repo.maven.apache.org/maven2/org/slf4j/slf4j-simple/1.6.2/slf4j-simple-1.6.2.pom (2 KB at 89.4 KB/sec)
[INFO] Downloading: https://repo.maven.apache.org/maven2/org/ops4j/pax/exam/pax-exam-container-forked/4.6.0/pax-exam-container-forked-4.6.0.pom
[INFO] Downloaded: https://repo.maven.apache.org/maven2/org/ops4j/pax/exam/pax-exam-container-forked/4.6.0/pax-exam-container-forked-4.6.0.pom (7 KB at 324.3 KB/sec)
[INFO] Downloading: https://repo.maven.apache.org/maven2/org/ops4j/pax/exam/4.6.0/exam-4.6.0.pom
[INFO] Downloaded: https://repo.maven.apache.org/maven2/org/ops4j/pax/exam/4.6.0/exam-4.6.0.pom (40 KB at 1134.7 KB/sec)
[INFO] Downloading: https://repo.maven.apache.org/maven2/org/ops4j/pax/exam-reactor/4.6.0/exam-reactor-4.6.0.pom
[INFO] Downloaded: https://repo.maven.apache.org/maven2/org/ops4j/pax/exam-reactor/4.6.0/exam-reactor-4.6.0.pom (4 KB at 274.1 KB/sec)
[INFO] Downloading: https://repo.maven.apache.org/maven2/org/ops4j/pax/exam/pax-exam/4.6.0/pax-exam-4.6.0.pom
[INFO] Downloaded: https://repo.maven.apache.org/maven2/org/ops4j/pax/exam/pax-exam/4.6.0/pax-exam-4.6.0.pom (3 KB at 163.3 KB/sec)
[INFO] Downloading: https://repo.maven.apache.org/maven2/org/ops4j/pax/exam/pax-exam-spi/4.6.0/pax-exam-spi-4.6.0.pom
[INFO] Downloaded: https://repo.maven.apache.org/maven2/org/ops4j/pax/exam/pax-exam-spi/4.6.0/pax-exam-spi-4.6.0.pom (4 KB at 233.0 KB/sec)
[INFO] Downloading: https://repo.maven.apache.org/maven2/org/ops4j/pax/swissbox/pax-swissbox-framework/1.8.1/pax-swissbox-framework-1.8.1.pom
[INFO] Downloaded: https://repo.maven.apache.org/maven2/org/ops4j/pax/swissbox/pax-swissbox-framework/1.8.1/pax-swissbox-framework-1.8.1.pom (4 KB at 258.7 KB/sec)
[INFO] Downloading: https://repo.maven.apache.org/maven2/org/ops4j/pax/swissbox/1.8.1/swissbox-1.8.1.pom
[INFO] Downloaded: https://repo.maven.apache.org/maven2/org/ops4j/pax/swissbox/1.8.1/swissbox-1.8.1.pom (8 KB at 495.2 KB/sec)
[INFO] Downloading: https://repo.maven.apache.org/maven2/org/ops4j/pax/swissbox/pax-swissbox-tracker/1.8.1/pax-swissbox-tracker-1.8.1.pom
[INFO] Downloaded: https://repo.maven.apache.org/maven2/org/ops4j/pax/swissbox/pax-swissbox-tracker/1.8.1/pax-swissbox-tracker-1.8.1.pom (2 KB at 105.2 KB/sec)
[INFO] Downloading: https://repo.maven.apache.org/maven2/org/ops4j/pax/swissbox/pax-swissbox-lifecycle/1.8.1/pax-swissbox-lifecycle-1.8.1.pom
[INFO] Downloaded: https://repo.maven.apache.org/maven2/org/ops4j/pax/swissbox/pax-swissbox-lifecycle/1.8.1/pax-swissbox-lifecycle-1.8.1.pom (2 KB at 73.8 KB/sec)
[INFO] Downloading: https://repo.maven.apache.org/maven2/org/ops4j/pax/exam/pax-exam-junit4/4.6.0/pax-exam-junit4-4.6.0.pom
[INFO] Downloaded: https://repo.maven.apache.org/maven2/org/ops4j/pax/exam/pax-exam-junit4/4.6.0/pax-exam-junit4-4.6.0.pom (2 KB at 88.9 KB/sec)
[INFO] Downloading: https://repo.maven.apache.org/maven2/org/ops4j/pax/exam/pax-exam-link-mvn/4.6.0/pax-exam-link-mvn-4.6.0.pom
[INFO] Downloaded: https://repo.maven.apache.org/maven2/org/ops4j/pax/exam/pax-exam-link-mvn/4.6.0/pax-exam-link-mvn-4.6.0.pom (2 KB at 88.7 KB/sec)
[INFO] Downloading: https://repo.maven.apache.org/maven2/org/ops4j/pax/url/pax-url-aether/2.4.1/pax-url-aether-2.4.1.pom
[INFO] Downloaded: https://repo.maven.apache.org/maven2/org/ops4j/pax/url/pax-url-aether/2.4.1/pax-url-aether-2.4.1.pom (12 KB at 729.7 KB/sec)
[INFO] Downloading: https://repo.maven.apache.org/maven2/org/ops4j/pax/url/2.4.1/url-2.4.1.pom
[INFO] Downloaded: https://repo.maven.apache.org/maven2/org/ops4j/pax/url/2.4.1/url-2.4.1.pom (17 KB at 946.7 KB/sec)
[INFO] Downloading: https://repo.maven.apache.org/maven2/org/ops4j/pax/url/pax-url-link/2.4.1/pax-url-link-2.4.1.pom
[INFO] Downloaded: https://repo.maven.apache.org/maven2/org/ops4j/pax/url/pax-url-link/2.4.1/pax-url-link-2.4.1.pom (3 KB at 155.7 KB/sec)
[INFO] Downloading: https://repo.maven.apache.org/maven2/org/ops4j/pax/url/pax-url-commons/2.4.1/pax-url-commons-2.4.1.pom
[INFO] Downloaded: https://repo.maven.apache.org/maven2/org/ops4j/pax/url/pax-url-commons/2.4.1/pax-url-commons-2.4.1.pom (3 KB at 135.2 KB/sec)
[INFO] Downloading: https://repo.maven.apache.org/maven2/org/ops4j/pax/swissbox/pax-swissbox-property/1.8.1/pax-swissbox-property-1.8.1.pom
[INFO] Downloaded: https://repo.maven.apache.org/maven2/org/ops4j/pax/swissbox/pax-swissbox-property/1.8.1/pax-swissbox-property-1.8.1.pom (2 KB at 102.4 KB/sec)
[INFO] Downloading: https://repo.maven.apache.org/maven2/org/ops4j/pax/url/pax-url-classpath/2.4.1/pax-url-classpath-2.4.1.pom
[INFO] Downloaded: https://repo.maven.apache.org/maven2/org/ops4j/pax/url/pax-url-classpath/2.4.1/pax-url-classpath-2.4.1.pom (3 KB at 168.0 KB/sec)
[INFO] Downloading: https://repo.maven.apache.org/maven2/org/ops4j/pax/swissbox/pax-swissbox-optional-jcl/1.8.1/pax-swissbox-optional-jcl-1.8.1.pom
[INFO] Downloaded: https://repo.maven.apache.org/maven2/org/ops4j/pax/swissbox/pax-swissbox-optional-jcl/1.8.1/pax-swissbox-optional-jcl-1.8.1.pom (2 KB at 104.7 KB/sec)
[INFO] Downloading: https://repo.maven.apache.org/maven2/org/ops4j/pax/url/pax-url-wrap/2.4.3/pax-url-wrap-2.4.3.pom
[INFO] Downloaded: https://repo.maven.apache.org/maven2/org/ops4j/pax/url/pax-url-wrap/2.4.3/pax-url-wrap-2.4.3.pom (3 KB at 195.0 KB/sec)
[INFO] Downloading: https://repo.maven.apache.org/maven2/org/ops4j/pax/url/pax-url-commons/2.4.3/pax-url-commons-2.4.3.pom
[INFO] Downloaded: https://repo.maven.apache.org/maven2/org/ops4j/pax/url/pax-url-commons/2.4.3/pax-url-commons-2.4.3.pom (3 KB at 144.9 KB/sec)
[INFO] Downloading: https://repo.maven.apache.org/maven2/org/apache/felix/org.apache.felix.framework/5.4.0/org.apache.felix.framework-5.4.0.pom
[INFO] Downloaded: https://repo.maven.apache.org/maven2/org/apache/felix/org.apache.felix.framework/5.4.0/org.apache.felix.framework-5.4.0.pom (6 KB at 381.3 KB/sec)
[INFO] Downloading: https://repo.maven.apache.org/maven2/org/apache/sling/org.apache.sling.commons.threads/3.1.0/org.apache.sling.commons.threads-3.1.0.pom
[INFO] Downloaded: https://repo.maven.apache.org/maven2/org/apache/sling/org.apache.sling.commons.threads/3.1.0/org.apache.sling.commons.threads-3.1.0.pom (4 KB at 289.1 KB/sec)
[INFO] Downloading: http://repository.apache.org/snapshots/org/apache/sling/org.apache.sling.commons.johnzon/0.1.0-SNAPSHOT/maven-metadata.xml
[INFO] Downloaded: http://repository.apache.org/snapshots/org/apache/sling/org.apache.sling.commons.johnzon/0.1.0-SNAPSHOT/maven-metadata.xml (1012 B at 2.5 KB/sec)
[INFO] Downloading: https://repo.maven.apache.org/maven2/org/apache/sling/org.apache.sling.commons.scheduler/2.3.2/org.apache.sling.commons.scheduler-2.3.2.pom
[INFO] Downloaded: https://repo.maven.apache.org/maven2/org/apache/sling/org.apache.sling.commons.scheduler/2.3.2/org.apache.sling.commons.scheduler-2.3.2.pom (5 KB at 391.0 KB/sec)
[INFO] Downloading: https://repo.maven.apache.org/maven2/org/quartz-scheduler/quartz/2.1.1/quartz-2.1.1.pom
[INFO] Downloaded: https://repo.maven.apache.org/maven2/org/quartz-scheduler/quartz/2.1.1/quartz-2.1.1.pom (6 KB at 405.3 KB/sec)
[INFO] Downloading: https://repo.maven.apache.org/maven2/org/quartz-scheduler/quartz-parent/2.1.1/quartz-parent-2.1.1.pom
[INFO] Downloaded: https://repo.maven.apache.org/maven2/org/quartz-scheduler/quartz-parent/2.1.1/quartz-parent-2.1.1.pom (13 KB at 866.0 KB/sec)
[INFO] Downloading: http://repository.apache.org/snapshots/org/apache/sling/org.apache.sling.hc.api/0.0.99-SNAPSHOT/org.apache.sling.hc.api-0.0.99-SNAPSHOT.jar
[INFO] Downloading: https://repo.maven.apache.org/maven2/org/slf4j/slf4j-api/1.6.2/slf4j-api-1.6.2.jar
[INFO] Downloading: https://repo.maven.apache.org/maven2/org/slf4j/slf4j-simple/1.6.2/slf4j-simple-1.6.2.jar
[INFO] Downloading: https://repo.maven.apache.org/maven2/org/ops4j/pax/exam/pax-exam-container-forked/4.6.0/pax-exam-container-forked-4.6.0.jar
[INFO] Downloading: https://repo.maven.apache.org/maven2/org/ops4j/pax/exam/pax-exam/4.6.0/pax-exam-4.6.0.jar
[INFO] Downloading: https://repo.maven.apache.org/maven2/org/ops4j/pax/exam/pax-exam-spi/4.6.0/pax-exam-spi-4.6.0.jar
[INFO] Downloaded: https://repo.maven.apache.org/maven2/org/slf4j/slf4j-api/1.6.2/slf4j-api-1.6.2.jar (26 KB at 570.2 KB/sec)
[INFO] Downloading: https://repo.maven.apache.org/maven2/org/ops4j/pax/swissbox/pax-swissbox-framework/1.8.1/pax-swissbox-framework-1.8.1.jar
[INFO] Downloaded: https://repo.maven.apache.org/maven2/org/ops4j/pax/swissbox/pax-swissbox-framework/1.8.1/pax-swissbox-framework-1.8.1.jar (14 KB at 219.8 KB/sec)
[INFO] Downloading: https://repo.maven.apache.org/maven2/org/ops4j/pax/swissbox/pax-swissbox-tracker/1.8.1/pax-swissbox-tracker-1.8.1.jar
[INFO] Downloaded: https://repo.maven.apache.org/maven2/org/ops4j/pax/swissbox/pax-swissbox-tracker/1.8.1/pax-swissbox-tracker-1.8.1.jar (15 KB at 181.3 KB/sec)
[INFO] Downloading: https://repo.maven.apache.org/maven2/org/ops4j/pax/swissbox/pax-swissbox-lifecycle/1.8.1/pax-swissbox-lifecycle-1.8.1.jar
[INFO] Downloaded: https://repo.maven.apache.org/maven2/org/ops4j/pax/exam/pax-exam-container-forked/4.6.0/pax-exam-container-forked-4.6.0.jar (31 KB at 228.7 KB/sec)
[INFO] Downloading: https://repo.maven.apache.org/maven2/org/ops4j/pax/exam/pax-exam-junit4/4.6.0/pax-exam-junit4-4.6.0.jar
[INFO] Downloaded: https://repo.maven.apache.org/maven2/org/ops4j/pax/swissbox/pax-swissbox-lifecycle/1.8.1/pax-swissbox-lifecycle-1.8.1.jar (7 KB at 52.2 KB/sec)
[INFO] Downloading: https://repo.maven.apache.org/maven2/org/ops4j/pax/exam/pax-exam-link-mvn/4.6.0/pax-exam-link-mvn-4.6.0.jar
[INFO] Downloaded: https://repo.maven.apache.org/maven2/org/slf4j/slf4j-simple/1.6.2/slf4j-simple-1.6.2.jar (8 KB at 50.6 KB/sec)
[INFO] Downloading: https://repo.maven.apache.org/maven2/org/ops4j/pax/url/pax-url-link/2.4.1/pax-url-link-2.4.1.jar
[INFO] Downloaded: https://repo.maven.apache.org/maven2/org/ops4j/pax/exam/pax-exam-link-mvn/4.6.0/pax-exam-link-mvn-4.6.0.jar (11 KB at 74.3 KB/sec)
[INFO] Downloading: https://repo.maven.apache.org/maven2/org/ops4j/pax/url/pax-url-classpath/2.4.1/pax-url-classpath-2.4.1.jar
[INFO] Downloaded: https://repo.maven.apache.org/maven2/org/ops4j/pax/exam/pax-exam-spi/4.6.0/pax-exam-spi-4.6.0.jar (67 KB at 428.6 KB/sec)
[INFO] Downloading: https://repo.maven.apache.org/maven2/org/ops4j/pax/swissbox/pax-swissbox-optional-jcl/1.8.1/pax-swissbox-optional-jcl-1.8.1.jar
[INFO] Downloaded: https://repo.maven.apache.org/maven2/org/ops4j/pax/exam/pax-exam-junit4/4.6.0/pax-exam-junit4-4.6.0.jar (34 KB at 218.5 KB/sec)
[INFO] Downloading: https://repo.maven.apache.org/maven2/org/ops4j/pax/url/pax-url-wrap/2.4.3/pax-url-wrap-2.4.3.jar
[INFO] Downloaded: https://repo.maven.apache.org/maven2/org/ops4j/pax/url/pax-url-link/2.4.1/pax-url-link-2.4.1.jar (8 KB at 46.6 KB/sec)
[INFO] Downloading: https://repo.maven.apache.org/maven2/org/ops4j/pax/url/pax-url-commons/2.4.3/pax-url-commons-2.4.3.jar
[INFO] Downloaded: https://repo.maven.apache.org/maven2/org/ops4j/pax/exam/pax-exam/4.6.0/pax-exam-4.6.0.jar (78 KB at 458.2 KB/sec)
[INFO] Downloading: https://repo.maven.apache.org/maven2/org/apache/felix/org.apache.felix.framework/5.4.0/org.apache.felix.framework-5.4.0.jar
[INFO] Downloaded: https://repo.maven.apache.org/maven2/org/ops4j/pax/url/pax-url-classpath/2.4.1/pax-url-classpath-2.4.1.jar (9 KB at 51.6 KB/sec)
[INFO] Downloading: https://repo.maven.apache.org/maven2/org/apache/sling/org.apache.sling.commons.osgi/2.2.0/org.apache.sling.commons.osgi-2.2.0.jar
[INFO] Downloaded: https://repo.maven.apache.org/maven2/org/ops4j/pax/swissbox/pax-swissbox-optional-jcl/1.8.1/pax-swissbox-optional-jcl-1.8.1.jar (7 KB at 39.5 KB/sec)
[INFO] Downloading: https://repo.maven.apache.org/maven2/org/apache/sling/org.apache.sling.scripting.api/2.1.0/org.apache.sling.scripting.api-2.1.0.jar
[INFO] Downloaded: https://repo.maven.apache.org/maven2/org/ops4j/pax/url/pax-url-commons/2.4.3/pax-url-commons-2.4.3.jar (10 KB at 51.7 KB/sec)
[INFO] Downloading: https://repo.maven.apache.org/maven2/org/livetribe/livetribe-jsr223/2.0.6/livetribe-jsr223-2.0.6.jar
[INFO] Downloaded: https://repo.maven.apache.org/maven2/org/ops4j/pax/url/pax-url-wrap/2.4.3/pax-url-wrap-2.4.3.jar (12 KB at 62.6 KB/sec)
[INFO] Downloading: https://repo.maven.apache.org/maven2/org/apache/sling/org.apache.sling.commons.threads/3.1.0/org.apache.sling.commons.threads-3.1.0.jar
[INFO] Downloaded: https://repo.maven.apache.org/maven2/org/apache/sling/org.apache.sling.scripting.api/2.1.0/org.apache.sling.scripting.api-2.1.0.jar (28 KB at 143.6 KB/sec)
[INFO] Downloading: https://repo.maven.apache.org/maven2/org/apache/sling/org.apache.sling.commons.scheduler/2.3.2/org.apache.sling.commons.scheduler-2.3.2.jar
[INFO] Downloaded: https://repo.maven.apache.org/maven2/org/apache/sling/org.apache.sling.commons.osgi/2.2.0/org.apache.sling.commons.osgi-2.2.0.jar (26 KB at 131.5 KB/sec)
[INFO] Downloaded: https://repo.maven.apache.org/maven2/org/livetribe/livetribe-jsr223/2.0.6/livetribe-jsr223-2.0.6.jar (15 KB at 74.5 KB/sec)
[INFO] Downloading: https://repo.maven.apache.org/maven2/org/quartz-scheduler/quartz/2.1.1/quartz-2.1.1.jar
[INFO] Downloaded: https://repo.maven.apache.org/maven2/org/apache/sling/org.apache.sling.commons.threads/3.1.0/org.apache.sling.commons.threads-3.1.0.jar (31 KB at 155.7 KB/sec)
[INFO] Downloaded: https://repo.maven.apache.org/maven2/org/apache/felix/org.apache.felix.framework/5.4.0/org.apache.felix.framework-5.4.0.jar (663 KB at 2682.7 KB/sec)
[INFO] Downloaded: https://repo.maven.apache.org/maven2/org/quartz-scheduler/quartz/2.1.1/quartz-2.1.1.jar (542 KB at 2035.2 KB/sec)
[INFO] Downloaded: https://repo.maven.apache.org/maven2/org/apache/sling/org.apache.sling.commons.scheduler/2.3.2/org.apache.sling.commons.scheduler-2.3.2.jar (532 KB at 1959.6 KB/sec)
[JENKINS] Archiving disabled
[JENKINS] Archiving disabled
[INFO] ------------------------------------------------------------------------
[INFO] BUILD FAILURE
[INFO] ------------------------------------------------------------------------
[INFO] Total time: 14.244 s
[INFO] Finished at: 2017-04-27T08:24:24+00:00
[INFO] Final Memory: 20M/285M
[INFO] ------------------------------------------------------------------------
Waiting for Jenkins to finish collecting data
[ERROR] Failed to execute goal on project org.apache.sling.hc.core: Could not resolve dependencies for project org.apache.sling:org.apache.sling.hc.core:bundle:1.2.7-SNAPSHOT: Could not find artifact org.apache.sling:org.apache.sling.hc.api:jar:0.0.99-SNAPSHOT in Nexus (http://repository.apache.org/snapshots) -> [Help 1]
[ERROR]
[ERROR] To see the full stack trace of the errors, re-run Maven with the -e switch.
[ERROR] Re-run Maven using the -X switch to enable full debug logging.
[ERROR]
[ERROR] For more information about the errors and possible solutions, please read the following articles:
[ERROR] [Help 1] http://cwiki.apache.org/confluence/display/MAVEN/DependencyResolutionException
channel stopped
Recording test results
Build failed in Jenkins:
sling-bundles-extensions-healthcheck-core-1.8 #11
Posted by Apache Jenkins Server <je...@builds.apache.org>.
See <https://builds.apache.org/job/sling-bundles-extensions-healthcheck-core-1.8/11/display/redirect>
------------------------------------------
Started by upstream project "sling-bundles-commons-johnzon-1.7" build number 3
originally caused by:
Started by an SCM change
[EnvInject] - Loading node environment variables.
Building remotely on H14 (ubuntu xenial) in workspace <https://builds.apache.org/job/sling-bundles-extensions-healthcheck-core-1.8/ws/>
Checking out a fresh workspace because there's no workspace at <https://builds.apache.org/job/sling-bundles-extensions-healthcheck-core-1.8/ws/>
Cleaning local Directory .
Checking out https://svn.apache.org/repos/asf/sling/trunk/bundles/extensions/healthcheck/core at revision '2017-04-26T20:42:54.318 +0000'
A src
A src/test
A src/test/java
A src/test/java/org
A src/test/java/org/apache
A src/test/java/org/apache/sling
A src/test/java/org/apache/sling/hc
A src/test/java/org/apache/sling/hc/core
A src/test/java/org/apache/sling/hc/core/it
A src/test/java/org/apache/sling/hc/core/it/JmxAdjustableStatusForTestingIT.java
A src/test/java/org/apache/sling/hc/core/it/U.java
A src/test/java/org/apache/sling/hc/core/it/HealthCheckExecutorSelectionIT.java
A src/test/java/org/apache/sling/hc/core/it/HealthCheckServletIT.java
A src/test/java/org/apache/sling/hc/core/it/HealthCheckFilterIT.java
A src/test/java/org/apache/sling/hc/core/it/MockHttpService.java
A src/test/java/org/apache/sling/hc/core/it/AsyncHealthCheckIT.java
A src/test/java/org/apache/sling/hc/core/it/ExtendedHealthCheckExecutorIT.java
A src/test/java/org/apache/sling/hc/core/impl
A src/test/java/org/apache/sling/hc/core/impl/JmxScriptBindingsProviderTest.java
AU src/test/java/org/apache/sling/hc/core/impl/ScriptableHealthCheckTest.java
A src/test/java/org/apache/sling/hc/core/impl/executor
AU src/test/java/org/apache/sling/hc/core/impl/executor/HealthCheckResultCacheTest.java
AU src/test/java/org/apache/sling/hc/core/impl/executor/HealthCheckExecutorImplTest.java
A src/test/java/org/apache/sling/hc/core/impl/servlet
A src/test/java/org/apache/sling/hc/core/impl/servlet/HealthCheckExecutorServletTest.java
A src/test/java/org/apache/sling/hc/core/impl/CompositeHealthCheckTest.java
AU src/test/java/org/apache/sling/hc/core/impl/JmxAttributeHealthCheckTest.java
A src/test/java/org/apache/sling/hc/api
A src/test/java/org/apache/sling/hc/util
A src/test/java/org/apache/sling/hc/jmx
A src/test/java/org/apache/sling/hc/jmx/impl
AU src/test/java/org/apache/sling/hc/jmx/impl/HealthCheckMBeanTest.java
A src/main
A src/main/java
A src/main/java/org
A src/main/java/org/apache
A src/main/java/org/apache/sling
A src/main/java/org/apache/sling/hc
A src/main/java/org/apache/sling/hc/core
A src/main/java/org/apache/sling/hc/core/impl
AU src/main/java/org/apache/sling/hc/core/impl/JmxScriptBindingsProvider.java
AU src/main/java/org/apache/sling/hc/core/impl/ScriptableHealthCheck.java
A src/main/java/org/apache/sling/hc/core/impl/executor
AU src/main/java/org/apache/sling/hc/core/impl/executor/ExecutionResult.java
AU src/main/java/org/apache/sling/hc/core/impl/executor/ExtendedHealthCheckExecutor.java
AU src/main/java/org/apache/sling/hc/core/impl/executor/HealthCheckExecutorImpl.java
AU src/main/java/org/apache/sling/hc/core/impl/executor/HealthCheckResultCache.java
AU src/main/java/org/apache/sling/hc/core/impl/executor/HealthCheckFuture.java
A src/main/java/org/apache/sling/hc/core/impl/executor/AsyncHealthCheckExecutor.java
A src/main/java/org/apache/sling/hc/core/impl/CompositeResult.java
A src/main/java/org/apache/sling/hc/core/impl/servlet
A src/main/java/org/apache/sling/hc/core/impl/servlet/ResultHtmlSerializer.java
A src/main/java/org/apache/sling/hc/core/impl/servlet/ResultJsonSerializer.java
A src/main/java/org/apache/sling/hc/core/impl/servlet/HealthCheckExecutorServlet.java
A src/main/java/org/apache/sling/hc/core/impl/servlet/ResultTxtSerializer.java
A src/main/java/org/apache/sling/hc/core/impl/CompositeHealthCheck.java
AU src/main/java/org/apache/sling/hc/core/impl/JmxAdjustableStatusForTesting.java
AU src/main/java/org/apache/sling/hc/core/impl/JmxAttributeHealthCheck.java
A src/main/java/org/apache/sling/hc/api
A src/main/java/org/apache/sling/hc/api/execution
A src/main/java/org/apache/sling/hc/util
A src/main/java/org/apache/sling/hc/jmx
A src/main/java/org/apache/sling/hc/jmx/impl
AU src/main/java/org/apache/sling/hc/jmx/impl/HealthCheckMBean.java
AU src/main/java/org/apache/sling/hc/jmx/impl/HealthCheckMBeanCreator.java
A pom.xml
U .
At revision 1792808
No changes for https://svn.apache.org/repos/asf/sling/trunk/bundles/extensions/healthcheck/core since the previous build
Parsing POMs
Established TCP socket on 41013
maven33-agent.jar already up to date
maven33-interceptor.jar already up to date
maven3-interceptor-commons.jar already up to date
[sling-bundles-extensions-healthcheck-core-1.8] $ /home/jenkins/tools/java/latest1.8/bin/java -Xmx2g -Xms256m -cp /home/jenkins/jenkins-slave/maven33-agent.jar:/home/jenkins/tools/maven/apache-maven-3.3.9/boot/plexus-classworlds-2.5.2.jar:/home/jenkins/tools/maven/apache-maven-3.3.9/conf/logging jenkins.maven3.agent.Maven33Main /home/jenkins/tools/maven/apache-maven-3.3.9 /home/jenkins/jenkins-slave/slave.jar /home/jenkins/jenkins-slave/maven33-interceptor.jar /home/jenkins/jenkins-slave/maven3-interceptor-commons.jar 41013
<===[JENKINS REMOTING CAPACITY]===> channel started
Executing Maven: -B -f <https://builds.apache.org/job/sling-bundles-extensions-healthcheck-core-1.8/ws/pom.xml> -Dmaven.repo.local=/home/jenkins/jenkins-slave/maven-repositories/1 -U clean verify
[INFO] Scanning for projects...
[INFO]
[INFO] ------------------------------------------------------------------------
[INFO] Building Apache Sling Health Check Core 1.2.7-SNAPSHOT
[INFO] ------------------------------------------------------------------------
[INFO] Downloading: http://repository.apache.org/snapshots/org/apache/sling/org.apache.sling.hc.api/0.0.99-SNAPSHOT/maven-metadata.xml
[INFO] Downloading: http://repository.apache.org/snapshots/org/apache/sling/org.apache.sling.hc.api/0.0.99-SNAPSHOT/org.apache.sling.hc.api-0.0.99-SNAPSHOT.pom
[WARNING] The POM for org.apache.sling:org.apache.sling.hc.api:jar:0.0.99-SNAPSHOT is missing, no dependency information available
[INFO] Downloading: http://repository.apache.org/snapshots/org/apache/sling/org.apache.sling.commons.johnzon/0.1.0-SNAPSHOT/maven-metadata.xml
[INFO] Downloaded: http://repository.apache.org/snapshots/org/apache/sling/org.apache.sling.commons.johnzon/0.1.0-SNAPSHOT/maven-metadata.xml (1012 B at 2.6 KB/sec)
[INFO] Downloading: http://repository.apache.org/snapshots/org/apache/sling/org.apache.sling.hc.api/0.0.99-SNAPSHOT/org.apache.sling.hc.api-0.0.99-SNAPSHOT.jar
[JENKINS] Archiving disabled
[JENKINS] Archiving disabled[INFO] ------------------------------------------------------------------------
[INFO] BUILD FAILURE
[INFO] ------------------------------------------------------------------------
[INFO] Total time: 5.203 s
[INFO] Finished at: 2017-04-26T20:43:10+00:00
[INFO] Final Memory: 18M/276M
[INFO] ------------------------------------------------------------------------
[ERROR] Failed to execute goal on project org.apache.sling.hc.core: Could not resolve dependencies for project org.apache.sling:org.apache.sling.hc.core:bundle:1.2.7-SNAPSHOT: Could not find artifact org.apache.sling:org.apache.sling.hc.api:jar:0.0.99-SNAPSHOT in Nexus (http://repository.apache.org/snapshots) -> [Help 1]
[ERROR]
[ERROR] To see the full stack trace of the errors, re-run Maven with the -e switch.
[ERROR] Re-run Maven using the -X switch to enable full debug logging.
[ERROR]
[ERROR] For more information about the errors and possible solutions, please read the following articles:
[ERROR] [Help 1] http://cwiki.apache.org/confluence/display/MAVEN/DependencyResolutionException
channel stopped
Recording test results