You are viewing a plain text version of this content. The canonical link for it is here.
Posted to dev@lucene.apache.org by Policeman Jenkins Server <je...@thetaphi.de> on 2016/09/18 10:33:16 UTC
[JENKINS] Lucene-Solr-6.2-Windows (64bit/jdk1.8.0_102) - Build # 10
- Failure!
Build: http://jenkins.thetaphi.de/job/Lucene-Solr-6.2-Windows/10/
Java: 64bit/jdk1.8.0_102 -XX:-UseCompressedOops -XX:+UseG1GC
1 tests failed.
FAILED: org.apache.solr.cloud.TestRandomRequestDistribution.test
Error Message:
Shard a1x2_shard1_replica2 received all 10 requests
Stack Trace:
java.lang.AssertionError: Shard a1x2_shard1_replica2 received all 10 requests
at __randomizedtesting.SeedInfo.seed([B18A4B197D227008:39DE74C3D3DE1DF0]:0)
at org.junit.Assert.fail(Assert.java:93)
at org.junit.Assert.assertTrue(Assert.java:43)
at org.apache.solr.cloud.TestRandomRequestDistribution.testRequestTracking(TestRandomRequestDistribution.java:121)
at org.apache.solr.cloud.TestRandomRequestDistribution.test(TestRandomRequestDistribution.java:65)
at sun.reflect.NativeMethodAccessorImpl.invoke0(Native Method)
at sun.reflect.NativeMethodAccessorImpl.invoke(NativeMethodAccessorImpl.java:62)
at sun.reflect.DelegatingMethodAccessorImpl.invoke(DelegatingMethodAccessorImpl.java:43)
at java.lang.reflect.Method.invoke(Method.java:498)
at com.carrotsearch.randomizedtesting.RandomizedRunner.invoke(RandomizedRunner.java:1764)
at com.carrotsearch.randomizedtesting.RandomizedRunner$8.evaluate(RandomizedRunner.java:871)
at com.carrotsearch.randomizedtesting.RandomizedRunner$9.evaluate(RandomizedRunner.java:907)
at com.carrotsearch.randomizedtesting.RandomizedRunner$10.evaluate(RandomizedRunner.java:921)
at org.apache.solr.BaseDistributedSearchTestCase$ShardsRepeatRule$ShardsFixedStatement.callStatement(BaseDistributedSearchTestCase.java:992)
at org.apache.solr.BaseDistributedSearchTestCase$ShardsRepeatRule$ShardsStatement.evaluate(BaseDistributedSearchTestCase.java:967)
at com.carrotsearch.randomizedtesting.rules.SystemPropertiesRestoreRule$1.evaluate(SystemPropertiesRestoreRule.java:57)
at org.apache.lucene.util.TestRuleSetupTeardownChained$1.evaluate(TestRuleSetupTeardownChained.java:49)
at org.apache.lucene.util.AbstractBeforeAfterRule$1.evaluate(AbstractBeforeAfterRule.java:45)
at org.apache.lucene.util.TestRuleThreadAndTestName$1.evaluate(TestRuleThreadAndTestName.java:48)
at org.apache.lucene.util.TestRuleIgnoreAfterMaxFailures$1.evaluate(TestRuleIgnoreAfterMaxFailures.java:64)
at org.apache.lucene.util.TestRuleMarkFailure$1.evaluate(TestRuleMarkFailure.java:47)
at com.carrotsearch.randomizedtesting.rules.StatementAdapter.evaluate(StatementAdapter.java:36)
at com.carrotsearch.randomizedtesting.ThreadLeakControl$StatementRunner.run(ThreadLeakControl.java:367)
at com.carrotsearch.randomizedtesting.ThreadLeakControl.forkTimeoutingTask(ThreadLeakControl.java:809)
at com.carrotsearch.randomizedtesting.ThreadLeakControl$3.evaluate(ThreadLeakControl.java:460)
at com.carrotsearch.randomizedtesting.RandomizedRunner.runSingleTest(RandomizedRunner.java:880)
at com.carrotsearch.randomizedtesting.RandomizedRunner$5.evaluate(RandomizedRunner.java:781)
at com.carrotsearch.randomizedtesting.RandomizedRunner$6.evaluate(RandomizedRunner.java:816)
at com.carrotsearch.randomizedtesting.RandomizedRunner$7.evaluate(RandomizedRunner.java:827)
at com.carrotsearch.randomizedtesting.rules.StatementAdapter.evaluate(StatementAdapter.java:36)
at com.carrotsearch.randomizedtesting.rules.SystemPropertiesRestoreRule$1.evaluate(SystemPropertiesRestoreRule.java:57)
at org.apache.lucene.util.AbstractBeforeAfterRule$1.evaluate(AbstractBeforeAfterRule.java:45)
at com.carrotsearch.randomizedtesting.rules.StatementAdapter.evaluate(StatementAdapter.java:36)
at org.apache.lucene.util.TestRuleStoreClassName$1.evaluate(TestRuleStoreClassName.java:41)
at com.carrotsearch.randomizedtesting.rules.NoShadowingOrOverridesOnMethodsRule$1.evaluate(NoShadowingOrOverridesOnMethodsRule.java:40)
at com.carrotsearch.randomizedtesting.rules.NoShadowingOrOverridesOnMethodsRule$1.evaluate(NoShadowingOrOverridesOnMethodsRule.java:40)
at com.carrotsearch.randomizedtesting.rules.StatementAdapter.evaluate(StatementAdapter.java:36)
at com.carrotsearch.randomizedtesting.rules.StatementAdapter.evaluate(StatementAdapter.java:36)
at com.carrotsearch.randomizedtesting.rules.StatementAdapter.evaluate(StatementAdapter.java:36)
at org.apache.lucene.util.TestRuleAssertionsRequired$1.evaluate(TestRuleAssertionsRequired.java:53)
at org.apache.lucene.util.TestRuleMarkFailure$1.evaluate(TestRuleMarkFailure.java:47)
at org.apache.lucene.util.TestRuleIgnoreAfterMaxFailures$1.evaluate(TestRuleIgnoreAfterMaxFailures.java:64)
at org.apache.lucene.util.TestRuleIgnoreTestSuites$1.evaluate(TestRuleIgnoreTestSuites.java:54)
at com.carrotsearch.randomizedtesting.rules.StatementAdapter.evaluate(StatementAdapter.java:36)
at com.carrotsearch.randomizedtesting.ThreadLeakControl$StatementRunner.run(ThreadLeakControl.java:367)
at java.lang.Thread.run(Thread.java:745)
Build Log:
[...truncated 11070 lines...]
[junit4] Suite: org.apache.solr.cloud.TestRandomRequestDistribution
[junit4] 2> Creating dataDir: C:\Users\jenkins\workspace\Lucene-Solr-6.2-Windows\solr\build\solr-core\test\J0\temp\solr.cloud.TestRandomRequestDistribution_B18A4B197D227008-001\init-core-data-001
[junit4] 2> 779843 INFO (SUITE-TestRandomRequestDistribution-seed#[B18A4B197D227008]-worker) [ ] o.a.s.SolrTestCaseJ4 Randomized ssl (false) and clientAuth (false) via: @org.apache.solr.SolrTestCaseJ4$SuppressSSL(bugUrl=None)
[junit4] 2> 779843 INFO (SUITE-TestRandomRequestDistribution-seed#[B18A4B197D227008]-worker) [ ] o.a.s.BaseDistributedSearchTestCase Setting hostContext system property: /
[junit4] 2> 779847 INFO (TEST-TestRandomRequestDistribution.test-seed#[B18A4B197D227008]) [ ] o.a.s.c.ZkTestServer STARTING ZK TEST SERVER
[junit4] 2> 779877 INFO (Thread-1220) [ ] o.a.s.c.ZkTestServer client port:0.0.0.0/0.0.0.0:0
[junit4] 2> 779878 INFO (Thread-1220) [ ] o.a.s.c.ZkTestServer Starting server
[junit4] 2> 779948 INFO (TEST-TestRandomRequestDistribution.test-seed#[B18A4B197D227008]) [ ] o.a.s.c.ZkTestServer start zk server on port:54208
[junit4] 2> 779948 INFO (TEST-TestRandomRequestDistribution.test-seed#[B18A4B197D227008]) [ ] o.a.s.c.c.SolrZkClient Using default ZkCredentialsProvider
[junit4] 2> 779949 INFO (TEST-TestRandomRequestDistribution.test-seed#[B18A4B197D227008]) [ ] o.a.s.c.c.ConnectionManager Waiting for client to connect to ZooKeeper
[junit4] 2> 779954 INFO (zkCallback-877-thread-1) [ ] o.a.s.c.c.ConnectionManager Watcher org.apache.solr.common.cloud.ConnectionManager@302d33e9 name:ZooKeeperConnection Watcher:127.0.0.1:54208 got event WatchedEvent state:SyncConnected type:None path:null path:null type:None
[junit4] 2> 779954 INFO (TEST-TestRandomRequestDistribution.test-seed#[B18A4B197D227008]) [ ] o.a.s.c.c.ConnectionManager Client is connected to ZooKeeper
[junit4] 2> 779954 INFO (TEST-TestRandomRequestDistribution.test-seed#[B18A4B197D227008]) [ ] o.a.s.c.c.SolrZkClient Using default ZkACLProvider
[junit4] 2> 779954 INFO (TEST-TestRandomRequestDistribution.test-seed#[B18A4B197D227008]) [ ] o.a.s.c.c.SolrZkClient makePath: /solr
[junit4] 2> 779956 WARN (NIOServerCxn.Factory:0.0.0.0/0.0.0.0:0) [ ] o.a.z.s.NIOServerCnxn caught end of stream exception
[junit4] 2> EndOfStreamException: Unable to read additional data from client sessionid 0x1573ca33df80000, likely client has closed socket
[junit4] 2> at org.apache.zookeeper.server.NIOServerCnxn.doIO(NIOServerCnxn.java:228)
[junit4] 2> at org.apache.zookeeper.server.NIOServerCnxnFactory.run(NIOServerCnxnFactory.java:208)
[junit4] 2> at java.lang.Thread.run(Thread.java:745)
[junit4] 2> 779958 INFO (TEST-TestRandomRequestDistribution.test-seed#[B18A4B197D227008]) [ ] o.a.s.c.c.SolrZkClient Using default ZkCredentialsProvider
[junit4] 2> 779958 INFO (TEST-TestRandomRequestDistribution.test-seed#[B18A4B197D227008]) [ ] o.a.s.c.c.ConnectionManager Waiting for client to connect to ZooKeeper
[junit4] 2> 779961 INFO (zkCallback-878-thread-1) [ ] o.a.s.c.c.ConnectionManager Watcher org.apache.solr.common.cloud.ConnectionManager@15a8c98e name:ZooKeeperConnection Watcher:127.0.0.1:54208/solr got event WatchedEvent state:SyncConnected type:None path:null path:null type:None
[junit4] 2> 779961 INFO (TEST-TestRandomRequestDistribution.test-seed#[B18A4B197D227008]) [ ] o.a.s.c.c.ConnectionManager Client is connected to ZooKeeper
[junit4] 2> 779962 INFO (TEST-TestRandomRequestDistribution.test-seed#[B18A4B197D227008]) [ ] o.a.s.c.c.SolrZkClient Using default ZkACLProvider
[junit4] 2> 779962 INFO (TEST-TestRandomRequestDistribution.test-seed#[B18A4B197D227008]) [ ] o.a.s.c.c.SolrZkClient makePath: /collections/collection1
[junit4] 2> 779965 INFO (TEST-TestRandomRequestDistribution.test-seed#[B18A4B197D227008]) [ ] o.a.s.c.c.SolrZkClient makePath: /collections/collection1/shards
[junit4] 2> 779971 INFO (TEST-TestRandomRequestDistribution.test-seed#[B18A4B197D227008]) [ ] o.a.s.c.c.SolrZkClient makePath: /collections/control_collection
[junit4] 2> 779975 INFO (TEST-TestRandomRequestDistribution.test-seed#[B18A4B197D227008]) [ ] o.a.s.c.c.SolrZkClient makePath: /collections/control_collection/shards
[junit4] 2> 779980 INFO (TEST-TestRandomRequestDistribution.test-seed#[B18A4B197D227008]) [ ] o.a.s.c.AbstractZkTestCase put C:\Users\jenkins\workspace\Lucene-Solr-6.2-Windows\solr\core\src\test-files\solr\collection1\conf\solrconfig-tlog.xml to /configs/conf1/solrconfig.xml
[junit4] 2> 779981 INFO (TEST-TestRandomRequestDistribution.test-seed#[B18A4B197D227008]) [ ] o.a.s.c.c.SolrZkClient makePath: /configs/conf1/solrconfig.xml
[junit4] 2> 779988 INFO (TEST-TestRandomRequestDistribution.test-seed#[B18A4B197D227008]) [ ] o.a.s.c.AbstractZkTestCase put C:\Users\jenkins\workspace\Lucene-Solr-6.2-Windows\solr\core\src\test-files\solr\collection1\conf\schema.xml to /configs/conf1/schema.xml
[junit4] 2> 779988 INFO (TEST-TestRandomRequestDistribution.test-seed#[B18A4B197D227008]) [ ] o.a.s.c.c.SolrZkClient makePath: /configs/conf1/schema.xml
[junit4] 2> 780003 INFO (TEST-TestRandomRequestDistribution.test-seed#[B18A4B197D227008]) [ ] o.a.s.c.AbstractZkTestCase put C:\Users\jenkins\workspace\Lucene-Solr-6.2-Windows\solr\core\src\test-files\solr\collection1\conf\solrconfig.snippet.randomindexconfig.xml to /configs/conf1/solrconfig.snippet.randomindexconfig.xml
[junit4] 2> 780005 INFO (TEST-TestRandomRequestDistribution.test-seed#[B18A4B197D227008]) [ ] o.a.s.c.c.SolrZkClient makePath: /configs/conf1/solrconfig.snippet.randomindexconfig.xml
[junit4] 2> 780011 INFO (TEST-TestRandomRequestDistribution.test-seed#[B18A4B197D227008]) [ ] o.a.s.c.AbstractZkTestCase put C:\Users\jenkins\workspace\Lucene-Solr-6.2-Windows\solr\core\src\test-files\solr\collection1\conf\stopwords.txt to /configs/conf1/stopwords.txt
[junit4] 2> 780011 INFO (TEST-TestRandomRequestDistribution.test-seed#[B18A4B197D227008]) [ ] o.a.s.c.c.SolrZkClient makePath: /configs/conf1/stopwords.txt
[junit4] 2> 780023 INFO (TEST-TestRandomRequestDistribution.test-seed#[B18A4B197D227008]) [ ] o.a.s.c.AbstractZkTestCase put C:\Users\jenkins\workspace\Lucene-Solr-6.2-Windows\solr\core\src\test-files\solr\collection1\conf\protwords.txt to /configs/conf1/protwords.txt
[junit4] 2> 780024 INFO (TEST-TestRandomRequestDistribution.test-seed#[B18A4B197D227008]) [ ] o.a.s.c.c.SolrZkClient makePath: /configs/conf1/protwords.txt
[junit4] 2> 780028 INFO (TEST-TestRandomRequestDistribution.test-seed#[B18A4B197D227008]) [ ] o.a.s.c.AbstractZkTestCase put C:\Users\jenkins\workspace\Lucene-Solr-6.2-Windows\solr\core\src\test-files\solr\collection1\conf\currency.xml to /configs/conf1/currency.xml
[junit4] 2> 780029 INFO (TEST-TestRandomRequestDistribution.test-seed#[B18A4B197D227008]) [ ] o.a.s.c.c.SolrZkClient makePath: /configs/conf1/currency.xml
[junit4] 2> 780035 INFO (TEST-TestRandomRequestDistribution.test-seed#[B18A4B197D227008]) [ ] o.a.s.c.AbstractZkTestCase put C:\Users\jenkins\workspace\Lucene-Solr-6.2-Windows\solr\core\src\test-files\solr\collection1\conf\enumsConfig.xml to /configs/conf1/enumsConfig.xml
[junit4] 2> 780036 INFO (TEST-TestRandomRequestDistribution.test-seed#[B18A4B197D227008]) [ ] o.a.s.c.c.SolrZkClient makePath: /configs/conf1/enumsConfig.xml
[junit4] 2> 780040 INFO (TEST-TestRandomRequestDistribution.test-seed#[B18A4B197D227008]) [ ] o.a.s.c.AbstractZkTestCase put C:\Users\jenkins\workspace\Lucene-Solr-6.2-Windows\solr\core\src\test-files\solr\collection1\conf\open-exchange-rates.json to /configs/conf1/open-exchange-rates.json
[junit4] 2> 780041 INFO (TEST-TestRandomRequestDistribution.test-seed#[B18A4B197D227008]) [ ] o.a.s.c.c.SolrZkClient makePath: /configs/conf1/open-exchange-rates.json
[junit4] 2> 780045 INFO (TEST-TestRandomRequestDistribution.test-seed#[B18A4B197D227008]) [ ] o.a.s.c.AbstractZkTestCase put C:\Users\jenkins\workspace\Lucene-Solr-6.2-Windows\solr\core\src\test-files\solr\collection1\conf\mapping-ISOLatin1Accent.txt to /configs/conf1/mapping-ISOLatin1Accent.txt
[junit4] 2> 780045 INFO (TEST-TestRandomRequestDistribution.test-seed#[B18A4B197D227008]) [ ] o.a.s.c.c.SolrZkClient makePath: /configs/conf1/mapping-ISOLatin1Accent.txt
[junit4] 2> 780047 INFO (TEST-TestRandomRequestDistribution.test-seed#[B18A4B197D227008]) [ ] o.a.s.c.AbstractZkTestCase put C:\Users\jenkins\workspace\Lucene-Solr-6.2-Windows\solr\core\src\test-files\solr\collection1\conf\old_synonyms.txt to /configs/conf1/old_synonyms.txt
[junit4] 2> 780048 INFO (TEST-TestRandomRequestDistribution.test-seed#[B18A4B197D227008]) [ ] o.a.s.c.c.SolrZkClient makePath: /configs/conf1/old_synonyms.txt
[junit4] 2> 780052 INFO (TEST-TestRandomRequestDistribution.test-seed#[B18A4B197D227008]) [ ] o.a.s.c.AbstractZkTestCase put C:\Users\jenkins\workspace\Lucene-Solr-6.2-Windows\solr\core\src\test-files\solr\collection1\conf\synonyms.txt to /configs/conf1/synonyms.txt
[junit4] 2> 780053 INFO (TEST-TestRandomRequestDistribution.test-seed#[B18A4B197D227008]) [ ] o.a.s.c.c.SolrZkClient makePath: /configs/conf1/synonyms.txt
[junit4] 2> 780616 INFO (TEST-TestRandomRequestDistribution.test-seed#[B18A4B197D227008]) [ ] o.a.s.SolrTestCaseJ4 Writing core.properties file to C:\Users\jenkins\workspace\Lucene-Solr-6.2-Windows\solr\build\solr-core\test\J0\temp\solr.cloud.TestRandomRequestDistribution_B18A4B197D227008-001\control-001\cores\collection1
[junit4] 2> 780619 INFO (TEST-TestRandomRequestDistribution.test-seed#[B18A4B197D227008]) [ ] o.e.j.s.Server jetty-9.3.8.v20160314
[junit4] 2> 780620 INFO (TEST-TestRandomRequestDistribution.test-seed#[B18A4B197D227008]) [ ] o.e.j.s.h.ContextHandler Started o.e.j.s.ServletContextHandler@7e2eadd7{/,null,AVAILABLE}
[junit4] 2> 780621 INFO (TEST-TestRandomRequestDistribution.test-seed#[B18A4B197D227008]) [ ] o.e.j.s.ServerConnector Started ServerConnector@f8b9147{HTTP/1.1,[http/1.1]}{127.0.0.1:54217}
[junit4] 2> 780622 INFO (TEST-TestRandomRequestDistribution.test-seed#[B18A4B197D227008]) [ ] o.e.j.s.Server Started @786725ms
[junit4] 2> 780622 INFO (TEST-TestRandomRequestDistribution.test-seed#[B18A4B197D227008]) [ ] o.a.s.c.s.e.JettySolrRunner Jetty properties: {solr.data.dir=C:\Users\jenkins\workspace\Lucene-Solr-6.2-Windows\solr\build\solr-core\test\J0\temp\solr.cloud.TestRandomRequestDistribution_B18A4B197D227008-001\tempDir-001/control/data, hostContext=/, hostPort=54217, coreRootDirectory=C:\Users\jenkins\workspace\Lucene-Solr-6.2-Windows\solr\build\solr-core\test\J0\..\..\..\..\..\..\..\..\..\Users\jenkins\workspace\Lucene-Solr-6.2-Windows\solr\build\solr-core\test\J0\temp\solr.cloud.TestRandomRequestDistribution_B18A4B197D227008-001\control-001\cores}
[junit4] 2> 780622 INFO (TEST-TestRandomRequestDistribution.test-seed#[B18A4B197D227008]) [ ] o.a.s.s.SolrDispatchFilter SolrDispatchFilter.init(): sun.misc.Launcher$AppClassLoader@73d16e93
[junit4] 2> 780622 INFO (TEST-TestRandomRequestDistribution.test-seed#[B18A4B197D227008]) [ ] o.a.s.c.SolrResourceLoader new SolrResourceLoader for directory: 'C:\Users\jenkins\workspace\Lucene-Solr-6.2-Windows\solr\build\solr-core\test\J0\temp\solr.cloud.TestRandomRequestDistribution_B18A4B197D227008-001\control-001'
[junit4] 2> 780622 INFO (TEST-TestRandomRequestDistribution.test-seed#[B18A4B197D227008]) [ ] o.a.s.c.SolrResourceLoader JNDI not configured for solr (NoInitialContextEx)
[junit4] 2> 780623 INFO (TEST-TestRandomRequestDistribution.test-seed#[B18A4B197D227008]) [ ] o.a.s.c.SolrResourceLoader solr home defaulted to 'solr/' (could not find system property or JNDI)
[junit4] 2> 780623 INFO (TEST-TestRandomRequestDistribution.test-seed#[B18A4B197D227008]) [ ] o.a.s.c.c.SolrZkClient Using default ZkCredentialsProvider
[junit4] 2> 780624 INFO (TEST-TestRandomRequestDistribution.test-seed#[B18A4B197D227008]) [ ] o.a.s.c.c.ConnectionManager Waiting for client to connect to ZooKeeper
[junit4] 2> 780626 INFO (zkCallback-879-thread-1) [ ] o.a.s.c.c.ConnectionManager Watcher org.apache.solr.common.cloud.ConnectionManager@3abcb6ff name:ZooKeeperConnection Watcher:127.0.0.1:54208/solr got event WatchedEvent state:SyncConnected type:None path:null path:null type:None
[junit4] 2> 780626 INFO (TEST-TestRandomRequestDistribution.test-seed#[B18A4B197D227008]) [ ] o.a.s.c.c.ConnectionManager Client is connected to ZooKeeper
[junit4] 2> 780627 INFO (TEST-TestRandomRequestDistribution.test-seed#[B18A4B197D227008]) [ ] o.a.s.c.c.SolrZkClient Using default ZkACLProvider
[junit4] 2> 780627 WARN (NIOServerCxn.Factory:0.0.0.0/0.0.0.0:0) [ ] o.a.z.s.NIOServerCnxn caught end of stream exception
[junit4] 2> EndOfStreamException: Unable to read additional data from client sessionid 0x1573ca33df80002, likely client has closed socket
[junit4] 2> at org.apache.zookeeper.server.NIOServerCnxn.doIO(NIOServerCnxn.java:228)
[junit4] 2> at org.apache.zookeeper.server.NIOServerCnxnFactory.run(NIOServerCnxnFactory.java:208)
[junit4] 2> at java.lang.Thread.run(Thread.java:745)
[junit4] 2> 780628 INFO (TEST-TestRandomRequestDistribution.test-seed#[B18A4B197D227008]) [ ] o.a.s.s.SolrDispatchFilter Loading solr.xml from SolrHome (not found in ZooKeeper)
[junit4] 2> 780628 INFO (TEST-TestRandomRequestDistribution.test-seed#[B18A4B197D227008]) [ ] o.a.s.c.SolrXmlConfig Loading container configuration from C:\Users\jenkins\workspace\Lucene-Solr-6.2-Windows\solr\build\solr-core\test\J0\temp\solr.cloud.TestRandomRequestDistribution_B18A4B197D227008-001\control-001\solr.xml
[junit4] 2> 780640 INFO (TEST-TestRandomRequestDistribution.test-seed#[B18A4B197D227008]) [ ] o.a.s.c.CorePropertiesLocator Config-defined core root directory: C:\Users\jenkins\workspace\Lucene-Solr-6.2-Windows\solr\build\solr-core\test\J0\..\..\..\..\..\..\..\..\..\Users\jenkins\workspace\Lucene-Solr-6.2-Windows\solr\build\solr-core\test\J0\temp\solr.cloud.TestRandomRequestDistribution_B18A4B197D227008-001\control-001\cores
[junit4] 2> 780641 INFO (TEST-TestRandomRequestDistribution.test-seed#[B18A4B197D227008]) [ ] o.a.s.c.CoreContainer New CoreContainer 1505616353
[junit4] 2> 780641 INFO (TEST-TestRandomRequestDistribution.test-seed#[B18A4B197D227008]) [ ] o.a.s.c.CoreContainer Loading cores into CoreContainer [instanceDir=C:\Users\jenkins\workspace\Lucene-Solr-6.2-Windows\solr\build\solr-core\test\J0\temp\solr.cloud.TestRandomRequestDistribution_B18A4B197D227008-001\control-001]
[junit4] 2> 780641 WARN (TEST-TestRandomRequestDistribution.test-seed#[B18A4B197D227008]) [ ] o.a.s.c.CoreContainer Couldn't add files from C:\Users\jenkins\workspace\Lucene-Solr-6.2-Windows\solr\build\solr-core\test\J0\temp\solr.cloud.TestRandomRequestDistribution_B18A4B197D227008-001\control-001\lib to classpath: C:\Users\jenkins\workspace\Lucene-Solr-6.2-Windows\solr\build\solr-core\test\J0\temp\solr.cloud.TestRandomRequestDistribution_B18A4B197D227008-001\control-001\lib
[junit4] 2> 780641 INFO (TEST-TestRandomRequestDistribution.test-seed#[B18A4B197D227008]) [ ] o.a.s.h.c.HttpShardHandlerFactory created with socketTimeout : 90000,urlScheme : ,connTimeout : 15000,maxConnectionsPerHost : 20,maxConnections : 10000,corePoolSize : 0,maximumPoolSize : 2147483647,maxThreadIdleTime : 5,sizeOfQueue : -1,fairnessPolicy : false,useRetries : false,connectionsEvictorSleepDelay : 5000,maxConnectionIdleTime : 40000,
[junit4] 2> 780645 INFO (TEST-TestRandomRequestDistribution.test-seed#[B18A4B197D227008]) [ ] o.a.s.u.UpdateShardHandler Creating UpdateShardHandler HTTP client with params: socketTimeout=340000&connTimeout=45000&retry=true
[junit4] 2> 780646 INFO (TEST-TestRandomRequestDistribution.test-seed#[B18A4B197D227008]) [ ] o.a.s.l.LogWatcher SLF4J impl is org.slf4j.impl.Log4jLoggerFactory
[junit4] 2> 780646 INFO (TEST-TestRandomRequestDistribution.test-seed#[B18A4B197D227008]) [ ] o.a.s.l.LogWatcher Registering Log Listener [Log4j (org.slf4j.impl.Log4jLoggerFactory)]
[junit4] 2> 780646 INFO (TEST-TestRandomRequestDistribution.test-seed#[B18A4B197D227008]) [ ] o.a.s.c.ZkContainer Zookeeper client=127.0.0.1:54208/solr
[junit4] 2> 780646 INFO (TEST-TestRandomRequestDistribution.test-seed#[B18A4B197D227008]) [ ] o.a.s.c.ZkController zkHost includes chroot
[junit4] 2> 780646 INFO (TEST-TestRandomRequestDistribution.test-seed#[B18A4B197D227008]) [ ] o.a.s.c.c.SolrZkClient Using default ZkCredentialsProvider
[junit4] 2> 780647 INFO (TEST-TestRandomRequestDistribution.test-seed#[B18A4B197D227008]) [ ] o.a.s.c.c.ConnectionManager Waiting for client to connect to ZooKeeper
[junit4] 2> 780648 INFO (zkCallback-882-thread-1) [ ] o.a.s.c.c.ConnectionManager Watcher org.apache.solr.common.cloud.ConnectionManager@75bcef01 name:ZooKeeperConnection Watcher:127.0.0.1:54208 got event WatchedEvent state:SyncConnected type:None path:null path:null type:None
[junit4] 2> 780648 INFO (TEST-TestRandomRequestDistribution.test-seed#[B18A4B197D227008]) [ ] o.a.s.c.c.ConnectionManager Client is connected to ZooKeeper
[junit4] 2> 780649 INFO (TEST-TestRandomRequestDistribution.test-seed#[B18A4B197D227008]) [ ] o.a.s.c.c.SolrZkClient Using default ZkACLProvider
[junit4] 2> 780650 WARN (NIOServerCxn.Factory:0.0.0.0/0.0.0.0:0) [ ] o.a.z.s.NIOServerCnxn caught end of stream exception
[junit4] 2> EndOfStreamException: Unable to read additional data from client sessionid 0x1573ca33df80003, likely client has closed socket
[junit4] 2> at org.apache.zookeeper.server.NIOServerCnxn.doIO(NIOServerCnxn.java:228)
[junit4] 2> at org.apache.zookeeper.server.NIOServerCnxnFactory.run(NIOServerCnxnFactory.java:208)
[junit4] 2> at java.lang.Thread.run(Thread.java:745)
[junit4] 2> 780651 INFO (TEST-TestRandomRequestDistribution.test-seed#[B18A4B197D227008]) [n:127.0.0.1:54217_ ] o.a.s.c.ZkController Added new OnReconnect listener org.apache.solr.cloud.ZkController$$Lambda$10/807492660@235906c3
[junit4] 2> 780651 INFO (TEST-TestRandomRequestDistribution.test-seed#[B18A4B197D227008]) [n:127.0.0.1:54217_ ] o.a.s.c.c.ConnectionManager Waiting for client to connect to ZooKeeper
[junit4] 2> 780652 INFO (zkCallback-883-thread-1-processing-n:127.0.0.1:54217_) [n:127.0.0.1:54217_ ] o.a.s.c.c.ConnectionManager Watcher org.apache.solr.common.cloud.ConnectionManager@445c3f01 name:ZooKeeperConnection Watcher:127.0.0.1:54208/solr got event WatchedEvent state:SyncConnected type:None path:null path:null type:None
[junit4] 2> 780653 INFO (TEST-TestRandomRequestDistribution.test-seed#[B18A4B197D227008]) [n:127.0.0.1:54217_ ] o.a.s.c.c.ConnectionManager Client is connected to ZooKeeper
[junit4] 2> 780654 INFO (TEST-TestRandomRequestDistribution.test-seed#[B18A4B197D227008]) [n:127.0.0.1:54217_ ] o.a.s.c.c.SolrZkClient makePath: /overseer/queue
[junit4] 2> 780655 INFO (TEST-TestRandomRequestDistribution.test-seed#[B18A4B197D227008]) [n:127.0.0.1:54217_ ] o.a.s.c.c.SolrZkClient makePath: /overseer/collection-queue-work
[junit4] 2> 780658 INFO (TEST-TestRandomRequestDistribution.test-seed#[B18A4B197D227008]) [n:127.0.0.1:54217_ ] o.a.s.c.c.SolrZkClient makePath: /overseer/collection-map-running
[junit4] 2> 780661 INFO (TEST-TestRandomRequestDistribution.test-seed#[B18A4B197D227008]) [n:127.0.0.1:54217_ ] o.a.s.c.c.SolrZkClient makePath: /overseer/collection-map-completed
[junit4] 2> 780664 INFO (TEST-TestRandomRequestDistribution.test-seed#[B18A4B197D227008]) [n:127.0.0.1:54217_ ] o.a.s.c.c.SolrZkClient makePath: /overseer/collection-map-failure
[junit4] 2> 780665 INFO (TEST-TestRandomRequestDistribution.test-seed#[B18A4B197D227008]) [n:127.0.0.1:54217_ ] o.a.s.c.c.SolrZkClient makePath: /live_nodes
[junit4] 2> 780667 INFO (TEST-TestRandomRequestDistribution.test-seed#[B18A4B197D227008]) [n:127.0.0.1:54217_ ] o.a.s.c.c.SolrZkClient makePath: /aliases.json
[junit4] 2> 780667 INFO (TEST-TestRandomRequestDistribution.test-seed#[B18A4B197D227008]) [n:127.0.0.1:54217_ ] o.a.s.c.c.SolrZkClient makePath: /clusterstate.json
[junit4] 2> 780669 INFO (TEST-TestRandomRequestDistribution.test-seed#[B18A4B197D227008]) [n:127.0.0.1:54217_ ] o.a.s.c.c.SolrZkClient makePath: /security.json
[junit4] 2> 780670 INFO (TEST-TestRandomRequestDistribution.test-seed#[B18A4B197D227008]) [n:127.0.0.1:54217_ ] o.a.s.c.c.ZkStateReader Updating cluster state from ZooKeeper...
[junit4] 2> 780671 INFO (TEST-TestRandomRequestDistribution.test-seed#[B18A4B197D227008]) [n:127.0.0.1:54217_ ] o.a.s.c.c.ZkStateReader Loaded empty cluster properties
[junit4] 2> 780672 INFO (TEST-TestRandomRequestDistribution.test-seed#[B18A4B197D227008]) [n:127.0.0.1:54217_ ] o.a.s.c.c.ZkStateReader Updated live nodes from ZooKeeper... (0) -> (0)
[junit4] 2> 780675 INFO (TEST-TestRandomRequestDistribution.test-seed#[B18A4B197D227008]) [n:127.0.0.1:54217_ ] o.a.s.c.c.SolrZkClient makePath: /overseer_elect
[junit4] 2> 780676 INFO (TEST-TestRandomRequestDistribution.test-seed#[B18A4B197D227008]) [n:127.0.0.1:54217_ ] o.a.s.c.c.SolrZkClient makePath: /overseer_elect/election
[junit4] 2> 780677 INFO (TEST-TestRandomRequestDistribution.test-seed#[B18A4B197D227008]) [n:127.0.0.1:54217_ ] o.a.s.c.Overseer Overseer (id=null) closing
[junit4] 2> 780678 INFO (TEST-TestRandomRequestDistribution.test-seed#[B18A4B197D227008]) [n:127.0.0.1:54217_ ] o.a.s.c.LeaderElector Joined leadership election with path: /overseer_elect/election/96612588828753924-127.0.0.1:54217_-n_0000000000
[junit4] 2> 780678 INFO (TEST-TestRandomRequestDistribution.test-seed#[B18A4B197D227008]) [n:127.0.0.1:54217_ ] o.a.s.c.OverseerElectionContext I am going to be the leader 127.0.0.1:54217_
[junit4] 2> 780678 INFO (TEST-TestRandomRequestDistribution.test-seed#[B18A4B197D227008]) [n:127.0.0.1:54217_ ] o.a.s.c.c.SolrZkClient makePath: /overseer_elect/leader
[junit4] 2> 780679 INFO (TEST-TestRandomRequestDistribution.test-seed#[B18A4B197D227008]) [n:127.0.0.1:54217_ ] o.a.s.c.Overseer Overseer (id=96612588828753924-127.0.0.1:54217_-n_0000000000) starting
[junit4] 2> 780682 INFO (TEST-TestRandomRequestDistribution.test-seed#[B18A4B197D227008]) [n:127.0.0.1:54217_ ] o.a.s.c.c.SolrZkClient makePath: /overseer/queue-work
[junit4] 2> 780689 INFO (TEST-TestRandomRequestDistribution.test-seed#[B18A4B197D227008]) [n:127.0.0.1:54217_ ] o.a.s.c.OverseerAutoReplicaFailoverThread Starting OverseerAutoReplicaFailoverThread autoReplicaFailoverWorkLoopDelay=10000 autoReplicaFailoverWaitAfterExpiration=10000 autoReplicaFailoverBadNodeExpiration=60000
[junit4] 2> 780689 INFO (OverseerCollectionConfigSetProcessor-96612588828753924-127.0.0.1:54217_-n_0000000000) [n:127.0.0.1:54217_ ] o.a.s.c.OverseerTaskProcessor Process current queue of overseer operations
[junit4] 2> 780689 INFO (TEST-TestRandomRequestDistribution.test-seed#[B18A4B197D227008]) [n:127.0.0.1:54217_ ] o.a.s.c.ZkController Register node as live in ZooKeeper:/live_nodes/127.0.0.1:54217_
[junit4] 2> 780690 INFO (TEST-TestRandomRequestDistribution.test-seed#[B18A4B197D227008]) [n:127.0.0.1:54217_ ] o.a.s.c.c.SolrZkClient makePath: /live_nodes/127.0.0.1:54217_
[junit4] 2> 780690 INFO (OverseerStateUpdate-96612588828753924-127.0.0.1:54217_-n_0000000000) [n:127.0.0.1:54217_ ] o.a.s.c.Overseer Starting to work on the main queue
[junit4] 2> 780696 INFO (zkCallback-883-thread-1-processing-n:127.0.0.1:54217_) [n:127.0.0.1:54217_ ] o.a.s.c.c.ZkStateReader A live node change: [WatchedEvent state:SyncConnected type:NodeChildrenChanged path:/live_nodes], has occurred - updating... (live nodes size: [0])
[junit4] 2> 780696 INFO (OverseerStateUpdate-96612588828753924-127.0.0.1:54217_-n_0000000000) [n:127.0.0.1:54217_ ] o.a.s.c.c.ZkStateReader Updated live nodes from ZooKeeper... (0) -> (1)
[junit4] 2> 780711 INFO (TEST-TestRandomRequestDistribution.test-seed#[B18A4B197D227008]) [n:127.0.0.1:54217_ ] o.a.s.c.CoreContainer Security conf doesn't exist. Skipping setup for authorization module.
[junit4] 2> 780711 INFO (TEST-TestRandomRequestDistribution.test-seed#[B18A4B197D227008]) [n:127.0.0.1:54217_ ] o.a.s.c.CoreContainer No authentication plugin used.
[junit4] 2> 780713 INFO (zkCallback-883-thread-1-processing-n:127.0.0.1:54217_) [n:127.0.0.1:54217_ ] o.a.s.c.c.ZkStateReader Updated live nodes from ZooKeeper... (1) -> (1)
[junit4] 2> 780713 INFO (TEST-TestRandomRequestDistribution.test-seed#[B18A4B197D227008]) [n:127.0.0.1:54217_ ] o.a.s.c.CorePropertiesLocator Looking for core definitions underneath C:\Users\jenkins\workspace\Lucene-Solr-6.2-Windows\solr\build\solr-core\test\J0\..\..\..\..\..\..\..\..\..\Users\jenkins\workspace\Lucene-Solr-6.2-Windows\solr\build\solr-core\test\J0\temp\solr.cloud.TestRandomRequestDistribution_B18A4B197D227008-001\control-001\cores
[junit4] 2> 780717 INFO (TEST-TestRandomRequestDistribution.test-seed#[B18A4B197D227008]) [n:127.0.0.1:54217_ ] o.a.s.c.CoreDescriptor Created CoreDescriptor: {name=collection1, config=solrconfig.xml, transient=false, schema=schema.xml, loadOnStartup=true, configSetProperties=configsetprops.json, collection=control_collection, coreNodeName=, dataDir=data\, shard=}
[junit4] 2> 780717 INFO (TEST-TestRandomRequestDistribution.test-seed#[B18A4B197D227008]) [n:127.0.0.1:54217_ ] o.a.s.c.CorePropertiesLocator Found core collection1 in C:\Users\jenkins\workspace\Lucene-Solr-6.2-Windows\solr\build\solr-core\test\J0\..\..\..\..\..\..\..\..\..\Users\jenkins\workspace\Lucene-Solr-6.2-Windows\solr\build\solr-core\test\J0\temp\solr.cloud.TestRandomRequestDistribution_B18A4B197D227008-001\control-001\cores\collection1
[junit4] 2> 780717 INFO (TEST-TestRandomRequestDistribution.test-seed#[B18A4B197D227008]) [n:127.0.0.1:54217_ ] o.a.s.c.CorePropertiesLocator Found 1 core definitions
[junit4] 2> 780719 INFO (TEST-TestRandomRequestDistribution.test-seed#[B18A4B197D227008]) [n:127.0.0.1:54217_ ] o.a.s.s.SolrDispatchFilter user.dir=C:\Users\jenkins\workspace\Lucene-Solr-6.2-Windows\solr\build\solr-core\test\J0
[junit4] 2> 780719 INFO (TEST-TestRandomRequestDistribution.test-seed#[B18A4B197D227008]) [n:127.0.0.1:54217_ ] o.a.s.s.SolrDispatchFilter SolrDispatchFilter.init() done
[junit4] 2> 780720 INFO (coreLoadExecutor-2429-thread-1-processing-n:127.0.0.1:54217_) [n:127.0.0.1:54217_ c:control_collection x:collection1] o.a.s.c.ZkController publishing state=down
[junit4] 2> 780720 INFO (coreLoadExecutor-2429-thread-1-processing-n:127.0.0.1:54217_) [n:127.0.0.1:54217_ c:control_collection x:collection1] o.a.s.c.ZkController numShards not found on descriptor - reading it from system property
[junit4] 2> 780721 INFO (coreLoadExecutor-2429-thread-1-processing-n:127.0.0.1:54217_) [n:127.0.0.1:54217_ c:control_collection x:collection1] o.a.s.c.ZkController Collection control_collection not visible yet, but flagging it so a watch is registered when it becomes visible
[junit4] 2> 780722 INFO (OverseerStateUpdate-96612588828753924-127.0.0.1:54217_-n_0000000000) [n:127.0.0.1:54217_ ] o.a.s.c.Overseer processMessage: queueSize: 1, message = {
[junit4] 2> "core":"collection1",
[junit4] 2> "roles":null,
[junit4] 2> "base_url":"http://127.0.0.1:54217",
[junit4] 2> "node_name":"127.0.0.1:54217_",
[junit4] 2> "numShards":"1",
[junit4] 2> "state":"down",
[junit4] 2> "shard":null,
[junit4] 2> "collection":"control_collection",
[junit4] 2> "operation":"state"} current state version: 0
[junit4] 2> 780722 INFO (OverseerStateUpdate-96612588828753924-127.0.0.1:54217_-n_0000000000) [n:127.0.0.1:54217_ ] o.a.s.c.o.ReplicaMutator Update state numShards=1 message={
[junit4] 2> "core":"collection1",
[junit4] 2> "roles":null,
[junit4] 2> "base_url":"http://127.0.0.1:54217",
[junit4] 2> "node_name":"127.0.0.1:54217_",
[junit4] 2> "numShards":"1",
[junit4] 2> "state":"down",
[junit4] 2> "shard":null,
[junit4] 2> "collection":"control_collection",
[junit4] 2> "operation":"state"}
[junit4] 2> 780722 INFO (coreLoadExecutor-2429-thread-1-processing-n:127.0.0.1:54217_) [n:127.0.0.1:54217_ c:control_collection x:collection1] o.a.s.c.c.ZkStateReader Deleting data for [control_collection]
[junit4] 2> 780723 INFO (OverseerStateUpdate-96612588828753924-127.0.0.1:54217_-n_0000000000) [n:127.0.0.1:54217_ ] o.a.s.c.o.ClusterStateMutator building a new cName: control_collection
[junit4] 2> 780723 INFO (OverseerStateUpdate-96612588828753924-127.0.0.1:54217_-n_0000000000) [n:127.0.0.1:54217_ ] o.a.s.c.o.ReplicaMutator Assigning new node to shard shard=shard1
[junit4] 2> 780724 INFO (coreLoadExecutor-2429-thread-1-processing-n:127.0.0.1:54217_) [n:127.0.0.1:54217_ c:control_collection x:collection1] o.a.s.c.ZkController look for our core node name
[junit4] 2> 780725 INFO (zkCallback-883-thread-1-processing-n:127.0.0.1:54217_) [n:127.0.0.1:54217_ ] o.a.s.c.c.ZkStateReader A cluster state change: [WatchedEvent state:SyncConnected type:NodeDataChanged path:/clusterstate.json], has occurred - updating... (live nodes size: [1])
[junit4] 2> 781726 INFO (coreLoadExecutor-2429-thread-1-processing-n:127.0.0.1:54217_) [n:127.0.0.1:54217_ c:control_collection x:collection1] o.a.s.c.ZkController waiting to find shard id in clusterstate for collection1
[junit4] 2> 781726 INFO (coreLoadExecutor-2429-thread-1-processing-n:127.0.0.1:54217_) [n:127.0.0.1:54217_ c:control_collection x:collection1] o.a.s.c.ZkController Check for collection zkNode:control_collection
[junit4] 2> 781726 INFO (coreLoadExecutor-2429-thread-1-processing-n:127.0.0.1:54217_) [n:127.0.0.1:54217_ c:control_collection x:collection1] o.a.s.c.ZkController Collection zkNode exists
[junit4] 2> 781726 INFO (coreLoadExecutor-2429-thread-1-processing-n:127.0.0.1:54217_) [n:127.0.0.1:54217_ c:control_collection x:collection1] o.a.s.c.c.ZkStateReader Load collection config from: [/collections/control_collection]
[junit4] 2> 781727 INFO (coreLoadExecutor-2429-thread-1-processing-n:127.0.0.1:54217_) [n:127.0.0.1:54217_ c:control_collection x:collection1] o.a.s.c.c.ZkStateReader path=[/collections/control_collection] [configName]=[conf1] specified config exists in ZooKeeper
[junit4] 2> 781727 INFO (coreLoadExecutor-2429-thread-1-processing-n:127.0.0.1:54217_) [n:127.0.0.1:54217_ c:control_collection x:collection1] o.a.s.c.SolrResourceLoader new SolrResourceLoader for directory: 'C:\Users\jenkins\workspace\Lucene-Solr-6.2-Windows\solr\build\solr-core\test\J0\temp\solr.cloud.TestRandomRequestDistribution_B18A4B197D227008-001\control-001\cores\collection1'
[junit4] 2> 781727 INFO (coreLoadExecutor-2429-thread-1-processing-n:127.0.0.1:54217_) [n:127.0.0.1:54217_ c:control_collection x:collection1] o.a.s.c.SolrResourceLoader JNDI not configured for solr (NoInitialContextEx)
[junit4] 2> 781728 INFO (coreLoadExecutor-2429-thread-1-processing-n:127.0.0.1:54217_) [n:127.0.0.1:54217_ c:control_collection x:collection1] o.a.s.c.SolrResourceLoader solr home defaulted to 'solr/' (could not find system property or JNDI)
[junit4] 2> 781732 INFO (coreLoadExecutor-2429-thread-1-processing-n:127.0.0.1:54217_) [n:127.0.0.1:54217_ c:control_collection x:collection1] o.a.s.c.Config loaded config solrconfig.xml with version 0
[junit4] 2> 781746 INFO (coreLoadExecutor-2429-thread-1-processing-n:127.0.0.1:54217_) [n:127.0.0.1:54217_ c:control_collection x:collection1] o.a.s.c.SolrConfig current version of requestparams : -1
[junit4] 2> 781752 INFO (coreLoadExecutor-2429-thread-1-processing-n:127.0.0.1:54217_) [n:127.0.0.1:54217_ c:control_collection x:collection1] o.a.s.c.SolrConfig Using Lucene MatchVersion: 6.2.1
[junit4] 2> 781766 INFO (coreLoadExecutor-2429-thread-1-processing-n:127.0.0.1:54217_) [n:127.0.0.1:54217_ c:control_collection x:collection1] o.a.s.c.SolrConfig Loaded SolrConfig: solrconfig.xml
[junit4] 2> 781775 INFO (coreLoadExecutor-2429-thread-1-processing-n:127.0.0.1:54217_) [n:127.0.0.1:54217_ c:control_collection x:collection1] o.a.s.s.IndexSchema [collection1] Schema name=test
[junit4] 2> 781874 INFO (coreLoadExecutor-2429-thread-1-processing-n:127.0.0.1:54217_) [n:127.0.0.1:54217_ c:control_collection x:collection1] o.a.s.s.OpenExchangeRatesOrgProvider Initialized with rates=open-exchange-rates.json, refreshInterval=1440.
[junit4] 2> 781886 INFO (coreLoadExecutor-2429-thread-1-processing-n:127.0.0.1:54217_) [n:127.0.0.1:54217_ c:control_collection x:collection1] o.a.s.s.IndexSchema default search field in schema is text
[junit4] 2> 781887 INFO (coreLoadExecutor-2429-thread-1-processing-n:127.0.0.1:54217_) [n:127.0.0.1:54217_ c:control_collection x:collection1] o.a.s.s.IndexSchema unique key field: id
[junit4] 2> 781900 INFO (coreLoadExecutor-2429-thread-1-processing-n:127.0.0.1:54217_) [n:127.0.0.1:54217_ c:control_collection x:collection1] o.a.s.s.FileExchangeRateProvider Reloading exchange rates from file currency.xml
[junit4] 2> 781904 INFO (coreLoadExecutor-2429-thread-1-processing-n:127.0.0.1:54217_) [n:127.0.0.1:54217_ c:control_collection x:collection1] o.a.s.s.FileExchangeRateProvider Reloading exchange rates from file currency.xml
[junit4] 2> 781908 INFO (coreLoadExecutor-2429-thread-1-processing-n:127.0.0.1:54217_) [n:127.0.0.1:54217_ c:control_collection x:collection1] o.a.s.s.OpenExchangeRatesOrgProvider Reloading exchange rates from open-exchange-rates.json
[junit4] 2> 781910 INFO (coreLoadExecutor-2429-thread-1-processing-n:127.0.0.1:54217_) [n:127.0.0.1:54217_ c:control_collection x:collection1] o.a.s.s.OpenExchangeRatesOrgProvider Reloading exchange rates from open-exchange-rates.json
[junit4] 2> 781916 INFO (coreLoadExecutor-2429-thread-1-processing-n:127.0.0.1:54217_) [n:127.0.0.1:54217_ c:control_collection x:collection1] o.a.s.c.ConfigSetProperties Did not find ConfigSet properties, assuming default properties: Can't find resource 'configsetprops.json' in classpath or '/configs/conf1', cwd=C:\Users\jenkins\workspace\Lucene-Solr-6.2-Windows\solr\build\solr-core\test\J0
[junit4] 2> 781916 INFO (coreLoadExecutor-2429-thread-1-processing-n:127.0.0.1:54217_) [n:127.0.0.1:54217_ c:control_collection x:collection1] o.a.s.c.CoreContainer Creating SolrCore 'collection1' using configuration from collection control_collection
[junit4] 2> 781917 INFO (coreLoadExecutor-2429-thread-1-processing-n:127.0.0.1:54217_) [n:127.0.0.1:54217_ c:control_collection s:shard1 r:core_node1 x:collection1] o.a.s.c.SolrCore org.apache.solr.core.MockDirectoryFactory
[junit4] 2> 781917 INFO (coreLoadExecutor-2429-thread-1-processing-n:127.0.0.1:54217_) [n:127.0.0.1:54217_ c:control_collection s:shard1 r:core_node1 x:collection1] o.a.s.c.SolrCore [[collection1] ] Opening new SolrCore at [C:\Users\jenkins\workspace\Lucene-Solr-6.2-Windows\solr\build\solr-core\test\J0\temp\solr.cloud.TestRandomRequestDistribution_B18A4B197D227008-001\control-001\cores\collection1], dataDir=[C:\Users\jenkins\workspace\Lucene-Solr-6.2-Windows\solr\build\solr-core\test\J0\..\..\..\..\..\..\..\..\..\Users\jenkins\workspace\Lucene-Solr-6.2-Windows\solr\build\solr-core\test\J0\temp\solr.cloud.TestRandomRequestDistribution_B18A4B197D227008-001\control-001\cores\collection1\data\]
[junit4] 2> 781917 INFO (coreLoadExecutor-2429-thread-1-processing-n:127.0.0.1:54217_) [n:127.0.0.1:54217_ c:control_collection s:shard1 r:core_node1 x:collection1] o.a.s.c.JmxMonitoredMap JMX monitoring is enabled. Adding Solr mbeans to JMX Server: com.sun.jmx.mbeanserver.JmxMBeanServer@6d42fe5f
[junit4] 2> 781917 INFO (coreLoadExecutor-2429-thread-1-processing-n:127.0.0.1:54217_) [n:127.0.0.1:54217_ c:control_collection s:shard1 r:core_node1 x:collection1] o.a.s.c.CachingDirectoryFactory return new directory for C:\Users\jenkins\workspace\Lucene-Solr-6.2-Windows\solr\build\solr-core\test\J0\..\..\..\..\..\..\..\..\..\Users\jenkins\workspace\Lucene-Solr-6.2-Windows\solr\build\solr-core\test\J0\temp\solr.cloud.TestRandomRequestDistribution_B18A4B197D227008-001\control-001\cores\collection1\data\snapshot_metadata
[junit4] 2> 781917 INFO (coreLoadExecutor-2429-thread-1-processing-n:127.0.0.1:54217_) [n:127.0.0.1:54217_ c:control_collection s:shard1 r:core_node1 x:collection1] o.a.s.c.s.SolrSnapshotMetaDataManager Loading from snapshot metadata file...
[junit4] 2> 781917 INFO (coreLoadExecutor-2429-thread-1-processing-n:127.0.0.1:54217_) [n:127.0.0.1:54217_ c:control_collection s:shard1 r:core_node1 x:collection1] o.a.s.c.CachingDirectoryFactory return new directory for C:\Users\jenkins\workspace\Lucene-Solr-6.2-Windows\solr\build\solr-core\test\J0\..\..\..\..\..\..\..\..\..\Users\jenkins\workspace\Lucene-Solr-6.2-Windows\solr\build\solr-core\test\J0\temp\solr.cloud.TestRandomRequestDistribution_B18A4B197D227008-001\control-001\cores\collection1\data\
[junit4] 2> 781918 INFO (coreLoadExecutor-2429-thread-1-processing-n:127.0.0.1:54217_) [n:127.0.0.1:54217_ c:control_collection s:shard1 r:core_node1 x:collection1] o.a.s.c.SolrCore New index directory detected: old=null new=C:\Users\jenkins\workspace\Lucene-Solr-6.2-Windows\solr\build\solr-core\test\J0\..\..\..\..\..\..\..\..\..\Users\jenkins\workspace\Lucene-Solr-6.2-Windows\solr\build\solr-core\test\J0\temp\solr.cloud.TestRandomRequestDistribution_B18A4B197D227008-001\control-001\cores\collection1\data\index/
[junit4] 2> 781918 WARN (coreLoadExecutor-2429-thread-1-processing-n:127.0.0.1:54217_) [n:127.0.0.1:54217_ c:control_collection s:shard1 r:core_node1 x:collection1] o.a.s.c.SolrCore [collection1] Solr index directory 'C:\Users\jenkins\workspace\Lucene-Solr-6.2-Windows\solr\build\solr-core\test\J0\..\..\..\..\..\..\..\..\..\Users\jenkins\workspace\Lucene-Solr-6.2-Windows\solr\build\solr-core\test\J0\temp\solr.cloud.TestRandomRequestDistribution_B18A4B197D227008-001\control-001\cores\collection1\data\index' doesn't exist. Creating new index...
[junit4] 2> 781918 INFO (coreLoadExecutor-2429-thread-1-processing-n:127.0.0.1:54217_) [n:127.0.0.1:54217_ c:control_collection s:shard1 r:core_node1 x:collection1] o.a.s.c.CachingDirectoryFactory return new directory for C:\Users\jenkins\workspace\Lucene-Solr-6.2-Windows\solr\build\solr-core\test\J0\..\..\..\..\..\..\..\..\..\Users\jenkins\workspace\Lucene-Solr-6.2-Windows\solr\build\solr-core\test\J0\temp\solr.cloud.TestRandomRequestDistribution_B18A4B197D227008-001\control-001\cores\collection1\data\index
[junit4] 2> 781918 INFO (coreLoadExecutor-2429-thread-1-processing-n:127.0.0.1:54217_) [n:127.0.0.1:54217_ c:control_collection s:shard1 r:core_node1 x:collection1] o.a.s.u.RandomMergePolicy RandomMergePolicy wrapping class org.apache.lucene.index.AlcoholicMergePolicy: [AlcoholicMergePolicy: minMergeSize=0, mergeFactor=10, maxMergeSize=871093976, maxMergeSizeForForcedMerge=9223372036854775807, calibrateSizeByDeletes=true, maxMergeDocs=2147483647, maxCFSSegmentSizeMB=8.796093022207999E12, noCFSRatio=0.1]
[junit4] 2> 781924 INFO (coreLoadExecutor-2429-thread-1-processing-n:127.0.0.1:54217_) [n:127.0.0.1:54217_ c:control_collection s:shard1 r:core_node1 x:collection1] o.a.s.c.SolrDeletionPolicy SolrDeletionPolicy.onCommit: commits: num=1
[junit4] 2> commit{dir=MockDirectoryWrapper(RAMDirectory@164bdfcd lockFactory=org.apache.lucene.store.SingleInstanceLockFactory@2c9089e3),segFN=segments_1,generation=1}
[junit4] 2> 781924 INFO (coreLoadExecutor-2429-thread-1-processing-n:127.0.0.1:54217_) [n:127.0.0.1:54217_ c:control_collection s:shard1 r:core_node1 x:collection1] o.a.s.c.SolrDeletionPolicy newest commit generation = 1
[junit4] 2> 781928 INFO (coreLoadExecutor-2429-thread-1-processing-n:127.0.0.1:54217_) [n:127.0.0.1:54217_ c:control_collection s:shard1 r:core_node1 x:collection1] o.a.s.u.p.UpdateRequestProcessorChain creating updateRequestProcessorChain "nodistrib"
[junit4] 2> 781928 INFO (coreLoadExecutor-2429-thread-1-processing-n:127.0.0.1:54217_) [n:127.0.0.1:54217_ c:control_collection s:shard1 r:core_node1 x:collection1] o.a.s.u.p.UpdateRequestProcessorChain creating updateRequestProcessorChain "dedupe"
[junit4] 2> 781928 INFO (coreLoadExecutor-2429-thread-1-processing-n:127.0.0.1:54217_) [n:127.0.0.1:54217_ c:control_collection s:shard1 r:core_node1 x:collection1] o.a.s.u.p.UpdateRequestProcessorChain inserting DistributedUpdateProcessorFactory into updateRequestProcessorChain "dedupe"
[junit4] 2> 781928 INFO (coreLoadExecutor-2429-thread-1-processing-n:127.0.0.1:54217_) [n:127.0.0.1:54217_ c:control_collection s:shard1 r:core_node1 x:collection1] o.a.s.u.p.UpdateRequestProcessorChain creating updateRequestProcessorChain "stored_sig"
[junit4] 2> 781928 INFO (coreLoadExecutor-2429-thread-1-processing-n:127.0.0.1:54217_) [n:127.0.0.1:54217_ c:control_collection s:shard1 r:core_node1 x:collection1] o.a.s.u.p.UpdateRequestProcessorChain inserting DistributedUpdateProcessorFactory into updateRequestProcessorChain "stored_sig"
[junit4] 2> 781928 INFO (coreLoadExecutor-2429-thread-1-processing-n:127.0.0.1:54217_) [n:127.0.0.1:54217_ c:control_collection s:shard1 r:core_node1 x:collection1] o.a.s.u.p.UpdateRequestProcessorChain creating updateRequestProcessorChain "distrib-dup-test-chain-explicit"
[junit4] 2> 781929 INFO (coreLoadExecutor-2429-thread-1-processing-n:127.0.0.1:54217_) [n:127.0.0.1:54217_ c:control_collection s:shard1 r:core_node1 x:collection1] o.a.s.u.p.UpdateRequestProcessorChain creating updateRequestProcessorChain "distrib-dup-test-chain-implicit"
[junit4] 2> 781929 INFO (coreLoadExecutor-2429-thread-1-processing-n:127.0.0.1:54217_) [n:127.0.0.1:54217_ c:control_collection s:shard1 r:core_node1 x:collection1] o.a.s.u.p.UpdateRequestProcessorChain inserting DistributedUpdateProcessorFactory into updateRequestProcessorChain "distrib-dup-test-chain-implicit"
[junit4] 2> 781929 INFO (coreLoadExecutor-2429-thread-1-processing-n:127.0.0.1:54217_) [n:127.0.0.1:54217_ c:control_collection s:shard1 r:core_node1 x:collection1] o.a.s.c.SolrCore no updateRequestProcessorChain defined as default, creating implicit default
[junit4] 2> 781929 WARN (coreLoadExecutor-2429-thread-1-processing-n:127.0.0.1:54217_) [n:127.0.0.1:54217_ c:control_collection s:shard1 r:core_node1 x:collection1] o.a.s.c.RequestHandlers INVALID paramSet a in requestHandler {type = requestHandler,name = /dump,class = DumpRequestHandler,args = {defaults={a=A,b=B}}}
[junit4] 2> 781938 INFO (OldIndexDirectoryCleanupThreadForCore-collection1) [n:127.0.0.1:54217_ c:control_collection s:shard1 r:core_node1 x:collection1] o.a.s.c.SolrCore Looking for old index directories to cleanup for core collection1 in C:\Users\jenkins\workspace\Lucene-Solr-6.2-Windows\solr\build\solr-core\test\J0\..\..\..\..\..\..\..\..\..\Users\jenkins\workspace\Lucene-Solr-6.2-Windows\solr\build\solr-core\test\J0\temp\solr.cloud.TestRandomRequestDistribution_B18A4B197D227008-001\control-001\cores\collection1\data\
[junit4] 2> 781940 WARN (OldIndexDirectoryCleanupThreadForCore-collection1) [n:127.0.0.1:54217_ c:control_collection s:shard1 r:core_node1 x:collection1] o.a.s.c.DirectoryFactory C:\Users\jenkins\workspace\Lucene-Solr-6.2-Windows\solr\build\solr-core\test\J0\..\..\..\..\..\..\..\..\..\Users\jenkins\workspace\Lucene-Solr-6.2-Windows\solr\build\solr-core\test\J0\temp\solr.cloud.TestRandomRequestDistribution_B18A4B197D227008-001\control-001\cores\collection1\data\ does not point to a valid data directory; skipping clean-up of old index directories.
[junit4] 2> 781942 INFO (coreLoadExecutor-2429-thread-1-processing-n:127.0.0.1:54217_) [n:127.0.0.1:54217_ c:control_collection s:shard1 r:core_node1 x:collection1] o.a.s.h.l.XMLLoader xsltCacheLifetimeSeconds=60
[junit4] 2> 781945 INFO (coreLoadExecutor-2429-thread-1-processing-n:127.0.0.1:54217_) [n:127.0.0.1:54217_ c:control_collection s:shard1 r:core_node1 x:collection1] o.a.s.h.l.XMLLoader xsltCacheLifetimeSeconds=60
[junit4] 2> 781948 INFO (coreLoadExecutor-2429-thread-1-processing-n:127.0.0.1:54217_) [n:127.0.0.1:54217_ c:control_collection s:shard1 r:core_node1 x:collection1] o.a.s.h.l.XMLLoader xsltCacheLifetimeSeconds=60
[junit4] 2> 781950 INFO (coreLoadExecutor-2429-thread-1-processing-n:127.0.0.1:54217_) [n:127.0.0.1:54217_ c:control_collection s:shard1 r:core_node1 x:collection1] o.a.s.h.l.XMLLoader xsltCacheLifetimeSeconds=60
[junit4] 2> 781956 INFO (coreLoadExecutor-2429-thread-1-processing-n:127.0.0.1:54217_) [n:127.0.0.1:54217_ c:control_collection s:shard1 r:core_node1 x:collection1] o.a.s.c.RequestHandlers Registered paths: /admin/mbeans,standard,/update/json/docs,/admin/luke,/export,/get,/admin/properties,/update/json,/admin/threads,/dump,/update/csv,/sql,/graph,/admin/segments,/admin/system,/replication,/config,/stream,/schema,/admin/plugins,/admin/logging,/admin/ping,/update,/admin/file,/terms
[junit4] 2> 781956 INFO (coreLoadExecutor-2429-thread-1-processing-n:127.0.0.1:54217_) [n:127.0.0.1:54217_ c:control_collection s:shard1 r:core_node1 x:collection1] o.a.s.c.SolrCore Using default statsCache cache: org.apache.solr.search.stats.LocalStatsCache
[junit4] 2> 781958 INFO (coreLoadExecutor-2429-thread-1-processing-n:127.0.0.1:54217_) [n:127.0.0.1:54217_ c:control_collection s:shard1 r:core_node1 x:collection1] o.a.s.u.UpdateHandler Using UpdateLog implementation: org.apache.solr.update.UpdateLog
[junit4] 2> 781958 INFO (coreLoadExecutor-2429-thread-1-processing-n:127.0.0.1:54217_) [n:127.0.0.1:54217_ c:control_collection s:shard1 r:core_node1 x:collection1] o.a.s.u.UpdateLog Initializing UpdateLog: dataDir= defaultSyncLevel=FLUSH numRecordsToKeep=100 maxNumLogsToKeep=10 numVersionBuckets=65536
[junit4] 2> 781960 INFO (coreLoadExecutor-2429-thread-1-processing-n:127.0.0.1:54217_) [n:127.0.0.1:54217_ c:control_collection s:shard1 r:core_node1 x:collection1] o.a.s.u.CommitTracker Hard AutoCommit: disabled
[junit4] 2> 781960 INFO (coreLoadExecutor-2429-thread-1-processing-n:127.0.0.1:54217_) [n:127.0.0.1:54217_ c:control_collection s:shard1 r:core_node1 x:collection1] o.a.s.u.CommitTracker Soft AutoCommit: disabled
[junit4] 2> 781961 INFO (coreLoadExecutor-2429-thread-1-processing-n:127.0.0.1:54217_) [n:127.0.0.1:54217_ c:control_collection s:shard1 r:core_node1 x:collection1] o.a.s.u.RandomMergePolicy RandomMergePolicy wrapping class org.apache.lucene.index.LogDocMergePolicy: [LogDocMergePolicy: minMergeSize=1000, mergeFactor=23, maxMergeSize=9223372036854775807, maxMergeSizeForForcedMerge=9223372036854775807, calibrateSizeByDeletes=false, maxMergeDocs=2147483647, maxCFSSegmentSizeMB=8.796093022207999E12, noCFSRatio=0.0]
[junit4] 2> 781961 INFO (coreLoadExecutor-2429-thread-1-processing-n:127.0.0.1:54217_) [n:127.0.0.1:54217_ c:control_collection s:shard1 r:core_node1 x:collection1] o.a.s.c.SolrDeletionPolicy SolrDeletionPolicy.onInit: commits: num=1
[junit4] 2> commit{dir=MockDirectoryWrapper(RAMDirectory@164bdfcd lockFactory=org.apache.lucene.store.SingleInstanceLockFactory@2c9089e3),segFN=segments_1,generation=1}
[junit4] 2> 781961 INFO (coreLoadExecutor-2429-thread-1-processing-n:127.0.0.1:54217_) [n:127.0.0.1:54217_ c:control_collection s:shard1 r:core_node1 x:collection1] o.a.s.c.SolrDeletionPolicy newest commit generation = 1
[junit4] 2> 781962 INFO (coreLoadExecutor-2429-thread-1-processing-n:127.0.0.1:54217_) [n:127.0.0.1:54217_ c:control_collection s:shard1 r:core_node1 x:collection1] o.a.s.s.SolrIndexSearcher Opening [Searcher@5facd200[collection1] main]
[junit4] 2> 781962 INFO (coreLoadExecutor-2429-thread-1-processing-n:127.0.0.1:54217_) [n:127.0.0.1:54217_ c:control_collection s:shard1 r:core_node1 x:collection1] o.a.s.c.c.ZkStateReader Load collection config from: [/collections/control_collection]
[junit4] 2> 781963 INFO (coreLoadExecutor-2429-thread-1-processing-n:127.0.0.1:54217_) [n:127.0.0.1:54217_ c:control_collection s:shard1 r:core_node1 x:collection1] o.a.s.c.c.ZkStateReader path=[/collections/control_collection] [configName]=[conf1] specified config exists in ZooKeeper
[junit4] 2> 781963 INFO (coreLoadExecutor-2429-thread-1-processing-n:127.0.0.1:54217_) [n:127.0.0.1:54217_ c:control_collection s:shard1 r:core_node1 x:collection1] o.a.s.r.ManagedResourceStorage Setting up ZooKeeper-based storage for the RestManager with znodeBase: /configs/conf1
[junit4] 2> 781963 INFO (coreLoadExecutor-2429-thread-1-processing-n:127.0.0.1:54217_) [n:127.0.0.1:54217_ c:control_collection s:shard1 r:core_node1 x:collection1] o.a.s.r.ManagedResourceStorage Configured ZooKeeperStorageIO with znodeBase: /configs/conf1
[junit4] 2> 781963 INFO (coreLoadExecutor-2429-thread-1-processing-n:127.0.0.1:54217_) [n:127.0.0.1:54217_ c:control_collection s:shard1 r:core_node1 x:collection1] o.a.s.r.RestManager Initializing RestManager with initArgs: {}
[junit4] 2> 781963 INFO (coreLoadExecutor-2429-thread-1-processing-n:127.0.0.1:54217_) [n:127.0.0.1:54217_ c:control_collection s:shard1 r:core_node1 x:collection1] o.a.s.r.ManagedResourceStorage Reading _rest_managed.json using ZooKeeperStorageIO:path=/configs/conf1
[junit4] 2> 781964 INFO (coreLoadExecutor-2429-thread-1-processing-n:127.0.0.1:54217_) [n:127.0.0.1:54217_ c:control_collection s:shard1 r:core_node1 x:collection1] o.a.s.r.ManagedResourceStorage No data found for znode /configs/conf1/_rest_managed.json
[junit4] 2> 781964 INFO (coreLoadExecutor-2429-thread-1-processing-n:127.0.0.1:54217_) [n:127.0.0.1:54217_ c:control_collection s:shard1 r:core_node1 x:collection1] o.a.s.r.ManagedResourceStorage Loaded null at path _rest_managed.json using ZooKeeperStorageIO:path=/configs/conf1
[junit4] 2> 781964 INFO (coreLoadExecutor-2429-thread-1-processing-n:127.0.0.1:54217_) [n:127.0.0.1:54217_ c:control_collection s:shard1 r:core_node1 x:collection1] o.a.s.r.RestManager Initializing 0 registered ManagedResources
[junit4] 2> 781964 INFO (coreLoadExecutor-2429-thread-1-processing-n:127.0.0.1:54217_) [n:127.0.0.1:54217_ c:control_collection s:shard1 r:core_node1 x:collection1] o.a.s.h.ReplicationHandler Commits will be reserved for 10000
[junit4] 2> 781964 INFO (coreLoadExecutor-2429-thread-1-processing-n:127.0.0.1:54217_) [n:127.0.0.1:54217_ c:control_collection s:shard1 r:core_node1 x:collection1] o.a.s.u.UpdateLog Looking up max value of version field to seed version buckets
[junit4] 2> 781965 INFO (coreLoadExecutor-2429-thread-1-processing-n:127.0.0.1:54217_) [n:127.0.0.1:54217_ c:control_collection s:shard1 r:core_node1 x:collection1] o.a.s.u.VersionInfo Refreshing highest value of _version_ for 65536 version buckets from index
[junit4] 2> 781965 INFO (coreLoadExecutor-2429-thread-1-processing-n:127.0.0.1:54217_) [n:127.0.0.1:54217_ c:control_collection s:shard1 r:core_node1 x:collection1] o.a.s.u.VersionInfo No terms found for _version_, cannot seed version bucket highest value from index
[junit4] 2> 781965 INFO (coreLoadExecutor-2429-thread-1-processing-n:127.0.0.1:54217_) [n:127.0.0.1:54217_ c:control_collection s:shard1 r:core_node1 x:collection1] o.a.s.u.UpdateLog Could not find max version in index or recent updates, using new clock 1545801423441100800
[junit4] 2> 781965 INFO (searcherExecutor-2430-thread-1-processing-n:127.0.0.1:54217_ x:collection1 s:shard1 c:control_collection r:core_node1) [n:127.0.0.1:54217_ c:control_collection s:shard1 r:core_node1 x:collection1] o.a.s.c.SolrCore [collection1] Registered new searcher Searcher@5facd200[collection1] main{ExitableDirectoryReader(UninvertingDirectoryReader())}
[junit4] 2> 781967 INFO (coreLoadExecutor-2429-thread-1-processing-n:127.0.0.1:54217_) [n:127.0.0.1:54217_ c:control_collection s:shard1 r:core_node1 x:collection1] o.a.s.u.UpdateLog Took 2.0ms to seed version buckets with highest version 1545801423441100800
[junit4] 2> 781967 INFO (coreLoadExecutor-2429-thread-1-processing-n:127.0.0.1:54217_) [n:127.0.0.1:54217_ c:control_collection s:shard1 r:core_node1 x:collection1] o.a.s.c.ZkController watch zkdir /configs/conf1
[junit4] 2> 781967 INFO (coreLoadExecutor-2429-thread-1-processing-n:127.0.0.1:54217_) [n:127.0.0.1:54217_ c:control_collection s:shard1 r:core_node1 x:collection1] o.a.s.c.CoreContainer registering core: collection1
[junit4] 2> 781968 INFO (coreZkRegister-2422-thread-1-processing-n:127.0.0.1:54217_ x:collection1 s:shard1 c:control_collection r:core_node1) [n:127.0.0.1:54217_ c:control_collection s:shard1 r:core_node1 x:collection1] o.a.s.c.ZkController Register replica - core:collection1 address:http://127.0.0.1:54217 collection:control_collection shard:shard1
[junit4] 2> 781969 INFO (coreZkRegister-2422-thread-1-processing-n:127.0.0.1:54217_ x:collection1 s:shard1 c:control_collection r:core_node1) [n:127.0.0.1:54217_ c:control_collection s:shard1 r:core_node1 x:collection1] o.a.s.c.c.SolrZkClient makePath: /collections/control_collection/leader_elect/shard1/election
[junit4] 2> 781974 INFO (coreZkRegister-2422-thread-1-processing-n:127.0.0.1:54217_ x:collection1 s:shard1 c:control_collection r:core_node1) [n:127.0.0.1:54217_ c:control_collection s:shard1 r:core_node1 x:collection1] o.a.s.c.LeaderElector Joined leadership election with path: /collections/control_collection/leader_elect/shard1/election/96612588828753924-core_node1-n_0000000000
[junit4] 2> 781974 INFO (coreZkRegister-2422-thread-1-processing-n:127.0.0.1:54217_ x:collection1 s:shard1 c:control_collection r:core_node1) [n:127.0.0.1:54217_ c:control_collection s:shard1 r:core_node1 x:collection1] o.a.s.c.ShardLeaderElectionContext Running the leader process for shard=shard1 and weAreReplacement=false and leaderVoteWait=10000
[junit4] 2> 781976 INFO (coreZkRegister-2422-thread-1-processing-n:127.0.0.1:54217_ x:collection1 s:shard1 c:control_collection r:core_node1) [n:127.0.0.1:54217_ c:control_collection s:shard1 r:core_node1 x:collection1] o.a.s.c.ShardLeaderElectionContext Enough replicas found to continue.
[junit4] 2> 781976 INFO (coreZkRegister-2422-thread-1-processing-n:127.0.0.1:54217_ x:collection1 s:shard1 c:control_collection r:core_node1) [n:127.0.0.1:54217_ c:control_collection s:shard1 r:core_node1 x:collection1] o.a.s.c.ShardLeaderElectionContext I may be the new leader - try and sync
[junit4] 2> 781976 INFO (coreZkRegister-2422-thread-1-processing-n:127.0.0.1:54217_ x:collection1 s:shard1 c:control_collection r:core_node1) [n:127.0.0.1:54217_ c:control_collection s:shard1 r:core_node1 x:collection1] o.a.s.c.SyncStrategy Sync replicas to http://127.0.0.1:54217/collection1/
[junit4] 2> 781976 INFO (coreZkRegister-2422-thread-1-processing-n:127.0.0.1:54217_ x:collection1 s:shard1 c:control_collection r:core_node1) [n:127.0.0.1:54217_ c:control_collection s:shard1 r:core_node1 x:collection1] o.a.s.c.SyncStrategy Sync Success - now sync replicas to me
[junit4] 2> 781976 INFO (coreZkRegister-2422-thread-1-processing-n:127.0.0.1:54217_ x:collection1 s:shard1 c:control_collection r:core_node1) [n:127.0.0.1:54217_ c:control_collection s:shard1 r:core_node1 x:collection1] o.a.s.c.SyncStrategy http://127.0.0.1:54217/collection1/ has no replicas
[junit4] 2> 781977 INFO (OverseerStateUpdate-96612588828753924-127.0.0.1:54217_-n_0000000000) [n:127.0.0.1:54217_ ] o.a.s.c.Overseer processMessage: queueSize: 1, message = {
[junit4] 2> "operation":"leader",
[junit4] 2> "shard":"shard1",
[junit4] 2> "collection":"control_collection"} current state version: 1
[junit4] 2> 781978 INFO (coreZkRegister-2422-thread-1-processing-n:127.0.0.1:54217_ x:collection1 s:shard1 c:control_collection r:core_node1) [n:127.0.0.1:54217_ c:control_collection s:shard1 r:core_node1 x:collection1] o.a.s.c.c.SolrZkClient makePath: /collections/control_collection/leaders/shard1
[junit4] 2> 781982 INFO (coreZkRegister-2422-thread-1-processing-n:127.0.0.1:54217_ x:collection1 s:shard1 c:control_collection r:core_node1) [n:127.0.0.1:54217_ c:control_collection s:shard1 r:core_node1 x:collection1] o.a.s.c.ShardLeaderElectionContextBase Creating leader registration node /collections/control_collection/leaders/shard1/leader after winning as /collections/control_collection/leader_elect/shard1/election/96612588828753924-core_node1-n_0000000000
[junit4] 2> 781984 INFO (coreZkRegister-2422-thread-1-processing-n:127.0.0.1:54217_ x:collection1 s:shard1 c:control_collection r:core_node1) [n:127.0.0.1:54217_ c:control_collection s:shard1 r:core_node1 x:collection1] o.a.s.c.ShardLeaderElectionContext I am the new leader: http://127.0.0.1:54217/collection1/ shard1
[junit4] 2> 781986 INFO (OverseerStateUpdate-96612588828753924-127.0.0.1:54217_-n_0000000000) [n:127.0.0.1:54217_ ] o.a.s.c.Overseer processMessage: queueSize: 1, message = {
[junit4] 2> "operation":"leader",
[junit4] 2> "shard":"shard1",
[junit4] 2> "collection":"control_collection",
[junit4] 2> "base_url":"http://127.0.0.1:54217",
[junit4] 2> "core":"collection1",
[junit4] 2> "state":"active"} current state version: 1
[junit4] 2> 782090 INFO (zkCallback-883-thread-2-processing-n:127.0.0.1:54217_) [n:127.0.0.1:54217_ ] o.a.s.c.c.ZkStateReader A cluster state change: [WatchedEvent state:SyncConnected type:NodeDataChanged path:/clusterstate.json], has occurred - updating... (live nodes size: [1])
[junit4] 2> 782138 INFO (coreZkRegister-2422-thread-1-processing-n:127.0.0.1:54217_ x:collection1 s:shard1 c:control_collection r:core_node1) [n:127.0.0.1:54217_ c:control_collection s:shard1 r:core_node1 x:collection1] o.a.s.c.ZkController We are http://127.0.0.1:54217/collection1/ and leader is http://127.0.0.1:54217/collection1/
[junit4] 2> 782138 INFO (coreZkRegister-2422-thread-1-processing-n:127.0.0.1:54217_ x:collection1 s:shard1 c:control_collection r:core_node1) [n:127.0.0.1:54217_ c:control_collection s:shard1 r:core_node1 x:collection1] o.a.s.c.ZkController No LogReplay needed for core=collection1 baseURL=http://127.0.0.1:54217
[junit4] 2> 782138 INFO (coreZkRegister-2422-thread-1-processing-n:127.0.0.1:54217_ x:collection1 s:shard1 c:control_collection r:core_node1) [n:127.0.0.1:54217_ c:control_collection s:shard1 r:core_node1 x:collection1] o.a.s.c.ZkController I am the leader, no recovery necessary
[junit4] 2> 782139 INFO (coreZkRegister-2422-thread-1-processing-n:127.0.0.1:54217_ x:collection1 s:shard1 c:control_collection r:core_node1) [n:127.0.0.1:54217_ c:control_collection s:shard1 r:core_node1 x:collection1] o.a.s.c.ZkController publishing state=active
[junit4] 2> 782139 INFO (coreZkRegister-2422-thread-1-processing-n:127.0.0.1:54217_ x:collection1 s:shard1 c:control_collection r:core_node1) [n:127.0.0.1:54217_ c:control_collection s:shard1 r:core_node1 x:collection1] o.a.s.c.ZkController numShards not found on descriptor - reading it from system property
[junit4] 2> 782142 INFO (coreZkRegister-2422-thread-1-processing-n:127.0.0.1:54217_ x:collection1 s:shard1 c:control_collection r:core_node1) [n:127.0.0.1:54217_ c:control_collection s:shard1 r:core_node1 x:collection1] o.a.s.c.c.ZkStateReader Checking legacy cluster state for collection control_collection
[junit4] 2> 782143 INFO (OverseerStateUpdate-96612588828753924-127.0.0.1:54217_-n_0000000000) [n:127.0.0.1:54217_ ] o.a.s.c.Overseer processMessage: queueSize: 1, message = {
[junit4] 2> "core":"collection1",
[junit4] 2> "core_node_name":"core_node1",
[junit4] 2> "roles":null,
[junit4] 2> "base_url":"http://127.0.0.1:54217",
[junit4] 2> "node_name":"127.0.0.1:54217_",
[junit4] 2> "numShards":"1",
[junit4] 2> "state":"active",
[junit4] 2> "shard":"shard1",
[junit4] 2> "collection":"control_collection",
[junit4] 2> "operation":"state"} current state version: 2
[junit4] 2> 782143 INFO (OverseerStateUpdate-96612588828753924-127.0.0.1:54217_-n_0000000000) [n:127.0.0.1:54217_ ] o.a.s.c.o.ReplicaMutator Update state numShards=1 message={
[junit4] 2> "core":"collection1",
[junit4] 2> "core_node_name":"core_node1",
[junit4] 2> "roles":null,
[junit4] 2> "base_url":"http://127.0.0.1:54217",
[junit4] 2> "node_name":"127.0.0.1:54217_",
[junit4] 2> "numShards":"1",
[junit4] 2> "state":"active",
[junit4] 2> "shard":"shard1",
[junit4] 2> "collection":"control_collection",
[junit4] 2> "operation":"state"}
[junit4] 2> 782222 INFO (TEST-TestRandomRequestDistribution.test-seed#[B18A4B197D227008]) [ ] o.a.s.c.c.SolrZkClient Using default ZkCredentialsProvider
[junit4] 2> 782224 INFO (TEST-TestRandomRequestDistribution.test-seed#[B18A4B197D227008]) [ ] o.a.s.c.c.ConnectionManager Waiting for client to connect to ZooKeeper
[junit4] 2> 782227 INFO (zkCallback-887-thread-1) [ ] o.a.s.c.c.ConnectionManager Watcher org.apache.solr.common.cloud.ConnectionManager@aed71ea name:ZooKeeperConnection Watcher:127.0.0.1:54208/solr got event WatchedEvent state:SyncConnected type:None path:null path:null type:None
[junit4] 2> 782227 INFO (TEST-TestRandomRequestDistribution.test-seed#[B18A4B197D227008]) [ ] o.a.s.c.c.ConnectionManager Client is connected to ZooKeeper
[junit4] 2> 782227 INFO (TEST-TestRandomRequestDistribution.test-seed#[B18A4B197D227008]) [ ] o.a.s.c.c.SolrZkClient Using default ZkACLProvider
[junit4] 2> 782227 INFO (TEST-TestRandomRequestDistribution.test-seed#[B18A4B197D227008]) [ ] o.a.s.c.c.ZkStateReader Updating cluster state from ZooKeeper...
[junit4] 2> 782228 INFO (TEST-TestRandomRequestDistribution.test-seed#[B18A4B197D227008]) [ ] o.a.s.c.c.ZkStateReader Loaded empty cluster properties
[junit4] 2> 782229 INFO (TEST-TestRandomRequestDistribution.test-seed#[B18A4B197D227008]) [ ] o.a.s.c.c.ZkStateReader Updated live nodes from ZooKeeper... (0) -> (1)
[junit4] 2> 782232 INFO (TEST-TestRandomRequestDistribution.test-seed#[B18A4B197D227008]) [ ] o.a.s.c.ChaosMonkey monkey: init - expire sessions:false cause connection loss:false
[junit4] 2> 782232 INFO (TEST-TestRandomRequestDistribution.test-seed#[B18A4B197D227008]) [ ] o.a.s.c.AbstractFullDistribZkTestBase Creating collection1 with stateFormat=2
[junit4] 2> 782232 INFO (TEST-TestRandomRequestDistribution.test-seed#[B18A4B197D227008]) [ ] o.a.s.c.c.SolrZkClient Using default ZkCredentialsProvider
[junit4] 2> 782234 INFO (TEST-TestRandomRequestDistribution.test-seed#[B18A4B197D227008]) [ ] o.a.s.c.c.ConnectionManager Waiting for client to connect to ZooKeeper
[junit4] 2> 782236 INFO (zkCallback-888-thread-1) [ ] o.a.s.c.c.ConnectionManager Watcher org.apache.solr.common.cloud.ConnectionManager@795b76c1 name:ZooKeeperConnection Watcher:127.0.0.1:54208/solr got event WatchedEvent state:SyncConnected type:None path:null path:null type:None
[junit4] 2> 782236 INFO (TEST-TestRandomRequestDistribution.test-seed#[B18A4B197D227008]) [ ] o.a.s.c.c.ConnectionManager Client is connected to ZooKeeper
[junit4] 2> 782236 INFO (TEST-TestRandomRequestDistribution.test-seed#[B18A4B197D227008]) [ ] o.a.s.c.c.SolrZkClient Using default ZkACLProvider
[junit4] 2> 782239 WARN (NIOServerCxn.Factory:0.0.0.0/0.0.0.0:0) [ ] o.a.z.s.NIOServerCnxn caught end of stream exception
[junit4] 2> EndOfStreamException: Unable to read additional data from client sessionid 0x1573ca33df80006, likely client has closed socket
[junit4] 2> at org.apache.zookeeper.server.NIOServerCnxn.doIO(NIOServerCnxn.java:228)
[junit4] 2> at org.apache.zookeeper.server.NIOServerCnxnFactory.run(NIOServerCnxnFactory.java:208)
[junit4] 2> at java.lang.Thread.run(Thread.java:745)
[junit4] 2> 782239 INFO (OverseerStateUpdate-96612588828753924-127.0.0.1:54217_-n_0000000000) [n:127.0.0.1:54217_ ] o.a.s.c.Overseer processMessage: queueSize: 1, message = {
[junit4] 2> "operation":"create",
[junit4] 2> "name":"collection1",
[junit4] 2> "numShards":"2",
[junit4] 2> "stateFormat":"2"} current state version: 2
[junit4] 2> 782240 INFO (OverseerStateUpdate-96612588828753924-127.0.0.1:54217_-n_0000000000) [n:127.0.0.1:54217_ ] o.a.s.c.o.ClusterStateMutator building a new cName: collection1
[junit4] 2> 782241 INFO (zkCallback-883-thread-1-processing-n:127.0.0.1:54217_) [n:127.0.0.1:54217_ ] o.a.s.c.c.ZkStateReader A cluster state change: [WatchedEvent state:SyncConnected type:NodeDataChanged path:/clusterstate.json], has occurred - updating... (live nodes size: [1])
[junit4] 2> 782241 INFO (zkCallback-887-thread-1) [ ] o.a.s.c.c.ZkStateReader A cluster state change: [WatchedEvent state:SyncConnected type:NodeDataChanged path:/clusterstate.json], has occurred - updating... (live nodes size: [1])
[junit4] 2> 782350 INFO (OverseerStateUpdate-96612588828753924-127.0.0.1:54217_-n_0000000000) [n:127.0.0.1:54217_ ] o.a.s.c.o.ZkStateWriter going to create_collection /collections/collection1/state.json
[junit4] 2> 782978 INFO (TEST-TestRandomRequestDistribution.test-seed#[B18A4B197D227008]) [ ] o.a.s.SolrTestCaseJ4 Writing core.properties file to C:\Users\jenkins\workspace\Lucene-Solr-6.2-Windows\solr\build\solr-core\test\J0\temp\solr.cloud.TestRandomRequestDistribution_B18A4B197D227008-001\shard-1-001\cores\collection1
[junit4] 2> 782980 INFO (TEST-TestRandomRequestDistribution.test-seed#[B18A4B197D227008]) [ ] o.a.s.c.AbstractFullDistribZkTestBase create jetty 1 in directory C:\Users\jenkins\workspace\Lucene-Solr-6.2-Windows\solr\build\solr-core\test\J0\temp\solr.cloud.TestRandomRequestDistribution_B18A4B197D227008-001\shard-1-001
[junit4] 2> 782980 INFO (TEST-TestRandomRequestDistribution.test-seed#[B18A4B197D227008]) [ ] o.e.j.s.Server jetty-9.3.8.v20160314
[junit4] 2> 782982 INFO (TEST-TestRandomRequestDistribution.test-seed#[B18A4B197D227008]) [ ] o.e.j.s.h.ContextHandler Started o.e.j.s.ServletContextHandler@532635c5{/,null,AVAILABLE}
[junit4] 2> 782983 INFO (TEST-TestRandomRequestDistribution.test-seed#[B18A4B197D227008]) [ ] o.e.j.s.ServerConnector Started ServerConnector@12eab2cb{HTTP/1.1,[http/1.1]}{127.0.0.1:54235}
[junit4] 2> 782983 INFO (TEST-TestRandomRequestDistribution.test-seed#[B18A4B197D227008]) [ ] o.e.j.s.Server Started @789086ms
[junit4] 2> 782983 INFO (TEST-TestRandomRequestDistribution.test-seed#[B18A4B197D227008]) [ ] o.a.s.c.s.e.JettySolrRunner Jetty properties: {solr.data.dir=C:\Users\jenkins\workspace\Lucene-Solr-6.2-Windows\solr\build\solr-core\test\J0\temp\solr.cloud.TestRandomRequestDistribution_B18A4B197D227008-001\tempDir-001/jetty1, solrconfig=solrconfig.xml, hostContext=/, hostPort=54235, coreRootDirectory=C:\Users\jenkins\workspace\Lucene-Solr-6.2-Windows\solr\build\solr-core\test\J0\temp\solr.cloud.TestRandomRequestDistribution_B18A4B197D227008-001\shard-1-001\cores}
[junit4] 2> 782985 INFO (TEST-TestRandomRequestDistribution.test-seed#[B18A4B197D227008]) [ ] o.a.s.s.SolrDispatchFilter SolrDispatchFilter.init(): sun.misc.Launcher$AppClassLoader@73d16e93
[junit4] 2> 782985 INFO (TEST-TestRandomRequestDistribution.test-seed#[B18A4B197D227008]) [ ] o.a.s.c.SolrResourceLoader new SolrResourceLoader for directory: 'C:\Users\jenkins\workspace\Lucene-Solr-6.2-Windows\solr\build\solr-core\test\J0\temp\solr.cloud.TestRandomRequestDistribution_B18A4B197D227008-001\shard-1-001'
[junit4] 2> 782986 INFO (TEST-TestRandomRequestDistribution.test-seed#[B18A4B197D227008]) [ ] o.a.s.c.SolrResourceLoader JNDI not configured for solr (NoInitialContextEx)
[junit4] 2> 782986 INFO (TEST-TestRandomRequestDistribution.test-seed#[B18A4B197D227008]) [ ] o.a.s.c.SolrResourceLoader solr home defaulted to 'solr/' (could not find system property or JNDI)
[junit4] 2> 782986 INFO (TEST-TestRandomRequestDistribution.test-seed#[B18A4B197D227008]) [ ] o.a.s.c.c.SolrZkClient Using default ZkCredentialsProvider
[junit4] 2> 782988 INFO (TEST-TestRandomRequestDistribution.test-seed#[B18A4B197D227008]) [ ] o.a.s.c.c.ConnectionManager Waiting for client to connect to ZooKeeper
[junit4] 2> 782990 INFO (zkCallback-889-thread-1) [ ] o.a.s.c.c.ConnectionManager Watcher org.apache.solr.common.cloud.ConnectionManager@25f7db09 name:ZooKeeperConnection Watcher:127.0.0.1:54208/solr got event WatchedEvent state:SyncConnected type:None path:null path:null type:None
[junit4] 2> 782990 INFO (TEST-TestRandomRequestDistribution.test-seed#[B18A4B197D227008]) [ ] o.a.s.c.c.ConnectionManager Client is connected to ZooKeeper
[junit4] 2> 782991 INFO (TEST-TestRandomRequestDistribution.test-seed#[B18A4B197D227008]) [ ] o.a.s.c.c.SolrZkClient Using default ZkACLProvider
[junit4] 2> 782991 WARN (NIOServerCxn.Factory:0.0.0.0/0.0.0.0:0) [ ] o.a.z.s.NIOServerCnxn caught end of stream exception
[junit4] 2> EndOfStreamException: Unable to read additional data from client sessionid 0x1573ca33df80007, likely client has closed socket
[junit4] 2> at org.apache.zookeeper.server.NIOServerCnxn.doIO(NIOServerCnxn.java:228)
[junit4] 2> at org.apache.zookeeper.server.NIOServerCnxnFactory.run(NIOServerCnxnFactory.java:208)
[junit4] 2> at java.lang.Thread.run(Thread.java:745)
[junit4] 2> 782991 INFO (TEST-TestRandomRequestDistribution.test-seed#[B18A4B197D227008]) [ ] o.a.s.s.SolrDispatchFilter Loading solr.xml from SolrHome (not found in ZooKeeper)
[junit4] 2> 782991 INFO (TEST-TestRandomRequestDistribution.test-seed#[B18A4B197D227008]) [ ] o.a.s.c.SolrXmlConfig Loading container configuration from C:\Users\jenkins\workspace\Lucene-Solr-6.2-Windows\solr\build\solr-core\test\J0\temp\solr.cloud.TestRandomRequestDistribution_B18A4B197D227008-001\shard-1-001\solr.xml
[junit4] 2> 783007 INFO (TEST-TestRandomRequestDistribution.test-seed#[B18A4B197D227008]) [ ] o.a.s.c.CorePropertiesLocator Config-defined core root directory: C:\Users\jenkins\workspace\Lucene-Solr-6.2-Windows\solr\build\solr-core\test\J0\temp\solr.cloud.TestRandomRequestDistribution_B18A4B197D227008-001\shard-1-001\cores
[junit4] 2> 783007 INFO (TEST-TestRandomRequestDistribution.test-seed#[B18A4B197D227008]) [ ] o.a.s.c.CoreContainer New CoreContainer 2140414712
[junit4] 2> 783007 INFO (TEST-TestRandomRequestDistribution.test-seed#[B18A4B197D227008]) [ ] o.a.s.c.CoreContainer Loading cores into CoreContainer [instanceDir=C:\Users\jenkins\workspace\Lucene-Solr-6.2-Windows\solr\build\solr-core\test\J0\temp\solr.cloud.TestRandomRequestDistribution_B18A4B197D227008-001\shard-1-001]
[junit4] 2> 783007 WARN (TEST-TestRandomRequestDistribution.test-seed#[B18A4B197D227008]) [ ] o.a.s.c.CoreContainer Couldn't add files from C:\Users\jenkins\workspace\Lucene-Solr-6.2-Windows\solr\build\solr-core\test\J0\temp\solr.cloud.TestRandomRequestDistribution_B18A4B197D227008-001\shard-1-001\lib to classpath: C:\Users\jenkins\workspace\Lucene-Solr-6.2-Windows\solr\build\solr-core\test\J0\temp\solr.cloud.TestRandomRequestDistribution_B18A4B197D227008-001\shard-1-001\lib
[junit4] 2> 783008 INFO (TEST-TestRandomRequestDistribution.test-seed#[B18A4B197D227008]) [ ] o.a.s.h.c.HttpShardHandlerFactory created with socketTimeout : 90000,urlScheme : ,connTimeout : 15000,maxConnectionsPerHost : 20,maxConnections : 10000,corePoolSize : 0,maximumPoolSize : 2147483647,maxThreadIdleTime : 5,sizeOfQueue : -1,fairnessPolicy : false,useRetries : false,connectionsEvictorSleepDelay : 5000,maxConnectionIdleTime : 40000,
[junit4] 2> 783011 INFO (TEST-TestRandomRequestDistribution.test-seed#[B18A4B197D227008]) [ ] o.a.s.u.UpdateShardHandler Creating UpdateShardHandler HTTP client with params: socketTimeout=340000&connTimeout=45000&retry=true
[junit4] 2> 783013 INFO (TEST-TestRandomRequestDistribution.test-seed#[B18A4B197D227008]) [ ] o.a.s.l.LogWatcher SLF4J impl is org.slf4j.impl.Log4jLoggerFactory
[junit4] 2> 783013 INFO (TEST-TestRandomRequestDistribution.test-seed#[B18A4B197D227008]) [ ] o.a.s.l.LogWatcher Registering Log Listener [Log4j (org.slf4j.impl.Log4jLoggerFactory)]
[junit4] 2> 783013 INFO (TEST-TestRandomRequestDistribution.test-seed#[B18A4B197D227008]) [ ] o.a.s.c.ZkContainer Zookeeper client=127.0.0.1:54208/solr
[junit4] 2> 783013 INFO (TEST-TestRandomRequestDistribution.test-seed#[B18A4B197D227008]) [ ] o.a.s.c.ZkController zkHost includes chroot
[junit4] 2> 783013 INFO (TEST-TestRandomRequestDistribution.test-seed#[B18A4B197D227008]) [ ] o.a.s.c.c.SolrZkClient Using default ZkCredentialsProvider
[junit4] 2> 783014 INFO (TEST-TestRandomRequestDistribution.test-seed#[B18A4B197D227008]) [ ] o.a.s.c.c.ConnectionManager Waiting for client to connect to ZooKeeper
[junit4] 2> 783016 INFO (zkCallback-892-thread-1) [ ] o.a.s.c.c.ConnectionManager Watcher org.apache.solr.common.cloud.ConnectionManager@1eff6e6d name:ZooKeeperConnection Watcher:127.0.0.1:54208 got event WatchedEvent state:SyncConnected type:None path:null path:null type:None
[junit4] 2> 783016 INFO (TEST-TestRandomRequestDistribution.test-seed#[B18A4B197D227008]) [ ] o.a.s.c.c.ConnectionManager Client is connected to ZooKeeper
[junit4] 2> 783017 INFO (TEST-TestRandomRequestDistribution.test-seed#[B18A4B197D227008]) [ ] o.a.s.c.c.SolrZkClient Using default ZkACLProvider
[junit4] 2> 783018 INFO (TEST-TestRandomRequestDistribution.test-seed#[B18A4B197D227008]) [n:127.0.0.1:54235_ ] o.a.s.c.ZkController Added new OnReconnect listener org.apache.solr.cloud.ZkController$$Lambda$10/807492660@2b3d66e9
[junit4] 2> 783020 INFO (TEST-TestRandomRequestDistribution.test-seed#[B18A4B197D227008]) [n:127.0.0.1:54235_ ] o.a.s.c.c.ConnectionManager Waiting for client to connect to ZooKeeper
[junit4] 2> 783042 INFO (zkCallback-893-thread-1-processing-n:127.0.0.1:54235_) [n:127.0.0.1:54235_ ] o.a.s.c.c.ConnectionManager Watcher org.apache.solr.common.cloud.ConnectionManager@632aa820 name:ZooKeeperConnection Watcher:127.0.0.1:54208/solr got event WatchedEvent state:SyncConnected type:None path:null path:null type:None
[junit4] 2> 783042 INFO (TEST-TestRandomRequestDistribution.test-seed#[B18A4B197D227008]) [n:127.0.0.1:54235_ ] o.a.s.c.c.ConnectionManager Client is connected to ZooKeeper
[junit4] 2> 783050 INFO (TEST-TestRandomRequestDistribution.test-seed#[B18A4B197D227008]) [n:127.0.0.1:54235_ ] o.a.s.c.c.ZkStateReader Updating cluster state from ZooKeeper...
[junit4] 2> 783050 INFO (TEST-TestRandomRequestDistribution.test-seed#[B18A4B197D227008]) [n:127.0.0.1:54235_ ] o.a.s.c.c.ZkStateReader Loaded empty cluster properties
[junit4] 2> 783051 INFO (TEST-TestRandomRequestDistribution.test-seed#[B18A4B197D227008]) [n:127.0.0.1:54235_ ] o.a.s.c.c.ZkStateReader Updated live nodes from ZooKeeper... (0) -> (1)
[junit4] 2> 783054 INFO (TEST-TestRandomRequestDistribution.test-seed#[B18A4B197D227008]) [n:127.0.0.1:54235_ ] o.a.s.c.Overseer Overseer (id=null) closing
[junit4] 2> 783056 INFO (TEST-TestRandomRequestDistribution.test-seed#[B18A4B197D227008]) [n:127.0.0.1:54235_ ] o.a.s.c.LeaderElector Joined leadership election with path: /overseer_elect/election/96612588828753929-127.0.0.1:54235_-n_0000000001
[junit4] 2> 783057 INFO (TEST-TestRandomRequestDistribution.test-seed#[B18A4B197D227008]) [n:127.0.0.1:54235_ ] o.a.s.c.LeaderElector Watching path /overseer_elect/election/96612588828753924-127.0.0.1:54217_-n_0000000000 to know if I could be the leader
[junit4] 2> 783057 INFO (TEST-TestRandomRequestDistribution.test-seed#[B18A4B197D227008]) [n:127.0.0.1:54235_ ] o.a.s.c.ZkController Publish node=127.0.0.1:54235_ as DOWN
[junit4] 2> 783059 INFO (TEST-TestRandomRequestDistribution.test-seed#[B18A4B197D227008]) [n:127.0.0.1:54235_ ] o.a.s.c.ZkController Register node as live in ZooKeeper:/live_nodes/127.0.0.1:54235_
[junit4] 2> 783059 INFO (TEST-TestRandomRequestDistribution.test-seed#[B18A4B197D227008]) [n:127.0.0.1:54235_ ] o.a.s.c.c.SolrZkClient makePath: /live_nodes/127.0.0.1:54235_
[junit4] 2> 783060 INFO (OverseerStateUpdate-96612588828753924-127.0.0.1:54217_-n_0000000000) [n:127.0.0.1:54217_ ] o.a.s.c.Overseer processMessage: queueSize: 1, message = {
[junit4] 2> "operation":"downnode",
[junit4] 2> "node_name":"127.0.0.1:54235_"} current state version: 3
[junit4] 2> 783061 INFO (OverseerStateUpdate-96612588828753924-127.0.0.1:54217_-n_0000000000) [n:127.0.0.1:54217_ ] o.a.s.c.o.NodeMutator DownNode state invoked for node: 127.0.0.1:54235_
[junit4] 2> 783063 INFO (zkCallback-883-thread-3-processing-n:127.0.0.1:54217_) [n:127.0.0.1:54217_ ] o.a.s.c.c.ZkStateReader A live node change: [WatchedEvent state:SyncConnected type:NodeChildrenChanged path:/live_nodes], has occurred - updating... (live nodes size: [1])
[junit4] 2> 783064 INFO (zkCallback-887-thread-1) [ ] o.a.s.c.c.ZkStateReader A live node change: [WatchedEvent state:SyncConnected type:NodeChildrenChanged path:/live_nodes], has occurred - updating... (live nodes size: [1])
[junit4] 2> 783065 INFO (zkCallback-893-thread-1-processing-n:127.0.0.1:54235_) [n:127.0.0.1:54235_ ] o.a.s.c.c.ZkStateReader A live node change: [WatchedEvent state:SyncConnected type:NodeChildrenChanged path:/live_nodes], has occurred - updating... (live nodes size: [1])
[junit4] 2> 783080 INFO (TEST-TestRandomRequestDistribution.test-seed#[B18A4B197D227008]) [n:127.0.0.1:54235_ ] o.a.s.c.CoreContainer Security conf doesn't exist. Skipping setup for authorization module.
[junit4] 2> 783080 INFO (TEST-TestRandomRequestDistribution.test-seed#[B18A4B197D227008]) [n:127.0.0.1:54235_ ] o.a.s.c.CoreContainer No authentication plugin used.
[junit4] 2> 783081 INFO (TEST-TestRandomRequestDistribution.test-seed#[B18A4B197D227008]) [n:127.0.0.1:54235_ ] o.a.s.c.CorePropertiesLocator Looking for core definitions underneath C:\Users\jenkins\workspace\Lucene-Solr-6.2-Windows\solr\build\solr-core\test\J0\temp\solr.cloud.TestRandomRequestDistribution_B18A4B197D227008-001\shard-1-001\cores
[junit4] 2> 783082 INFO (TEST-TestRandomRequestDistribution.test-seed#[B18A4B197D227008]) [n:127.0.0.1:54235_ ] o.a.s.c.CoreDescriptor Created CoreDescriptor: {name=collection1, config=solrconfig.xml, transient=false, schema=schema.xml, loadOnStartup=true, configSetProperties=configsetprops.json, collection=collection1, coreNodeName=, dataDir=data\, shard=}
[junit4] 2> 783083 INFO (TEST-TestRandomRequestDistribution.test-seed#[B18A4B197D227008]) [n:127.0.0.1:54235_ ] o.a.s.c.CorePropertiesLocator Found core collection1 in C:\Users\jenkins\workspace\Lucene-Solr-6.2-Windows\solr\build\solr-core\test\J0\temp\solr.cloud.TestRandomRequestDistribution_B18A4B197D227008-001\shard-1-001\cores\collection1
[junit4] 2> 783083 INFO (TEST-TestRandomRequestDistribution.test-seed#[B18A4B197D227008]) [n:127.0.0.1:54235_ ] o.a.s.c.CorePropertiesLocator Found 1 core definitions
[junit4] 2> 783084 INFO (zkCallback-883-thread-3-processing-n:127.0.0.1:54217_) [n:127.0.0.1:54217_ ] o.a.s.c.c.ZkStateReader Updated live nodes from ZooKeeper... (1) -> (2)
[junit4] 2> 783084 INFO (zkCallback-887-thread-1) [ ] o.a.s.c.c.ZkStateReader Updated live nodes from ZooKeeper... (1) -> (2)
[junit4] 2> 783089 INFO (zkCallback-893-thread-1-processing-n:127.0.0.1:54235_) [n:127.0.0.1:54235_ ] o.a.s.c.c.ZkStateReader Updated live nodes from ZooKeeper... (1) -> (2)
[junit4] 2> 783092 INFO (TEST-TestRandomRequestDistribution.test-seed#[B18A4B197D227008]) [n:127.0.0.1:54235_ ] o.a.s.s.SolrDispatchFilter user.dir=C:\Users\jenkins\workspace\Lucene-Solr-6.2-Windows\solr\build\solr-core\test\J0
[junit4] 2> 783092 INFO (TEST-TestRandomRequestDistribution.test-seed#[B18A4B197D227008]) [n:127.0.0.1:54235_ ] o.a.s.s.SolrDispatchFilter SolrDispatchFilter.init() done
[junit4] 2> 783092 INFO (zkCallback-883-thread-3-processing-n:127.0.0.1:54217_) [n:127.0.0.1:54217_ ] o.a.s.c.c.ZkStateReader A cluster state change: [WatchedEvent state:SyncConnected type:NodeDataChanged path:/clusterstate.json], has occurred - updating... (live nodes size: [2])
[junit4] 2> 783094 INFO (zkCallback-887-thread-1) [ ] o.a.s.c.c.ZkStateReader A cluster state change: [WatchedEvent state:SyncConnected type:NodeDataChanged path:/clusterstate.json], has occurred - updating... (live nodes size: [2])
[junit4] 2> 783094 INFO (zkCallback-893-thread-1-processing-n:127.0.0.1:54235_) [n:127.0.0.1:54235_ ] o.a.s.c.c.ZkStateReader A cluster state change: [WatchedEvent state:SyncConnected type:NodeDataChanged path:/clusterstate.json], has occurred - updating... (live nodes size: [2])
[junit4] 2> 783095 INFO (coreLoadExecutor-2440-thread-1-processing-n:127.0.0.1:54235_) [n:127.0.0.1:54235_ c:collection1 x:collection1] o.a.s.c.ZkController publishing state=down
[junit4] 2> 783096 INFO (coreLoadExecutor-2440-thread-1-processing-n:127.0.0.1:54235_) [n:127.0.0.1:54235_ c:collection1 x:collection1] o.a.s.c.ZkController numShards not found on descriptor - reading it from system property
[junit4] 2> 783098 INFO (coreLoadExecutor-2440-thread-1-processing-n:127.0.0.1:54235_) [n:127.0.0.1:54235_ c:collection1 x:collection1] o.a.s.c.ZkController Registering watch for collection collection1
[junit4] 2> 783099 INFO (coreLoadExecutor-2440-thread-1-processing-n:127.0.0.1:54235_) [n:127.0.0.1:54235_ c:collection1 x:collection1] o.a.s.c.c.ZkStateReader Add data for [collection1] ver [0]
[junit4] 2> 783099 INFO (coreLoadExecutor-2440-thread-1-processing-n:127.0.0.1:54235_) [n:127.0.0.1:54235_ c:collection1 x:collection1] o.a.s.c.ZkController look for our core node name
[junit4] 2> 783100 INFO (OverseerStateUpdate-96612588828753924-127.0.0.1:54217_-n_0000000000) [n:127.0.0.1:54217_ ] o.a.s.c.Overseer processMessage: queueSize: 1, message = {
[junit4] 2> "core":"collection1",
[junit4] 2> "roles":null,
[junit4] 2> "base_url":"http://127.0.0.1:54235",
[junit4] 2> "node_name":"127.0.0.1:54235_",
[junit4] 2> "numShards":"2",
[junit4] 2> "state":"down",
[junit4] 2> "shard":null,
[junit4] 2> "collection":"collection1",
[junit4] 2> "operation":"state"} current state version: 4
[junit4] 2> 783101 INFO (OverseerStateUpdate-96612588828753924-127.0.0.1:54217_-n_0000000000) [n:127.0.0.1:54217_ ] o.a.s.c.o.ReplicaMutator Update state numShards=2 message={
[junit4] 2> "core":"collection1",
[junit4] 2> "roles":null,
[junit4] 2> "base_url":"http://127.0.0.1:54235",
[junit4] 2> "node_name":"127.0.0.1:54235_",
[junit4] 2> "numShards":"2",
[junit4] 2> "state":"down",
[junit4] 2> "shard":null,
[junit4] 2> "collection":"collection1",
[junit4] 2> "operation":"state"}
[junit4] 2> 783101 INFO (OverseerStateUpdate-96612588828753924-127.0.0.1:54217_-n_0000000000) [n:127.0.0.1:54217_ ] o.a.s.c.o.ReplicaMutator Collection already exists with numShards=2
[junit4] 2> 783101 INFO (OverseerStateUpdate-96612588828753924-127.0.0.1:54217_-n_0000000000) [n:127.0.0.1:54217_ ] o.a.s.c.o.ReplicaMutator Assigning new node to shard shard=shard2
[junit4] 2> 783206 INFO (OverseerStateUpdate-96612588828753924-127.0.0.1:54217_-n_0000000000) [n:127.0.0.1:54217_ ] o.a.s.c.o.ZkStateWriter going to update_collection /collections/collection1/state.json version: 0
[junit4] 2> 783206 INFO (zkCallback-893-thread-1
[...truncated too long message...]
rs-admin-2.0.0-M15.jar;C:\Users\jenkins\workspace\Lucene-Solr-6.2-Windows\solr\core\test-lib\apacheds-interceptors-authn-2.0.0-M15.jar;C:\Users\jenkins\workspace\Lucene-Solr-6.2-Windows\solr\core\test-lib\apacheds-interceptors-authz-2.0.0-M15.jar;C:\Users\jenkins\workspace\Lucene-Solr-6.2-Windows\solr\core\test-lib\apacheds-interceptors-changelog-2.0.0-M15.jar;C:\Users\jenkins\workspace\Lucene-Solr-6.2-Windows\solr\core\test-lib\apacheds-interceptors-collective-2.0.0-M15.jar;C:\Users\jenkins\workspace\Lucene-Solr-6.2-Windows\solr\core\test-lib\apacheds-interceptors-event-2.0.0-M15.jar;C:\Users\jenkins\workspace\Lucene-Solr-6.2-Windows\solr\core\test-lib\apacheds-interceptors-exception-2.0.0-M15.jar;C:\Users\jenkins\workspace\Lucene-Solr-6.2-Windows\solr\core\test-lib\apacheds-interceptors-journal-2.0.0-M15.jar;C:\Users\jenkins\workspace\Lucene-Solr-6.2-Windows\solr\core\test-lib\apacheds-interceptors-normalization-2.0.0-M15.jar;C:\Users\jenkins\workspace\Lucene-Solr-6.2-Windows\solr\core\test-lib\apacheds-interceptors-operational-2.0.0-M15.jar;C:\Users\jenkins\workspace\Lucene-Solr-6.2-Windows\solr\core\test-lib\apacheds-interceptors-referral-2.0.0-M15.jar;C:\Users\jenkins\workspace\Lucene-Solr-6.2-Windows\solr\core\test-lib\apacheds-interceptors-schema-2.0.0-M15.jar;C:\Users\jenkins\workspace\Lucene-Solr-6.2-Windows\solr\core\test-lib\apacheds-interceptors-subtree-2.0.0-M15.jar;C:\Users\jenkins\workspace\Lucene-Solr-6.2-Windows\solr\core\test-lib\apacheds-interceptors-trigger-2.0.0-M15.jar;C:\Users\jenkins\workspace\Lucene-Solr-6.2-Windows\solr\core\test-lib\apacheds-jdbm-partition-2.0.0-M15.jar;C:\Users\jenkins\workspace\Lucene-Solr-6.2-Windows\solr\core\test-lib\apacheds-jdbm1-2.0.0-M2.jar;C:\Users\jenkins\workspace\Lucene-Solr-6.2-Windows\solr\core\test-lib\apacheds-kerberos-codec-2.0.0-M15.jar;C:\Users\jenkins\workspace\Lucene-Solr-6.2-Windows\solr\core\test-lib\apacheds-ldif-partition-2.0.0-M15.jar;C:\Users\jenkins\workspace\Lucene-Solr-6.2-Windows\solr\core\test-lib\apacheds-mavibot-partition-2.0.0-M15.jar;C:\Users\jenkins\workspace\Lucene-Solr-6.2-Windows\solr\core\test-lib\apacheds-protocol-kerberos-2.0.0-M15.jar;C:\Users\jenkins\workspace\Lucene-Solr-6.2-Windows\solr\core\test-lib\apacheds-protocol-ldap-2.0.0-M15.jar;C:\Users\jenkins\workspace\Lucene-Solr-6.2-Windows\solr\core\test-lib\apacheds-protocol-shared-2.0.0-M15.jar;C:\Users\jenkins\workspace\Lucene-Solr-6.2-Windows\solr\core\test-lib\apacheds-xdbm-partition-2.0.0-M15.jar;C:\Users\jenkins\workspace\Lucene-Solr-6.2-Windows\solr\core\test-lib\api-all-1.0.0-M20.jar;C:\Users\jenkins\workspace\Lucene-Solr-6.2-Windows\solr\core\test-lib\bcprov-jdk15-1.45.jar;C:\Users\jenkins\workspace\Lucene-Solr-6.2-Windows\solr\core\test-lib\cglib-nodep-2.2.jar;C:\Users\jenkins\workspace\Lucene-Solr-6.2-Windows\solr\core\test-lib\commons-collections-3.2.2.jar;C:\Users\jenkins\workspace\Lucene-Solr-6.2-Windows\solr\core\test-lib\commons-math3-3.4.1.jar;C:\Users\jenkins\workspace\Lucene-Solr-6.2-Windows\solr\core\test-lib\easymock-3.0.jar;C:\Users\jenkins\workspace\Lucene-Solr-6.2-Windows\solr\core\test-lib\ehcache-core-2.4.4.jar;C:\Users\jenkins\workspace\Lucene-Solr-6.2-Windows\solr\core\test-lib\hadoop-common-2.7.2-tests.jar;C:\Users\jenkins\workspace\Lucene-Solr-6.2-Windows\solr\core\test-lib\hadoop-hdfs-2.7.2-tests.jar;C:\Users\jenkins\workspace\Lucene-Solr-6.2-Windows\solr\core\test-lib\hadoop-minikdc-2.7.2.jar;C:\Users\jenkins\workspace\Lucene-Solr-6.2-Windows\solr\core\test-lib\htrace-core-3.2.0-incubating.jar;C:\Users\jenkins\workspace\Lucene-Solr-6.2-Windows\solr\core\test-lib\jackson-annotations-2.5.4.jar;C:\Users\jenkins\workspace\Lucene-Solr-6.2-Windows\solr\core\test-lib\jackson-core-asl-1.9.13.jar;C:\Users\jenkins\workspace\Lucene-Solr-6.2-Windows\solr\core\test-lib\jackson-databind-2.5.4.jar;C:\Users\jenkins\workspace\Lucene-Solr-6.2-Windows\solr\core\test-lib\jackson-mapper-asl-1.9.13.jar;C:\Users\jenkins\workspace\Lucene-Solr-6.2-Windows\solr\core\test-lib\jersey-core-1.9.jar;C:\Users\jenkins\workspace\Lucene-Solr-6.2-Windows\solr\core\test-lib\jersey-server-1.9.jar;C:\Users\jenkins\workspace\Lucene-Solr-6.2-Windows\solr\core\test-lib\jetty-6.1.26.jar;C:\Users\jenkins\workspace\Lucene-Solr-6.2-Windows\solr\core\test-lib\jetty-util-6.1.26.jar;C:\Users\jenkins\workspace\Lucene-Solr-6.2-Windows\solr\core\test-lib\mina-core-2.0.0-M5.jar;C:\Users\jenkins\workspace\Lucene-Solr-6.2-Windows\solr\core\test-lib\mockito-core-1.9.5.jar;C:\Users\jenkins\workspace\Lucene-Solr-6.2-Windows\solr\core\test-lib\netty-all-4.0.36.Final.jar;C:\Users\jenkins\workspace\Lucene-Solr-6.2-Windows\solr\core\test-lib\objenesis-1.2.jar;C:\Users\jenkins\workspace\Lucene-Solr-6.2-Windows\solr\core\test-lib\presto-parser-0.122.jar;C:\Users\jenkins\workspace\Lucene-Solr-6.2-Windows\solr\core\test-lib\slice-0.10.jar;C:\Users\jenkins\workspace\Lucene-Solr-6.2-Windows\lucene\build\analysis\icu\lucene-analyzers-icu-6.2.1-SNAPSHOT.jar;C:\Users\jenkins\workspace\Lucene-Solr-6.2-Windows\solr\build\contrib\solr-analysis-extras\classes\java;C:\Users\jenkins\workspace\Lucene-Solr-6.2-Windows\lucene\build\queryparser\classes\test;C:\Users\jenkins\workspace\Lucene-Solr-6.2-Windows\solr\contrib\analysis-extras\lib\icu4j-56.1.jar;C:\Users\jenkins\tools\hudson.tasks.Ant_AntInstallation\ANT_1.8.2\lib\ant-launcher.jar;C:\Users\jenkins\.ant\lib\ivy-2.3.0.jar;C:\Users\jenkins\tools\hudson.tasks.Ant_AntInstallation\ANT_1.8.2\lib\ant-antlr.jar;C:\Users\jenkins\tools\hudson.tasks.Ant_AntInstallation\ANT_1.8.2\lib\ant-apache-bcel.jar;C:\Users\jenkins\tools\hudson.tasks.Ant_AntInstallation\ANT_1.8.2\lib\ant-apache-bsf.jar;C:\Users\jenkins\tools\hudson.tasks.Ant_AntInstallation\ANT_1.8.2\lib\ant-apache-log4j.jar;C:\Users\jenkins\tools\hudson.tasks.Ant_AntInstallation\ANT_1.8.2\lib\ant-apache-oro.jar;C:\Users\jenkins\tools\hudson.tasks.Ant_AntInstallation\ANT_1.8.2\lib\ant-apache-regexp.jar;C:\Users\jenkins\tools\hudson.tasks.Ant_AntInstallation\ANT_1.8.2\lib\ant-apache-resolver.jar;C:\Users\jenkins\tools\hudson.tasks.Ant_AntInstallation\ANT_1.8.2\lib\ant-apache-xalan2.jar;C:\Users\jenkins\tools\hudson.tasks.Ant_AntInstallation\ANT_1.8.2\lib\ant-commons-logging.jar;C:\Users\jenkins\tools\hudson.tasks.Ant_AntInstallation\ANT_1.8.2\lib\ant-commons-net.jar;C:\Users\jenkins\tools\hudson.tasks.Ant_AntInstallation\ANT_1.8.2\lib\ant-jai.jar;C:\Users\jenkins\tools\hudson.tasks.Ant_AntInstallation\ANT_1.8.2\lib\ant-javamail.jar;C:\Users\jenkins\tools\hudson.tasks.Ant_AntInstallation\ANT_1.8.2\lib\ant-jdepend.jar;C:\Users\jenkins\tools\hudson.tasks.Ant_AntInstallation\ANT_1.8.2\lib\ant-jmf.jar;C:\Users\jenkins\tools\hudson.tasks.Ant_AntInstallation\ANT_1.8.2\lib\ant-jsch.jar;C:\Users\jenkins\tools\hudson.tasks.Ant_AntInstallation\ANT_1.8.2\lib\ant-junit.jar;C:\Users\jenkins\tools\hudson.tasks.Ant_AntInstallation\ANT_1.8.2\lib\ant-junit4.jar;C:\Users\jenkins\tools\hudson.tasks.Ant_AntInstallation\ANT_1.8.2\lib\ant-netrexx.jar;C:\Users\jenkins\tools\hudson.tasks.Ant_AntInstallation\ANT_1.8.2\lib\ant-swing.jar;C:\Users\jenkins\tools\hudson.tasks.Ant_AntInstallation\ANT_1.8.2\lib\ant-testutil.jar;C:\Users\jenkins\tools\hudson.tasks.Ant_AntInstallation\ANT_1.8.2\lib\ant.jar;C:\Users\jenkins\tools\java\64bit\jdk1.8.0_102\lib\tools.jar;C:\Users\jenkins\.ivy2\cache\com.carrotsearch.randomizedtesting\junit4-ant\jars\junit4-ant-2.3.4.jar com.carrotsearch.ant.tasks.junit4.slave.SlaveMainSafe -eventsfile C:\Users\jenkins\workspace\Lucene-Solr-6.2-Windows\solr\build\solr-core\test\temp\junit4-J0-20160918_091847_622.events @C:\Users\jenkins\workspace\Lucene-Solr-6.2-Windows\solr\build\solr-core\test\temp\junit4-J0-20160918_091847_622.suites -stdin
[junit4] ERROR: JVM J0 ended with an exception: Forked process returned with error code: 1. Very likely a JVM crash. See process stdout at: C:\Users\jenkins\workspace\Lucene-Solr-6.2-Windows\solr\build\solr-core\test\temp\junit4-J0-20160918_091847_622.sysout
[junit4] at com.carrotsearch.ant.tasks.junit4.JUnit4.executeSlave(JUnit4.java:1481)
[junit4] at com.carrotsearch.ant.tasks.junit4.JUnit4.access$000(JUnit4.java:121)
[junit4] at com.carrotsearch.ant.tasks.junit4.JUnit4$2.call(JUnit4.java:955)
[junit4] at com.carrotsearch.ant.tasks.junit4.JUnit4$2.call(JUnit4.java:952)
[junit4] at java.util.concurrent.FutureTask.run(FutureTask.java:266)
[junit4] at java.util.concurrent.ThreadPoolExecutor.runWorker(ThreadPoolExecutor.java:1142)
[junit4] at java.util.concurrent.ThreadPoolExecutor$Worker.run(ThreadPoolExecutor.java:617)
[junit4] at java.lang.Thread.run(Thread.java:745)
BUILD FAILED
C:\Users\jenkins\workspace\Lucene-Solr-6.2-Windows\build.xml:763: The following error occurred while executing this line:
C:\Users\jenkins\workspace\Lucene-Solr-6.2-Windows\build.xml:707: The following error occurred while executing this line:
C:\Users\jenkins\workspace\Lucene-Solr-6.2-Windows\build.xml:59: The following error occurred while executing this line:
C:\Users\jenkins\workspace\Lucene-Solr-6.2-Windows\solr\build.xml:233: The following error occurred while executing this line:
C:\Users\jenkins\workspace\Lucene-Solr-6.2-Windows\solr\common-build.xml:536: The following error occurred while executing this line:
C:\Users\jenkins\workspace\Lucene-Solr-6.2-Windows\lucene\common-build.xml:1443: The following error occurred while executing this line:
C:\Users\jenkins\workspace\Lucene-Solr-6.2-Windows\lucene\common-build.xml:984: At least one slave process threw an exception, first: Forked process returned with error code: 1. Very likely a JVM crash. See process stdout at: C:\Users\jenkins\workspace\Lucene-Solr-6.2-Windows\solr\build\solr-core\test\temp\junit4-J0-20160918_091847_622.sysout
Total time: 96 minutes 0 seconds
Build step 'Invoke Ant' marked build as failure
Archiving artifacts
[WARNINGS] Skipping publisher since build result is FAILURE
Recording test results
Email was triggered for: Failure - Any
Sending email for trigger: Failure - Any
[JENKINS] Lucene-Solr-6.2-Windows (64bit/jdk1.8.0_102) - Build # 11
- Still unstable!
Posted by Policeman Jenkins Server <je...@thetaphi.de>.
Build: http://jenkins.thetaphi.de/job/Lucene-Solr-6.2-Windows/11/
Java: 64bit/jdk1.8.0_102 -XX:+UseCompressedOops -XX:+UseConcMarkSweepGC
1 tests failed.
FAILED: junit.framework.TestSuite.org.apache.solr.schema.TestManagedSchemaAPI
Error Message:
ObjectTracker found 10 object(s) that were not released!!! [TransactionLog, MockDirectoryWrapper, MDCAwareThreadPoolExecutor, MockDirectoryWrapper, MockDirectoryWrapper, MDCAwareThreadPoolExecutor, MockDirectoryWrapper, MockDirectoryWrapper, MockDirectoryWrapper, TransactionLog]
Stack Trace:
java.lang.AssertionError: ObjectTracker found 10 object(s) that were not released!!! [TransactionLog, MockDirectoryWrapper, MDCAwareThreadPoolExecutor, MockDirectoryWrapper, MockDirectoryWrapper, MDCAwareThreadPoolExecutor, MockDirectoryWrapper, MockDirectoryWrapper, MockDirectoryWrapper, TransactionLog]
at __randomizedtesting.SeedInfo.seed([48109BEB7F21738A]:0)
at org.junit.Assert.fail(Assert.java:93)
at org.junit.Assert.assertTrue(Assert.java:43)
at org.junit.Assert.assertNull(Assert.java:551)
at org.apache.solr.SolrTestCaseJ4.teardownTestCases(SolrTestCaseJ4.java:258)
at sun.reflect.GeneratedMethodAccessor24.invoke(Unknown Source)
at sun.reflect.DelegatingMethodAccessorImpl.invoke(DelegatingMethodAccessorImpl.java:43)
at java.lang.reflect.Method.invoke(Method.java:498)
at com.carrotsearch.randomizedtesting.RandomizedRunner.invoke(RandomizedRunner.java:1764)
at com.carrotsearch.randomizedtesting.RandomizedRunner$7.evaluate(RandomizedRunner.java:834)
at com.carrotsearch.randomizedtesting.rules.StatementAdapter.evaluate(StatementAdapter.java:36)
at com.carrotsearch.randomizedtesting.rules.SystemPropertiesRestoreRule$1.evaluate(SystemPropertiesRestoreRule.java:57)
at org.apache.lucene.util.AbstractBeforeAfterRule$1.evaluate(AbstractBeforeAfterRule.java:45)
at com.carrotsearch.randomizedtesting.rules.StatementAdapter.evaluate(StatementAdapter.java:36)
at org.apache.lucene.util.TestRuleStoreClassName$1.evaluate(TestRuleStoreClassName.java:41)
at com.carrotsearch.randomizedtesting.rules.NoShadowingOrOverridesOnMethodsRule$1.evaluate(NoShadowingOrOverridesOnMethodsRule.java:40)
at com.carrotsearch.randomizedtesting.rules.NoShadowingOrOverridesOnMethodsRule$1.evaluate(NoShadowingOrOverridesOnMethodsRule.java:40)
at com.carrotsearch.randomizedtesting.rules.StatementAdapter.evaluate(StatementAdapter.java:36)
at com.carrotsearch.randomizedtesting.rules.StatementAdapter.evaluate(StatementAdapter.java:36)
at com.carrotsearch.randomizedtesting.rules.StatementAdapter.evaluate(StatementAdapter.java:36)
at org.apache.lucene.util.TestRuleAssertionsRequired$1.evaluate(TestRuleAssertionsRequired.java:53)
at org.apache.lucene.util.TestRuleMarkFailure$1.evaluate(TestRuleMarkFailure.java:47)
at org.apache.lucene.util.TestRuleIgnoreAfterMaxFailures$1.evaluate(TestRuleIgnoreAfterMaxFailures.java:64)
at org.apache.lucene.util.TestRuleIgnoreTestSuites$1.evaluate(TestRuleIgnoreTestSuites.java:54)
at com.carrotsearch.randomizedtesting.rules.StatementAdapter.evaluate(StatementAdapter.java:36)
at com.carrotsearch.randomizedtesting.ThreadLeakControl$StatementRunner.run(ThreadLeakControl.java:367)
at java.lang.Thread.run(Thread.java:745)
Build Log:
[...truncated 11488 lines...]
[junit4] Suite: org.apache.solr.schema.TestManagedSchemaAPI
[junit4] 2> Creating dataDir: C:\Users\jenkins\workspace\Lucene-Solr-6.2-Windows\solr\build\solr-core\test\J1\temp\solr.schema.TestManagedSchemaAPI_48109BEB7F21738A-001\init-core-data-001
[junit4] 2> 1466466 INFO (SUITE-TestManagedSchemaAPI-seed#[48109BEB7F21738A]-worker) [ ] o.a.s.SolrTestCaseJ4 Randomized ssl (false) and clientAuth (false) via: @org.apache.solr.util.RandomizeSSL(reason=, value=NaN, ssl=NaN, clientAuth=NaN)
[junit4] 2> 1466468 INFO (SUITE-TestManagedSchemaAPI-seed#[48109BEB7F21738A]-worker) [ ] o.a.s.c.ZkTestServer STARTING ZK TEST SERVER
[junit4] 2> 1466468 INFO (Thread-2779) [ ] o.a.s.c.ZkTestServer client port:0.0.0.0/0.0.0.0:0
[junit4] 2> 1466468 INFO (Thread-2779) [ ] o.a.s.c.ZkTestServer Starting server
[junit4] 2> 1466568 INFO (SUITE-TestManagedSchemaAPI-seed#[48109BEB7F21738A]-worker) [ ] o.a.s.c.ZkTestServer start zk server on port:63403
[junit4] 2> 1466568 INFO (SUITE-TestManagedSchemaAPI-seed#[48109BEB7F21738A]-worker) [ ] o.a.s.c.c.SolrZkClient Using default ZkCredentialsProvider
[junit4] 2> 1466569 INFO (SUITE-TestManagedSchemaAPI-seed#[48109BEB7F21738A]-worker) [ ] o.a.s.c.c.ConnectionManager Waiting for client to connect to ZooKeeper
[junit4] 2> 1466576 INFO (zkCallback-1783-thread-1) [ ] o.a.s.c.c.ConnectionManager Watcher org.apache.solr.common.cloud.ConnectionManager@6de7d17a name:ZooKeeperConnection Watcher:127.0.0.1:63403 got event WatchedEvent state:SyncConnected type:None path:null path:null type:None
[junit4] 2> 1466576 INFO (SUITE-TestManagedSchemaAPI-seed#[48109BEB7F21738A]-worker) [ ] o.a.s.c.c.ConnectionManager Client is connected to ZooKeeper
[junit4] 2> 1466576 INFO (SUITE-TestManagedSchemaAPI-seed#[48109BEB7F21738A]-worker) [ ] o.a.s.c.c.SolrZkClient Using default ZkACLProvider
[junit4] 2> 1466576 INFO (SUITE-TestManagedSchemaAPI-seed#[48109BEB7F21738A]-worker) [ ] o.a.s.c.c.SolrZkClient makePath: /solr/solr.xml
[junit4] 2> 1466582 INFO (jetty-launcher-1782-thread-1) [ ] o.e.j.s.Server jetty-9.3.8.v20160314
[junit4] 2> 1466583 INFO (jetty-launcher-1782-thread-1) [ ] o.e.j.s.h.ContextHandler Started o.e.j.s.ServletContextHandler@2c8f332a{/solr,null,AVAILABLE}
[junit4] 2> 1466584 INFO (jetty-launcher-1782-thread-1) [ ] o.e.j.s.ServerConnector Started ServerConnector@af5eb19{HTTP/1.1,[http/1.1]}{127.0.0.1:63407}
[junit4] 2> 1466584 INFO (jetty-launcher-1782-thread-1) [ ] o.e.j.s.Server Started @1470663ms
[junit4] 2> 1466584 INFO (jetty-launcher-1782-thread-1) [ ] o.a.s.c.s.e.JettySolrRunner Jetty properties: {hostContext=/solr, hostPort=63407}
[junit4] 2> 1466584 INFO (jetty-launcher-1782-thread-1) [ ] o.a.s.s.SolrDispatchFilter SolrDispatchFilter.init(): sun.misc.Launcher$AppClassLoader@73d16e93
[junit4] 2> 1466584 INFO (jetty-launcher-1782-thread-1) [ ] o.a.s.c.SolrResourceLoader new SolrResourceLoader for directory: 'C:\Users\jenkins\workspace\Lucene-Solr-6.2-Windows\solr\build\solr-core\test\J1\temp\solr.schema.TestManagedSchemaAPI_48109BEB7F21738A-001\tempDir-001\node1'
[junit4] 2> 1466584 INFO (jetty-launcher-1782-thread-1) [ ] o.a.s.c.SolrResourceLoader JNDI not configured for solr (NoInitialContextEx)
[junit4] 2> 1466584 INFO (jetty-launcher-1782-thread-1) [ ] o.a.s.c.SolrResourceLoader solr home defaulted to 'solr/' (could not find system property or JNDI)
[junit4] 2> 1466585 INFO (jetty-launcher-1782-thread-2) [ ] o.e.j.s.Server jetty-9.3.8.v20160314
[junit4] 2> 1466586 INFO (jetty-launcher-1782-thread-1) [ ] o.a.s.c.c.SolrZkClient Using default ZkCredentialsProvider
[junit4] 2> 1466586 INFO (jetty-launcher-1782-thread-2) [ ] o.e.j.s.h.ContextHandler Started o.e.j.s.ServletContextHandler@3a9a452d{/solr,null,AVAILABLE}
[junit4] 2> 1466586 INFO (jetty-launcher-1782-thread-1) [ ] o.a.s.c.c.ConnectionManager Waiting for client to connect to ZooKeeper
[junit4] 2> 1466586 INFO (jetty-launcher-1782-thread-2) [ ] o.e.j.s.ServerConnector Started ServerConnector@1a70ab88{HTTP/1.1,[http/1.1]}{127.0.0.1:63411}
[junit4] 2> 1466587 INFO (jetty-launcher-1782-thread-2) [ ] o.e.j.s.Server Started @1470666ms
[junit4] 2> 1466587 INFO (jetty-launcher-1782-thread-2) [ ] o.a.s.c.s.e.JettySolrRunner Jetty properties: {hostContext=/solr, hostPort=63411}
[junit4] 2> 1466587 INFO (jetty-launcher-1782-thread-2) [ ] o.a.s.s.SolrDispatchFilter SolrDispatchFilter.init(): sun.misc.Launcher$AppClassLoader@73d16e93
[junit4] 2> 1466587 INFO (jetty-launcher-1782-thread-2) [ ] o.a.s.c.SolrResourceLoader new SolrResourceLoader for directory: 'C:\Users\jenkins\workspace\Lucene-Solr-6.2-Windows\solr\build\solr-core\test\J1\temp\solr.schema.TestManagedSchemaAPI_48109BEB7F21738A-001\tempDir-001\node2'
[junit4] 2> 1466587 INFO (jetty-launcher-1782-thread-2) [ ] o.a.s.c.SolrResourceLoader JNDI not configured for solr (NoInitialContextEx)
[junit4] 2> 1466587 INFO (jetty-launcher-1782-thread-2) [ ] o.a.s.c.SolrResourceLoader solr home defaulted to 'solr/' (could not find system property or JNDI)
[junit4] 2> 1466588 INFO (jetty-launcher-1782-thread-2) [ ] o.a.s.c.c.SolrZkClient Using default ZkCredentialsProvider
[junit4] 2> 1466589 INFO (jetty-launcher-1782-thread-2) [ ] o.a.s.c.c.ConnectionManager Waiting for client to connect to ZooKeeper
[junit4] 2> 1466600 INFO (zkCallback-1784-thread-1) [ ] o.a.s.c.c.ConnectionManager Watcher org.apache.solr.common.cloud.ConnectionManager@58d48f50 name:ZooKeeperConnection Watcher:127.0.0.1:63403/solr got event WatchedEvent state:SyncConnected type:None path:null path:null type:None
[junit4] 2> 1466600 INFO (jetty-launcher-1782-thread-1) [ ] o.a.s.c.c.ConnectionManager Client is connected to ZooKeeper
[junit4] 2> 1466600 INFO (jetty-launcher-1782-thread-1) [ ] o.a.s.c.c.SolrZkClient Using default ZkACLProvider
[junit4] 2> 1466601 INFO (jetty-launcher-1782-thread-1) [ ] o.a.s.s.SolrDispatchFilter solr.xml found in ZooKeeper. Loading...
[junit4] 2> 1466614 WARN (NIOServerCxn.Factory:0.0.0.0/0.0.0.0:0) [ ] o.a.z.s.NIOServerCnxn caught end of stream exception
[junit4] 2> EndOfStreamException: Unable to read additional data from client sessionid 0x15743180d500002, likely client has closed socket
[junit4] 2> at org.apache.zookeeper.server.NIOServerCnxn.doIO(NIOServerCnxn.java:228)
[junit4] 2> at org.apache.zookeeper.server.NIOServerCnxnFactory.run(NIOServerCnxnFactory.java:208)
[junit4] 2> at java.lang.Thread.run(Thread.java:745)
[junit4] 2> 1466614 INFO (jetty-launcher-1782-thread-1) [ ] o.a.s.c.CorePropertiesLocator Config-defined core root directory: C:\Users\jenkins\workspace\Lucene-Solr-6.2-Windows\solr\build\solr-core\test\J1\temp\solr.schema.TestManagedSchemaAPI_48109BEB7F21738A-001\tempDir-001\node1\.
[junit4] 2> 1466615 INFO (jetty-launcher-1782-thread-1) [ ] o.a.s.c.CoreContainer New CoreContainer 181531898
[junit4] 2> 1466615 INFO (jetty-launcher-1782-thread-1) [ ] o.a.s.c.CoreContainer Loading cores into CoreContainer [instanceDir=C:\Users\jenkins\workspace\Lucene-Solr-6.2-Windows\solr\build\solr-core\test\J1\temp\solr.schema.TestManagedSchemaAPI_48109BEB7F21738A-001\tempDir-001\node1]
[junit4] 2> 1466615 WARN (jetty-launcher-1782-thread-1) [ ] o.a.s.c.CoreContainer Couldn't add files from C:\Users\jenkins\workspace\Lucene-Solr-6.2-Windows\solr\build\solr-core\test\J1\temp\solr.schema.TestManagedSchemaAPI_48109BEB7F21738A-001\tempDir-001\node1\lib to classpath: C:\Users\jenkins\workspace\Lucene-Solr-6.2-Windows\solr\build\solr-core\test\J1\temp\solr.schema.TestManagedSchemaAPI_48109BEB7F21738A-001\tempDir-001\node1\lib
[junit4] 2> 1466616 INFO (jetty-launcher-1782-thread-1) [ ] o.a.s.h.c.HttpShardHandlerFactory created with socketTimeout : 90000,urlScheme : ,connTimeout : 15000,maxConnectionsPerHost : 20,maxConnections : 10000,corePoolSize : 0,maximumPoolSize : 2147483647,maxThreadIdleTime : 5,sizeOfQueue : -1,fairnessPolicy : false,useRetries : false,connectionsEvictorSleepDelay : 5000,maxConnectionIdleTime : 40000,
[junit4] 2> 1466616 INFO (zkCallback-1785-thread-1) [ ] o.a.s.c.c.ConnectionManager Watcher org.apache.solr.common.cloud.ConnectionManager@60f33f1b name:ZooKeeperConnection Watcher:127.0.0.1:63403/solr got event WatchedEvent state:SyncConnected type:None path:null path:null type:None
[junit4] 2> 1466616 INFO (jetty-launcher-1782-thread-2) [ ] o.a.s.c.c.ConnectionManager Client is connected to ZooKeeper
[junit4] 2> 1466616 INFO (jetty-launcher-1782-thread-2) [ ] o.a.s.c.c.SolrZkClient Using default ZkACLProvider
[junit4] 2> 1466618 INFO (jetty-launcher-1782-thread-2) [ ] o.a.s.s.SolrDispatchFilter solr.xml found in ZooKeeper. Loading...
[junit4] 2> 1466618 INFO (jetty-launcher-1782-thread-1) [ ] o.a.s.u.UpdateShardHandler Creating UpdateShardHandler HTTP client with params: socketTimeout=340000&connTimeout=45000&retry=true
[junit4] 2> 1466619 INFO (jetty-launcher-1782-thread-1) [ ] o.a.s.l.LogWatcher SLF4J impl is org.slf4j.impl.Log4jLoggerFactory
[junit4] 2> 1466619 INFO (jetty-launcher-1782-thread-1) [ ] o.a.s.l.LogWatcher Registering Log Listener [Log4j (org.slf4j.impl.Log4jLoggerFactory)]
[junit4] 2> 1466619 INFO (jetty-launcher-1782-thread-1) [ ] o.a.s.c.ZkContainer Zookeeper client=127.0.0.1:63403/solr
[junit4] 2> 1466619 INFO (jetty-launcher-1782-thread-1) [ ] o.a.s.c.ZkController zkHost includes chroot
[junit4] 2> 1466619 INFO (jetty-launcher-1782-thread-1) [ ] o.a.s.c.c.SolrZkClient Using default ZkCredentialsProvider
[junit4] 2> 1466620 INFO (jetty-launcher-1782-thread-1) [ ] o.a.s.c.c.ConnectionManager Waiting for client to connect to ZooKeeper
[junit4] 2> 1466626 INFO (jetty-launcher-1782-thread-2) [ ] o.a.s.c.CorePropertiesLocator Config-defined core root directory: C:\Users\jenkins\workspace\Lucene-Solr-6.2-Windows\solr\build\solr-core\test\J1\temp\solr.schema.TestManagedSchemaAPI_48109BEB7F21738A-001\tempDir-001\node2\.
[junit4] 2> 1466628 INFO (zkCallback-1788-thread-1) [ ] o.a.s.c.c.ConnectionManager Watcher org.apache.solr.common.cloud.ConnectionManager@6a2e9a92 name:ZooKeeperConnection Watcher:127.0.0.1:63403 got event WatchedEvent state:SyncConnected type:None path:null path:null type:None
[junit4] 2> 1466628 INFO (jetty-launcher-1782-thread-2) [ ] o.a.s.c.CoreContainer New CoreContainer 622563578
[junit4] 2> 1466628 INFO (jetty-launcher-1782-thread-1) [ ] o.a.s.c.c.ConnectionManager Client is connected to ZooKeeper
[junit4] 2> 1466628 INFO (jetty-launcher-1782-thread-2) [ ] o.a.s.c.CoreContainer Loading cores into CoreContainer [instanceDir=C:\Users\jenkins\workspace\Lucene-Solr-6.2-Windows\solr\build\solr-core\test\J1\temp\solr.schema.TestManagedSchemaAPI_48109BEB7F21738A-001\tempDir-001\node2]
[junit4] 2> 1466628 INFO (jetty-launcher-1782-thread-1) [ ] o.a.s.c.c.SolrZkClient Using default ZkACLProvider
[junit4] 2> 1466628 WARN (jetty-launcher-1782-thread-2) [ ] o.a.s.c.CoreContainer Couldn't add files from C:\Users\jenkins\workspace\Lucene-Solr-6.2-Windows\solr\build\solr-core\test\J1\temp\solr.schema.TestManagedSchemaAPI_48109BEB7F21738A-001\tempDir-001\node2\lib to classpath: C:\Users\jenkins\workspace\Lucene-Solr-6.2-Windows\solr\build\solr-core\test\J1\temp\solr.schema.TestManagedSchemaAPI_48109BEB7F21738A-001\tempDir-001\node2\lib
[junit4] 2> 1466629 INFO (jetty-launcher-1782-thread-2) [ ] o.a.s.h.c.HttpShardHandlerFactory created with socketTimeout : 90000,urlScheme : ,connTimeout : 15000,maxConnectionsPerHost : 20,maxConnections : 10000,corePoolSize : 0,maximumPoolSize : 2147483647,maxThreadIdleTime : 5,sizeOfQueue : -1,fairnessPolicy : false,useRetries : false,connectionsEvictorSleepDelay : 5000,maxConnectionIdleTime : 40000,
[junit4] 2> 1466631 INFO (jetty-launcher-1782-thread-2) [ ] o.a.s.u.UpdateShardHandler Creating UpdateShardHandler HTTP client with params: socketTimeout=340000&connTimeout=45000&retry=true
[junit4] 2> 1466632 INFO (jetty-launcher-1782-thread-2) [ ] o.a.s.l.LogWatcher SLF4J impl is org.slf4j.impl.Log4jLoggerFactory
[junit4] 2> 1466632 INFO (jetty-launcher-1782-thread-2) [ ] o.a.s.l.LogWatcher Registering Log Listener [Log4j (org.slf4j.impl.Log4jLoggerFactory)]
[junit4] 2> 1466632 INFO (jetty-launcher-1782-thread-2) [ ] o.a.s.c.ZkContainer Zookeeper client=127.0.0.1:63403/solr
[junit4] 2> 1466632 INFO (jetty-launcher-1782-thread-2) [ ] o.a.s.c.ZkController zkHost includes chroot
[junit4] 2> 1466632 INFO (jetty-launcher-1782-thread-2) [ ] o.a.s.c.c.SolrZkClient Using default ZkCredentialsProvider
[junit4] 2> 1466633 INFO (jetty-launcher-1782-thread-2) [ ] o.a.s.c.c.ConnectionManager Waiting for client to connect to ZooKeeper
[junit4] 2> 1466634 INFO (jetty-launcher-1782-thread-1) [n:127.0.0.1:63407_solr ] o.a.s.c.ZkController Added new OnReconnect listener org.apache.solr.cloud.ZkController$$Lambda$73/1029835503@531e611f
[junit4] 2> 1466637 INFO (jetty-launcher-1782-thread-1) [n:127.0.0.1:63407_solr ] o.a.s.c.c.ConnectionManager Waiting for client to connect to ZooKeeper
[junit4] 2> 1466640 INFO (zkCallback-1791-thread-1) [ ] o.a.s.c.c.ConnectionManager Watcher org.apache.solr.common.cloud.ConnectionManager@1d939f98 name:ZooKeeperConnection Watcher:127.0.0.1:63403 got event WatchedEvent state:SyncConnected type:None path:null path:null type:None
[junit4] 2> 1466641 INFO (jetty-launcher-1782-thread-2) [ ] o.a.s.c.c.ConnectionManager Client is connected to ZooKeeper
[junit4] 2> 1466641 INFO (jetty-launcher-1782-thread-2) [ ] o.a.s.c.c.SolrZkClient Using default ZkACLProvider
[junit4] 2> 1466644 INFO (jetty-launcher-1782-thread-2) [n:127.0.0.1:63411_solr ] o.a.s.c.ZkController Added new OnReconnect listener org.apache.solr.cloud.ZkController$$Lambda$73/1029835503@57191d78
[junit4] 2> 1466645 INFO (jetty-launcher-1782-thread-2) [n:127.0.0.1:63411_solr ] o.a.s.c.c.ConnectionManager Waiting for client to connect to ZooKeeper
[junit4] 2> 1466647 INFO (zkCallback-1792-thread-1-processing-n:127.0.0.1:63407_solr) [n:127.0.0.1:63407_solr ] o.a.s.c.c.ConnectionManager Watcher org.apache.solr.common.cloud.ConnectionManager@5bb58eb name:ZooKeeperConnection Watcher:127.0.0.1:63403/solr got event WatchedEvent state:SyncConnected type:None path:null path:null type:None
[junit4] 2> 1466648 INFO (jetty-launcher-1782-thread-1) [n:127.0.0.1:63407_solr ] o.a.s.c.c.ConnectionManager Client is connected to ZooKeeper
[junit4] 2> 1466648 INFO (zkCallback-1793-thread-1-processing-n:127.0.0.1:63411_solr) [n:127.0.0.1:63411_solr ] o.a.s.c.c.ConnectionManager Watcher org.apache.solr.common.cloud.ConnectionManager@6c8b326b name:ZooKeeperConnection Watcher:127.0.0.1:63403/solr got event WatchedEvent state:SyncConnected type:None path:null path:null type:None
[junit4] 2> 1466649 INFO (jetty-launcher-1782-thread-2) [n:127.0.0.1:63411_solr ] o.a.s.c.c.ConnectionManager Client is connected to ZooKeeper
[junit4] 2> 1466649 INFO (jetty-launcher-1782-thread-1) [n:127.0.0.1:63407_solr ] o.a.s.c.c.SolrZkClient makePath: /overseer/queue
[junit4] 2> 1466650 INFO (jetty-launcher-1782-thread-2) [n:127.0.0.1:63411_solr ] o.a.s.c.c.SolrZkClient makePath: /overseer/queue
[junit4] 2> 1466652 INFO (jetty-launcher-1782-thread-1) [n:127.0.0.1:63407_solr ] o.a.s.c.c.SolrZkClient makePath: /overseer/collection-queue-work
[junit4] 2> 1466653 INFO (jetty-launcher-1782-thread-2) [n:127.0.0.1:63411_solr ] o.a.s.c.c.SolrZkClient makePath: /overseer/collection-queue-work
[junit4] 2> 1466657 INFO (jetty-launcher-1782-thread-2) [n:127.0.0.1:63411_solr ] o.a.s.c.c.SolrZkClient makePath: /overseer/collection-map-running
[junit4] 2> 1466657 INFO (jetty-launcher-1782-thread-1) [n:127.0.0.1:63407_solr ] o.a.s.c.c.SolrZkClient makePath: /overseer/collection-map-running
[junit4] 2> 1466660 INFO (jetty-launcher-1782-thread-2) [n:127.0.0.1:63411_solr ] o.a.s.c.c.SolrZkClient makePath: /overseer/collection-map-completed
[junit4] 2> 1466660 INFO (jetty-launcher-1782-thread-1) [n:127.0.0.1:63407_solr ] o.a.s.c.c.SolrZkClient makePath: /overseer/collection-map-completed
[junit4] 2> 1466662 INFO (jetty-launcher-1782-thread-2) [n:127.0.0.1:63411_solr ] o.a.s.c.c.SolrZkClient makePath: /overseer/collection-map-failure
[junit4] 2> 1466662 INFO (jetty-launcher-1782-thread-1) [n:127.0.0.1:63407_solr ] o.a.s.c.c.SolrZkClient makePath: /overseer/collection-map-failure
[junit4] 2> 1466664 INFO (jetty-launcher-1782-thread-1) [n:127.0.0.1:63407_solr ] o.a.s.c.c.SolrZkClient makePath: /live_nodes
[junit4] 2> 1466664 INFO (jetty-launcher-1782-thread-2) [n:127.0.0.1:63411_solr ] o.a.s.c.c.SolrZkClient makePath: /live_nodes
[junit4] 2> 1466666 INFO (jetty-launcher-1782-thread-2) [n:127.0.0.1:63411_solr ] o.a.s.c.c.SolrZkClient makePath: /collections
[junit4] 2> 1466666 INFO (jetty-launcher-1782-thread-1) [n:127.0.0.1:63407_solr ] o.a.s.c.c.SolrZkClient makePath: /collections
[junit4] 2> 1466667 INFO (jetty-launcher-1782-thread-2) [n:127.0.0.1:63411_solr ] o.a.s.c.c.SolrZkClient makePath: /aliases.json
[junit4] 2> 1466667 INFO (jetty-launcher-1782-thread-1) [n:127.0.0.1:63407_solr ] o.a.s.c.c.SolrZkClient makePath: /aliases.json
[junit4] 2> 1466669 INFO (jetty-launcher-1782-thread-2) [n:127.0.0.1:63411_solr ] o.a.s.c.c.SolrZkClient makePath: /clusterstate.json
[junit4] 2> 1466669 INFO (jetty-launcher-1782-thread-1) [n:127.0.0.1:63407_solr ] o.a.s.c.c.SolrZkClient makePath: /clusterstate.json
[junit4] 2> 1466671 INFO (jetty-launcher-1782-thread-2) [n:127.0.0.1:63411_solr ] o.a.s.c.c.SolrZkClient makePath: /security.json
[junit4] 2> 1466671 INFO (jetty-launcher-1782-thread-1) [n:127.0.0.1:63407_solr ] o.a.s.c.c.SolrZkClient makePath: /security.json
[junit4] 2> 1466672 INFO (jetty-launcher-1782-thread-1) [n:127.0.0.1:63407_solr ] o.a.s.c.c.ZkStateReader Updating cluster state from ZooKeeper...
[junit4] 2> 1466672 INFO (jetty-launcher-1782-thread-2) [n:127.0.0.1:63411_solr ] o.a.s.c.c.ZkStateReader Updating cluster state from ZooKeeper...
[junit4] 2> 1466673 INFO (jetty-launcher-1782-thread-1) [n:127.0.0.1:63407_solr ] o.a.s.c.c.ZkStateReader Loaded empty cluster properties
[junit4] 2> 1466674 INFO (jetty-launcher-1782-thread-2) [n:127.0.0.1:63411_solr ] o.a.s.c.c.ZkStateReader Loaded empty cluster properties
[junit4] 2> 1466674 INFO (jetty-launcher-1782-thread-1) [n:127.0.0.1:63407_solr ] o.a.s.c.c.ZkStateReader Updated live nodes from ZooKeeper... (0) -> (0)
[junit4] 2> 1466675 INFO (jetty-launcher-1782-thread-2) [n:127.0.0.1:63411_solr ] o.a.s.c.c.ZkStateReader Updated live nodes from ZooKeeper... (0) -> (0)
[junit4] 2> 1466678 INFO (jetty-launcher-1782-thread-1) [n:127.0.0.1:63407_solr ] o.a.s.c.c.SolrZkClient makePath: /overseer_elect
[junit4] 2> 1466679 INFO (jetty-launcher-1782-thread-2) [n:127.0.0.1:63411_solr ] o.a.s.c.c.SolrZkClient makePath: /overseer_elect
[junit4] 2> 1466680 INFO (jetty-launcher-1782-thread-1) [n:127.0.0.1:63407_solr ] o.a.s.c.c.SolrZkClient makePath: /overseer_elect/election
[junit4] 2> 1466680 INFO (jetty-launcher-1782-thread-2) [n:127.0.0.1:63411_solr ] o.a.s.c.c.SolrZkClient makePath: /overseer_elect/election
[junit4] 2> 1466682 INFO (jetty-launcher-1782-thread-1) [n:127.0.0.1:63407_solr ] o.a.s.c.Overseer Overseer (id=null) closing
[junit4] 2> 1466683 INFO (jetty-launcher-1782-thread-2) [n:127.0.0.1:63411_solr ] o.a.s.c.Overseer Overseer (id=null) closing
[junit4] 2> 1466683 INFO (jetty-launcher-1782-thread-1) [n:127.0.0.1:63407_solr ] o.a.s.c.LeaderElector Joined leadership election with path: /overseer_elect/election/96619687593377797-127.0.0.1:63407_solr-n_0000000000
[junit4] 2> 1466683 INFO (jetty-launcher-1782-thread-2) [n:127.0.0.1:63411_solr ] o.a.s.c.LeaderElector Joined leadership election with path: /overseer_elect/election/96619687593377798-127.0.0.1:63411_solr-n_0000000001
[junit4] 2> 1466684 INFO (jetty-launcher-1782-thread-1) [n:127.0.0.1:63407_solr ] o.a.s.c.OverseerElectionContext I am going to be the leader 127.0.0.1:63407_solr
[junit4] 2> 1466684 INFO (jetty-launcher-1782-thread-1) [n:127.0.0.1:63407_solr ] o.a.s.c.c.SolrZkClient makePath: /overseer_elect/leader
[junit4] 2> 1466684 INFO (jetty-launcher-1782-thread-2) [n:127.0.0.1:63411_solr ] o.a.s.c.LeaderElector Watching path /overseer_elect/election/96619687593377797-127.0.0.1:63407_solr-n_0000000000 to know if I could be the leader
[junit4] 2> 1466684 INFO (jetty-launcher-1782-thread-2) [n:127.0.0.1:63411_solr ] o.a.s.c.ZkController Register node as live in ZooKeeper:/live_nodes/127.0.0.1:63411_solr
[junit4] 2> 1466684 INFO (jetty-launcher-1782-thread-2) [n:127.0.0.1:63411_solr ] o.a.s.c.c.SolrZkClient makePath: /live_nodes/127.0.0.1:63411_solr
[junit4] 2> 1466684 INFO (jetty-launcher-1782-thread-1) [n:127.0.0.1:63407_solr ] o.a.s.c.Overseer Overseer (id=96619687593377797-127.0.0.1:63407_solr-n_0000000000) starting
[junit4] 2> 1466686 INFO (zkCallback-1793-thread-1-processing-n:127.0.0.1:63411_solr) [n:127.0.0.1:63411_solr ] o.a.s.c.c.ZkStateReader A live node change: [WatchedEvent state:SyncConnected type:NodeChildrenChanged path:/live_nodes], has occurred - updating... (live nodes size: [0])
[junit4] 2> 1466686 INFO (zkCallback-1792-thread-1-processing-n:127.0.0.1:63407_solr) [n:127.0.0.1:63407_solr ] o.a.s.c.c.ZkStateReader A live node change: [WatchedEvent state:SyncConnected type:NodeChildrenChanged path:/live_nodes], has occurred - updating... (live nodes size: [0])
[junit4] 2> 1466688 INFO (zkCallback-1793-thread-1-processing-n:127.0.0.1:63411_solr) [n:127.0.0.1:63411_solr ] o.a.s.c.c.ZkStateReader Updated live nodes from ZooKeeper... (0) -> (1)
[junit4] 2> 1466689 INFO (zkCallback-1792-thread-1-processing-n:127.0.0.1:63407_solr) [n:127.0.0.1:63407_solr ] o.a.s.c.c.ZkStateReader Updated live nodes from ZooKeeper... (0) -> (1)
[junit4] 2> 1466689 INFO (jetty-launcher-1782-thread-1) [n:127.0.0.1:63407_solr ] o.a.s.c.c.SolrZkClient makePath: /overseer/queue-work
[junit4] 2> 1466695 INFO (jetty-launcher-1782-thread-1) [n:127.0.0.1:63407_solr ] o.a.s.c.OverseerAutoReplicaFailoverThread Starting OverseerAutoReplicaFailoverThread autoReplicaFailoverWorkLoopDelay=10000 autoReplicaFailoverWaitAfterExpiration=30000 autoReplicaFailoverBadNodeExpiration=60000
[junit4] 2> 1466696 INFO (jetty-launcher-1782-thread-1) [n:127.0.0.1:63407_solr ] o.a.s.c.ZkController Publish node=127.0.0.1:63407_solr as DOWN
[junit4] 2> 1466696 INFO (OverseerCollectionConfigSetProcessor-96619687593377797-127.0.0.1:63407_solr-n_0000000000) [n:127.0.0.1:63407_solr ] o.a.s.c.OverseerTaskProcessor Process current queue of overseer operations
[junit4] 2> 1466696 INFO (OverseerStateUpdate-96619687593377797-127.0.0.1:63407_solr-n_0000000000) [n:127.0.0.1:63407_solr ] o.a.s.c.Overseer Starting to work on the main queue
[junit4] 2> 1466697 INFO (jetty-launcher-1782-thread-1) [n:127.0.0.1:63407_solr ] o.a.s.c.ZkController Register node as live in ZooKeeper:/live_nodes/127.0.0.1:63407_solr
[junit4] 2> 1466699 INFO (jetty-launcher-1782-thread-1) [n:127.0.0.1:63407_solr ] o.a.s.c.c.SolrZkClient makePath: /live_nodes/127.0.0.1:63407_solr
[junit4] 2> 1466699 INFO (OverseerStateUpdate-96619687593377797-127.0.0.1:63407_solr-n_0000000000) [n:127.0.0.1:63407_solr ] o.a.s.c.c.ZkStateReader Updated live nodes from ZooKeeper... (1) -> (1)
[junit4] 2> 1466701 INFO (zkCallback-1793-thread-1-processing-n:127.0.0.1:63411_solr) [n:127.0.0.1:63411_solr ] o.a.s.c.c.ZkStateReader A live node change: [WatchedEvent state:SyncConnected type:NodeChildrenChanged path:/live_nodes], has occurred - updating... (live nodes size: [1])
[junit4] 2> 1466701 INFO (zkCallback-1792-thread-1-processing-n:127.0.0.1:63407_solr) [n:127.0.0.1:63407_solr ] o.a.s.c.c.ZkStateReader A live node change: [WatchedEvent state:SyncConnected type:NodeChildrenChanged path:/live_nodes], has occurred - updating... (live nodes size: [1])
[junit4] 2> 1466702 INFO (zkCallback-1793-thread-1-processing-n:127.0.0.1:63411_solr) [n:127.0.0.1:63411_solr ] o.a.s.c.c.ZkStateReader Updated live nodes from ZooKeeper... (1) -> (2)
[junit4] 2> 1466702 INFO (OverseerStateUpdate-96619687593377797-127.0.0.1:63407_solr-n_0000000000) [n:127.0.0.1:63407_solr ] o.a.s.c.Overseer processMessage: queueSize: 1, message = {
[junit4] 2> "operation":"downnode",
[junit4] 2> "node_name":"127.0.0.1:63407_solr"} current state version: 0
[junit4] 2> 1466702 INFO (OverseerStateUpdate-96619687593377797-127.0.0.1:63407_solr-n_0000000000) [n:127.0.0.1:63407_solr ] o.a.s.c.o.NodeMutator DownNode state invoked for node: 127.0.0.1:63407_solr
[junit4] 2> 1466703 INFO (zkCallback-1792-thread-1-processing-n:127.0.0.1:63407_solr) [n:127.0.0.1:63407_solr ] o.a.s.c.c.ZkStateReader Updated live nodes from ZooKeeper... (1) -> (2)
[junit4] 2> 1466705 INFO (jetty-launcher-1782-thread-2) [n:127.0.0.1:63411_solr ] o.a.s.c.CoreContainer Security conf doesn't exist. Skipping setup for authorization module.
[junit4] 2> 1466705 INFO (jetty-launcher-1782-thread-2) [n:127.0.0.1:63411_solr ] o.a.s.c.CoreContainer No authentication plugin used.
[junit4] 2> 1466705 INFO (jetty-launcher-1782-thread-2) [n:127.0.0.1:63411_solr ] o.a.s.c.CorePropertiesLocator Looking for core definitions underneath C:\Users\jenkins\workspace\Lucene-Solr-6.2-Windows\solr\build\solr-core\test\J1\temp\solr.schema.TestManagedSchemaAPI_48109BEB7F21738A-001\tempDir-001\node2\.
[junit4] 2> 1466706 INFO (jetty-launcher-1782-thread-2) [n:127.0.0.1:63411_solr ] o.a.s.c.CorePropertiesLocator Found 0 core definitions
[junit4] 2> 1466707 INFO (jetty-launcher-1782-thread-2) [n:127.0.0.1:63411_solr ] o.a.s.s.SolrDispatchFilter user.dir=C:\Users\jenkins\workspace\Lucene-Solr-6.2-Windows\solr\build\solr-core\test\J1
[junit4] 2> 1466707 INFO (jetty-launcher-1782-thread-2) [n:127.0.0.1:63411_solr ] o.a.s.s.SolrDispatchFilter SolrDispatchFilter.init() done
[junit4] 2> 1466721 INFO (jetty-launcher-1782-thread-1) [n:127.0.0.1:63407_solr ] o.a.s.c.CoreContainer Security conf doesn't exist. Skipping setup for authorization module.
[junit4] 2> 1466721 INFO (jetty-launcher-1782-thread-1) [n:127.0.0.1:63407_solr ] o.a.s.c.CoreContainer No authentication plugin used.
[junit4] 2> 1466722 INFO (jetty-launcher-1782-thread-1) [n:127.0.0.1:63407_solr ] o.a.s.c.CorePropertiesLocator Looking for core definitions underneath C:\Users\jenkins\workspace\Lucene-Solr-6.2-Windows\solr\build\solr-core\test\J1\temp\solr.schema.TestManagedSchemaAPI_48109BEB7F21738A-001\tempDir-001\node1\.
[junit4] 2> 1466723 INFO (jetty-launcher-1782-thread-1) [n:127.0.0.1:63407_solr ] o.a.s.c.CorePropertiesLocator Found 0 core definitions
[junit4] 2> 1466724 INFO (jetty-launcher-1782-thread-1) [n:127.0.0.1:63407_solr ] o.a.s.s.SolrDispatchFilter user.dir=C:\Users\jenkins\workspace\Lucene-Solr-6.2-Windows\solr\build\solr-core\test\J1
[junit4] 2> 1466724 INFO (jetty-launcher-1782-thread-1) [n:127.0.0.1:63407_solr ] o.a.s.s.SolrDispatchFilter SolrDispatchFilter.init() done
[junit4] 2> 1466724 INFO (SUITE-TestManagedSchemaAPI-seed#[48109BEB7F21738A]-worker) [ ] o.a.s.c.c.SolrZkClient Using default ZkCredentialsProvider
[junit4] 2> 1466725 INFO (SUITE-TestManagedSchemaAPI-seed#[48109BEB7F21738A]-worker) [ ] o.a.s.c.c.ConnectionManager Waiting for client to connect to ZooKeeper
[junit4] 2> 1466726 INFO (zkCallback-1796-thread-1) [ ] o.a.s.c.c.ConnectionManager Watcher org.apache.solr.common.cloud.ConnectionManager@3cab6281 name:ZooKeeperConnection Watcher:127.0.0.1:63403 got event WatchedEvent state:SyncConnected type:None path:null path:null type:None
[junit4] 2> 1466726 INFO (SUITE-TestManagedSchemaAPI-seed#[48109BEB7F21738A]-worker) [ ] o.a.s.c.c.ConnectionManager Client is connected to ZooKeeper
[junit4] 2> 1466726 INFO (SUITE-TestManagedSchemaAPI-seed#[48109BEB7F21738A]-worker) [ ] o.a.s.c.c.SolrZkClient Using default ZkACLProvider
[junit4] 2> 1466727 INFO (SUITE-TestManagedSchemaAPI-seed#[48109BEB7F21738A]-worker) [ ] o.a.s.c.c.SolrZkClient Using default ZkCredentialsProvider
[junit4] 2> 1466728 INFO (SUITE-TestManagedSchemaAPI-seed#[48109BEB7F21738A]-worker) [ ] o.a.s.c.c.ConnectionManager Waiting for client to connect to ZooKeeper
[junit4] 2> 1466731 INFO (zkCallback-1799-thread-1) [ ] o.a.s.c.c.ConnectionManager Watcher org.apache.solr.common.cloud.ConnectionManager@7f16b6be name:ZooKeeperConnection Watcher:127.0.0.1:63403/solr got event WatchedEvent state:SyncConnected type:None path:null path:null type:None
[junit4] 2> 1466731 INFO (SUITE-TestManagedSchemaAPI-seed#[48109BEB7F21738A]-worker) [ ] o.a.s.c.c.ConnectionManager Client is connected to ZooKeeper
[junit4] 2> 1466731 INFO (SUITE-TestManagedSchemaAPI-seed#[48109BEB7F21738A]-worker) [ ] o.a.s.c.c.SolrZkClient Using default ZkACLProvider
[junit4] 2> 1466731 INFO (SUITE-TestManagedSchemaAPI-seed#[48109BEB7F21738A]-worker) [ ] o.a.s.c.c.ZkStateReader Updating cluster state from ZooKeeper...
[junit4] 2> 1466732 INFO (SUITE-TestManagedSchemaAPI-seed#[48109BEB7F21738A]-worker) [ ] o.a.s.c.c.ZkStateReader Loaded empty cluster properties
[junit4] 2> 1466733 INFO (SUITE-TestManagedSchemaAPI-seed#[48109BEB7F21738A]-worker) [ ] o.a.s.c.c.ZkStateReader Updated live nodes from ZooKeeper... (0) -> (2)
[junit4] 2> 1466735 INFO (SUITE-TestManagedSchemaAPI-seed#[48109BEB7F21738A]-worker) [ ] o.a.s.c.c.SolrZkClient makePath: /configs/conf1/managed-schema
[junit4] 2> 1466737 INFO (SUITE-TestManagedSchemaAPI-seed#[48109BEB7F21738A]-worker) [ ] o.a.s.c.c.SolrZkClient makePath: /configs/conf1/solrconfig.xml
[junit4] 2> 1466760 INFO (TEST-TestManagedSchemaAPI.test-seed#[48109BEB7F21738A]) [ ] o.a.s.SolrTestCaseJ4 ###Starting test
[junit4] 2> 1466763 INFO (qtp624124007-10918) [n:127.0.0.1:63411_solr ] o.a.s.h.a.CollectionsHandler Invoked Collection Action :create with params replicationFactor=2&collection.configName=conf1&name=testschemaapi&action=CREATE&numShards=1&wt=javabin&version=2 and sendToOCPQueue=true
[junit4] 2> 1466767 INFO (OverseerCollectionConfigSetProcessor-96619687593377797-127.0.0.1:63407_solr-n_0000000000) [n:127.0.0.1:63407_solr ] o.a.s.c.OverseerTaskProcessor Overseer Collection Message Handler: Get the message id:/overseer/collection-queue-work/qn-0000000000 message:{
[junit4] 2> "name":"testschemaapi",
[junit4] 2> "fromApi":"true",
[junit4] 2> "replicationFactor":"2",
[junit4] 2> "collection.configName":"conf1",
[junit4] 2> "numShards":"1",
[junit4] 2> "stateFormat":"2",
[junit4] 2> "operation":"create"}
[junit4] 2> 1466767 INFO (OverseerThreadFactory-4971-thread-1-processing-n:127.0.0.1:63407_solr) [n:127.0.0.1:63407_solr ] o.a.s.c.OverseerCollectionMessageHandler OverseerCollectionMessageHandler.processMessage : create , {
[junit4] 2> "name":"testschemaapi",
[junit4] 2> "fromApi":"true",
[junit4] 2> "replicationFactor":"2",
[junit4] 2> "collection.configName":"conf1",
[junit4] 2> "numShards":"1",
[junit4] 2> "stateFormat":"2",
[junit4] 2> "operation":"create"}
[junit4] 2> 1466767 INFO (OverseerThreadFactory-4971-thread-1-processing-n:127.0.0.1:63407_solr) [n:127.0.0.1:63407_solr ] o.a.s.c.CreateCollectionCmd Create collection testschemaapi
[junit4] 2> 1466768 INFO (OverseerThreadFactory-4971-thread-1-processing-n:127.0.0.1:63407_solr) [n:127.0.0.1:63407_solr ] o.a.s.c.OverseerCollectionMessageHandler creating collections conf node /collections/testschemaapi
[junit4] 2> 1466768 INFO (OverseerThreadFactory-4971-thread-1-processing-n:127.0.0.1:63407_solr) [n:127.0.0.1:63407_solr ] o.a.s.c.c.SolrZkClient makePath: /collections/testschemaapi
[junit4] 2> 1466769 INFO (zkCallback-1793-thread-1-processing-n:127.0.0.1:63411_solr) [n:127.0.0.1:63411_solr ] o.a.s.c.c.ZkStateReader A collections change: [WatchedEvent state:SyncConnected type:NodeChildrenChanged path:/collections], has occurred - updating...
[junit4] 2> 1466769 INFO (zkCallback-1792-thread-1-processing-n:127.0.0.1:63407_solr) [n:127.0.0.1:63407_solr ] o.a.s.c.c.ZkStateReader A collections change: [WatchedEvent state:SyncConnected type:NodeChildrenChanged path:/collections], has occurred - updating...
[junit4] 2> 1466769 INFO (zkCallback-1799-thread-1) [ ] o.a.s.c.c.ZkStateReader A collections change: [WatchedEvent state:SyncConnected type:NodeChildrenChanged path:/collections], has occurred - updating...
[junit4] 2> 1466773 INFO (OverseerStateUpdate-96619687593377797-127.0.0.1:63407_solr-n_0000000000) [n:127.0.0.1:63407_solr ] o.a.s.c.Overseer processMessage: queueSize: 1, message = {
[junit4] 2> "name":"testschemaapi",
[junit4] 2> "fromApi":"true",
[junit4] 2> "replicationFactor":"2",
[junit4] 2> "collection.configName":"conf1",
[junit4] 2> "numShards":"1",
[junit4] 2> "stateFormat":"2",
[junit4] 2> "operation":"create"} current state version: 0
[junit4] 2> 1466773 INFO (OverseerStateUpdate-96619687593377797-127.0.0.1:63407_solr-n_0000000000) [n:127.0.0.1:63407_solr ] o.a.s.c.o.ClusterStateMutator building a new cName: testschemaapi
[junit4] 2> 1466774 INFO (OverseerStateUpdate-96619687593377797-127.0.0.1:63407_solr-n_0000000000) [n:127.0.0.1:63407_solr ] o.a.s.c.o.ZkStateWriter going to create_collection /collections/testschemaapi/state.json
[junit4] 2> 1466874 INFO (OverseerThreadFactory-4971-thread-1-processing-n:127.0.0.1:63407_solr) [n:127.0.0.1:63407_solr ] o.a.s.c.CreateCollectionCmd Creating SolrCores for new collection testschemaapi, shardNames [shard1] , replicationFactor : 2
[junit4] 2> 1466874 INFO (OverseerThreadFactory-4971-thread-1-processing-n:127.0.0.1:63407_solr) [n:127.0.0.1:63407_solr ] o.a.s.c.CreateCollectionCmd Creating core testschemaapi_shard1_replica2 as part of shard shard1 of collection testschemaapi on 127.0.0.1:63407_solr
[junit4] 2> 1466874 INFO (OverseerThreadFactory-4971-thread-1-processing-n:127.0.0.1:63407_solr) [n:127.0.0.1:63407_solr ] o.a.s.c.CreateCollectionCmd Creating core testschemaapi_shard1_replica1 as part of shard shard1 of collection testschemaapi on 127.0.0.1:63411_solr
[junit4] 2> 1466878 INFO (qtp624124007-10916) [n:127.0.0.1:63411_solr ] o.a.s.h.a.CoreAdminOperation core create command qt=/admin/cores&collection.configName=conf1&name=testschemaapi_shard1_replica1&action=CREATE&numShards=1&collection=testschemaapi&shard=shard1&wt=javabin&version=2
[junit4] 2> 1466879 INFO (qtp698945442-10928) [n:127.0.0.1:63407_solr ] o.a.s.h.a.CoreAdminOperation core create command qt=/admin/cores&collection.configName=conf1&name=testschemaapi_shard1_replica2&action=CREATE&numShards=1&collection=testschemaapi&shard=shard1&wt=javabin&version=2
[junit4] 2> 1466879 INFO (qtp624124007-10916) [n:127.0.0.1:63411_solr ] o.a.s.c.CoreDescriptor Created CoreDescriptor: {name=testschemaapi_shard1_replica1, collection.configName=conf1, config=solrconfig.xml, transient=false, schema=schema.xml, loadOnStartup=true, configSetProperties=configsetprops.json, collection=testschemaapi, numShards=1, dataDir=data\, shard=shard1}
[junit4] 2> 1466880 INFO (qtp624124007-10916) [n:127.0.0.1:63411_solr c:testschemaapi s:shard1 x:testschemaapi_shard1_replica1] o.a.s.c.ZkController publishing state=down
[junit4] 2> 1466881 INFO (qtp698945442-10928) [n:127.0.0.1:63407_solr ] o.a.s.c.CoreDescriptor Created CoreDescriptor: {name=testschemaapi_shard1_replica2, collection.configName=conf1, config=solrconfig.xml, transient=false, schema=schema.xml, loadOnStartup=true, configSetProperties=configsetprops.json, collection=testschemaapi, numShards=1, dataDir=data\, shard=shard1}
[junit4] 2> 1466881 INFO (qtp624124007-10916) [n:127.0.0.1:63411_solr c:testschemaapi s:shard1 x:testschemaapi_shard1_replica1] o.a.s.c.ZkController Registering watch for collection testschemaapi
[junit4] 2> 1466881 INFO (qtp624124007-10916) [n:127.0.0.1:63411_solr c:testschemaapi s:shard1 x:testschemaapi_shard1_replica1] o.a.s.c.c.ZkStateReader Add data for [testschemaapi] ver [0]
[junit4] 2> 1466881 INFO (qtp624124007-10916) [n:127.0.0.1:63411_solr c:testschemaapi s:shard1 x:testschemaapi_shard1_replica1] o.a.s.c.ZkController look for our core node name
[junit4] 2> 1466882 INFO (qtp698945442-10928) [n:127.0.0.1:63407_solr c:testschemaapi s:shard1 x:testschemaapi_shard1_replica2] o.a.s.c.ZkController publishing state=down
[junit4] 2> 1466883 INFO (qtp698945442-10928) [n:127.0.0.1:63407_solr c:testschemaapi s:shard1 x:testschemaapi_shard1_replica2] o.a.s.c.ZkController Registering watch for collection testschemaapi
[junit4] 2> 1466883 INFO (OverseerStateUpdate-96619687593377797-127.0.0.1:63407_solr-n_0000000000) [n:127.0.0.1:63407_solr ] o.a.s.c.Overseer processMessage: queueSize: 2, message = {
[junit4] 2> "core":"testschemaapi_shard1_replica1",
[junit4] 2> "roles":null,
[junit4] 2> "base_url":"http://127.0.0.1:63411/solr",
[junit4] 2> "node_name":"127.0.0.1:63411_solr",
[junit4] 2> "numShards":"1",
[junit4] 2> "state":"down",
[junit4] 2> "shard":"shard1",
[junit4] 2> "collection":"testschemaapi",
[junit4] 2> "operation":"state"} current state version: 0
[junit4] 2> 1466883 INFO (OverseerStateUpdate-96619687593377797-127.0.0.1:63407_solr-n_0000000000) [n:127.0.0.1:63407_solr ] o.a.s.c.o.ReplicaMutator Update state numShards=1 message={
[junit4] 2> "core":"testschemaapi_shard1_replica1",
[junit4] 2> "roles":null,
[junit4] 2> "base_url":"http://127.0.0.1:63411/solr",
[junit4] 2> "node_name":"127.0.0.1:63411_solr",
[junit4] 2> "numShards":"1",
[junit4] 2> "state":"down",
[junit4] 2> "shard":"shard1",
[junit4] 2> "collection":"testschemaapi",
[junit4] 2> "operation":"state"}
[junit4] 2> 1466883 INFO (qtp698945442-10928) [n:127.0.0.1:63407_solr c:testschemaapi s:shard1 x:testschemaapi_shard1_replica2] o.a.s.c.c.ZkStateReader Add data for [testschemaapi] ver [0]
[junit4] 2> 1466883 INFO (qtp698945442-10928) [n:127.0.0.1:63407_solr c:testschemaapi s:shard1 x:testschemaapi_shard1_replica2] o.a.s.c.ZkController look for our core node name
[junit4] 2> 1466885 INFO (OverseerStateUpdate-96619687593377797-127.0.0.1:63407_solr-n_0000000000) [n:127.0.0.1:63407_solr ] o.a.s.c.Overseer processMessage: queueSize: 2, message = {
[junit4] 2> "core":"testschemaapi_shard1_replica2",
[junit4] 2> "roles":null,
[junit4] 2> "base_url":"http://127.0.0.1:63407/solr",
[junit4] 2> "node_name":"127.0.0.1:63407_solr",
[junit4] 2> "numShards":"1",
[junit4] 2> "state":"down",
[junit4] 2> "shard":"shard1",
[junit4] 2> "collection":"testschemaapi",
[junit4] 2> "operation":"state"} current state version: 0
[junit4] 2> 1466885 INFO (OverseerStateUpdate-96619687593377797-127.0.0.1:63407_solr-n_0000000000) [n:127.0.0.1:63407_solr ] o.a.s.c.o.ReplicaMutator Update state numShards=1 message={
[junit4] 2> "core":"testschemaapi_shard1_replica2",
[junit4] 2> "roles":null,
[junit4] 2> "base_url":"http://127.0.0.1:63407/solr",
[junit4] 2> "node_name":"127.0.0.1:63407_solr",
[junit4] 2> "numShards":"1",
[junit4] 2> "state":"down",
[junit4] 2> "shard":"shard1",
[junit4] 2> "collection":"testschemaapi",
[junit4] 2> "operation":"state"}
[junit4] 2> 1466989 INFO (OverseerStateUpdate-96619687593377797-127.0.0.1:63407_solr-n_0000000000) [n:127.0.0.1:63407_solr ] o.a.s.c.o.ZkStateWriter going to update_collection /collections/testschemaapi/state.json version: 0
[junit4] 2> 1466990 INFO (zkCallback-1793-thread-1-processing-n:127.0.0.1:63411_solr) [n:127.0.0.1:63411_solr ] o.a.s.c.c.ZkStateReader A cluster state change: [WatchedEvent state:SyncConnected type:NodeDataChanged path:/collections/testschemaapi/state.json] for collection [testschemaapi] has occurred - updating... (live nodes size: [2])
[junit4] 2> 1466990 INFO (zkCallback-1792-thread-2-processing-n:127.0.0.1:63407_solr) [n:127.0.0.1:63407_solr ] o.a.s.c.c.ZkStateReader A cluster state change: [WatchedEvent state:SyncConnected type:NodeDataChanged path:/collections/testschemaapi/state.json] for collection [testschemaapi] has occurred - updating... (live nodes size: [2])
[junit4] 2> 1466991 INFO (zkCallback-1793-thread-1-processing-n:127.0.0.1:63411_solr) [n:127.0.0.1:63411_solr ] o.a.s.c.c.ZkStateReader Updating data for [testschemaapi] from [0] to [1]
[junit4] 2> 1466991 INFO (zkCallback-1792-thread-2-processing-n:127.0.0.1:63407_solr) [n:127.0.0.1:63407_solr ] o.a.s.c.c.ZkStateReader Updating data for [testschemaapi] from [0] to [1]
[junit4] 2> 1467882 INFO (qtp624124007-10916) [n:127.0.0.1:63411_solr c:testschemaapi s:shard1 x:testschemaapi_shard1_replica1] o.a.s.c.ZkController waiting to find shard id in clusterstate for testschemaapi_shard1_replica1
[junit4] 2> 1467882 INFO (qtp624124007-10916) [n:127.0.0.1:63411_solr c:testschemaapi s:shard1 x:testschemaapi_shard1_replica1] o.a.s.c.ZkController Check for collection zkNode:testschemaapi
[junit4] 2> 1467882 INFO (qtp624124007-10916) [n:127.0.0.1:63411_solr c:testschemaapi s:shard1 x:testschemaapi_shard1_replica1] o.a.s.c.ZkController Collection zkNode exists
[junit4] 2> 1467882 INFO (qtp624124007-10916) [n:127.0.0.1:63411_solr c:testschemaapi s:shard1 x:testschemaapi_shard1_replica1] o.a.s.c.c.ZkStateReader Load collection config from: [/collections/testschemaapi]
[junit4] 2> 1467883 INFO (qtp624124007-10916) [n:127.0.0.1:63411_solr c:testschemaapi s:shard1 x:testschemaapi_shard1_replica1] o.a.s.c.c.ZkStateReader path=[/collections/testschemaapi] [configName]=[conf1] specified config exists in ZooKeeper
[junit4] 2> 1467883 INFO (qtp624124007-10916) [n:127.0.0.1:63411_solr c:testschemaapi s:shard1 x:testschemaapi_shard1_replica1] o.a.s.c.SolrResourceLoader new SolrResourceLoader for directory: 'C:\Users\jenkins\workspace\Lucene-Solr-6.2-Windows\solr\build\solr-core\test\J1\temp\solr.schema.TestManagedSchemaAPI_48109BEB7F21738A-001\tempDir-001\node2\testschemaapi_shard1_replica1'
[junit4] 2> 1467883 INFO (qtp624124007-10916) [n:127.0.0.1:63411_solr c:testschemaapi s:shard1 x:testschemaapi_shard1_replica1] o.a.s.c.SolrResourceLoader JNDI not configured for solr (NoInitialContextEx)
[junit4] 2> 1467883 INFO (qtp624124007-10916) [n:127.0.0.1:63411_solr c:testschemaapi s:shard1 x:testschemaapi_shard1_replica1] o.a.s.c.SolrResourceLoader solr home defaulted to 'solr/' (could not find system property or JNDI)
[junit4] 2> 1467885 INFO (qtp698945442-10928) [n:127.0.0.1:63407_solr c:testschemaapi s:shard1 x:testschemaapi_shard1_replica2] o.a.s.c.ZkController waiting to find shard id in clusterstate for testschemaapi_shard1_replica2
[junit4] 2> 1467885 INFO (qtp698945442-10928) [n:127.0.0.1:63407_solr c:testschemaapi s:shard1 x:testschemaapi_shard1_replica2] o.a.s.c.ZkController Check for collection zkNode:testschemaapi
[junit4] 2> 1467885 INFO (qtp698945442-10928) [n:127.0.0.1:63407_solr c:testschemaapi s:shard1 x:testschemaapi_shard1_replica2] o.a.s.c.ZkController Collection zkNode exists
[junit4] 2> 1467886 INFO (qtp698945442-10928) [n:127.0.0.1:63407_solr c:testschemaapi s:shard1 x:testschemaapi_shard1_replica2] o.a.s.c.c.ZkStateReader Load collection config from: [/collections/testschemaapi]
[junit4] 2> 1467886 INFO (qtp624124007-10916) [n:127.0.0.1:63411_solr c:testschemaapi s:shard1 x:testschemaapi_shard1_replica1] o.a.s.c.Config loaded config solrconfig.xml with version 0
[junit4] 2> 1467886 INFO (qtp698945442-10928) [n:127.0.0.1:63407_solr c:testschemaapi s:shard1 x:testschemaapi_shard1_replica2] o.a.s.c.c.ZkStateReader path=[/collections/testschemaapi] [configName]=[conf1] specified config exists in ZooKeeper
[junit4] 2> 1467886 INFO (qtp698945442-10928) [n:127.0.0.1:63407_solr c:testschemaapi s:shard1 x:testschemaapi_shard1_replica2] o.a.s.c.SolrResourceLoader new SolrResourceLoader for directory: 'C:\Users\jenkins\workspace\Lucene-Solr-6.2-Windows\solr\build\solr-core\test\J1\temp\solr.schema.TestManagedSchemaAPI_48109BEB7F21738A-001\tempDir-001\node1\testschemaapi_shard1_replica2'
[junit4] 2> 1467886 INFO (qtp698945442-10928) [n:127.0.0.1:63407_solr c:testschemaapi s:shard1 x:testschemaapi_shard1_replica2] o.a.s.c.SolrResourceLoader JNDI not configured for solr (NoInitialContextEx)
[junit4] 2> 1467886 INFO (qtp698945442-10928) [n:127.0.0.1:63407_solr c:testschemaapi s:shard1 x:testschemaapi_shard1_replica2] o.a.s.c.SolrResourceLoader solr home defaulted to 'solr/' (could not find system property or JNDI)
[junit4] 2> 1467889 INFO (qtp698945442-10928) [n:127.0.0.1:63407_solr c:testschemaapi s:shard1 x:testschemaapi_shard1_replica2] o.a.s.c.Config loaded config solrconfig.xml with version 0
[junit4] 2> 1467894 INFO (qtp624124007-10916) [n:127.0.0.1:63411_solr c:testschemaapi s:shard1 x:testschemaapi_shard1_replica1] o.a.s.c.SolrConfig current version of requestparams : -1
[junit4] 2> 1467894 INFO (qtp698945442-10928) [n:127.0.0.1:63407_solr c:testschemaapi s:shard1 x:testschemaapi_shard1_replica2] o.a.s.c.SolrConfig current version of requestparams : -1
[junit4] 2> 1467896 INFO (qtp624124007-10916) [n:127.0.0.1:63411_solr c:testschemaapi s:shard1 x:testschemaapi_shard1_replica1] o.a.s.c.SolrConfig Using Lucene MatchVersion: 6.2.1
[junit4] 2> 1467896 INFO (qtp698945442-10928) [n:127.0.0.1:63407_solr c:testschemaapi s:shard1 x:testschemaapi_shard1_replica2] o.a.s.c.SolrConfig Using Lucene MatchVersion: 6.2.1
[junit4] 2> 1467914 INFO (qtp624124007-10916) [n:127.0.0.1:63411_solr c:testschemaapi s:shard1 x:testschemaapi_shard1_replica1] o.a.s.c.SolrConfig Loaded SolrConfig: solrconfig.xml
[junit4] 2> 1467914 INFO (qtp698945442-10928) [n:127.0.0.1:63407_solr c:testschemaapi s:shard1 x:testschemaapi_shard1_replica2] o.a.s.c.SolrConfig Loaded SolrConfig: solrconfig.xml
[junit4] 2> 1467918 INFO (qtp698945442-10928) [n:127.0.0.1:63407_solr c:testschemaapi s:shard1 x:testschemaapi_shard1_replica2] o.a.s.s.IndexSchema [testschemaapi_shard1_replica2] Schema name=minimal
[junit4] 2> 1467918 INFO (qtp624124007-10916) [n:127.0.0.1:63411_solr c:testschemaapi s:shard1 x:testschemaapi_shard1_replica1] o.a.s.s.IndexSchema [testschemaapi_shard1_replica1] Schema name=minimal
[junit4] 2> 1467920 INFO (qtp698945442-10928) [n:127.0.0.1:63407_solr c:testschemaapi s:shard1 x:testschemaapi_shard1_replica2] o.a.s.s.IndexSchema unique key field: id
[junit4] 2> 1467920 INFO (qtp624124007-10916) [n:127.0.0.1:63411_solr c:testschemaapi s:shard1 x:testschemaapi_shard1_replica1] o.a.s.s.IndexSchema unique key field: id
[junit4] 2> 1467922 INFO (qtp698945442-10928) [n:127.0.0.1:63407_solr c:testschemaapi s:shard1 x:testschemaapi_shard1_replica2] o.a.s.c.ConfigSetProperties Did not find ConfigSet properties, assuming default properties: Can't find resource 'configsetprops.json' in classpath or '/configs/conf1', cwd=C:\Users\jenkins\workspace\Lucene-Solr-6.2-Windows\solr\build\solr-core\test\J1
[junit4] 2> 1467922 INFO (qtp698945442-10928) [n:127.0.0.1:63407_solr c:testschemaapi s:shard1 x:testschemaapi_shard1_replica2] o.a.s.c.CoreContainer Creating SolrCore 'testschemaapi_shard1_replica2' using configuration from collection testschemaapi
[junit4] 2> 1467922 INFO (qtp624124007-10916) [n:127.0.0.1:63411_solr c:testschemaapi s:shard1 x:testschemaapi_shard1_replica1] o.a.s.c.ConfigSetProperties Did not find ConfigSet properties, assuming default properties: Can't find resource 'configsetprops.json' in classpath or '/configs/conf1', cwd=C:\Users\jenkins\workspace\Lucene-Solr-6.2-Windows\solr\build\solr-core\test\J1
[junit4] 2> 1467922 INFO (qtp624124007-10916) [n:127.0.0.1:63411_solr c:testschemaapi s:shard1 x:testschemaapi_shard1_replica1] o.a.s.c.CoreContainer Creating SolrCore 'testschemaapi_shard1_replica1' using configuration from collection testschemaapi
[junit4] 2> 1467922 INFO (qtp698945442-10928) [n:127.0.0.1:63407_solr c:testschemaapi s:shard1 r:core_node2 x:testschemaapi_shard1_replica2] o.a.s.c.SolrCore org.apache.solr.core.MockDirectoryFactory
[junit4] 2> 1467922 INFO (qtp624124007-10916) [n:127.0.0.1:63411_solr c:testschemaapi s:shard1 r:core_node1 x:testschemaapi_shard1_replica1] o.a.s.c.SolrCore org.apache.solr.core.MockDirectoryFactory
[junit4] 2> 1467923 INFO (qtp698945442-10928) [n:127.0.0.1:63407_solr c:testschemaapi s:shard1 r:core_node2 x:testschemaapi_shard1_replica2] o.a.s.c.SolrCore [[testschemaapi_shard1_replica2] ] Opening new SolrCore at [C:\Users\jenkins\workspace\Lucene-Solr-6.2-Windows\solr\build\solr-core\test\J1\temp\solr.schema.TestManagedSchemaAPI_48109BEB7F21738A-001\tempDir-001\node1\testschemaapi_shard1_replica2], dataDir=[C:\Users\jenkins\workspace\Lucene-Solr-6.2-Windows\solr\build\solr-core\test\J1\temp\solr.schema.TestManagedSchemaAPI_48109BEB7F21738A-001\tempDir-001\node1\.\testschemaapi_shard1_replica2\data\]
[junit4] 2> 1467923 INFO (qtp698945442-10928) [n:127.0.0.1:63407_solr c:testschemaapi s:shard1 r:core_node2 x:testschemaapi_shard1_replica2] o.a.s.c.SolrCore JMX monitoring not detected for core: testschemaapi_shard1_replica2
[junit4] 2> 1467923 INFO (qtp624124007-10916) [n:127.0.0.1:63411_solr c:testschemaapi s:shard1 r:core_node1 x:testschemaapi_shard1_replica1] o.a.s.c.SolrCore [[testschemaapi_shard1_replica1] ] Opening new SolrCore at [C:\Users\jenkins\workspace\Lucene-Solr-6.2-Windows\solr\build\solr-core\test\J1\temp\solr.schema.TestManagedSchemaAPI_48109BEB7F21738A-001\tempDir-001\node2\testschemaapi_shard1_replica1], dataDir=[C:\Users\jenkins\workspace\Lucene-Solr-6.2-Windows\solr\build\solr-core\test\J1\temp\solr.schema.TestManagedSchemaAPI_48109BEB7F21738A-001\tempDir-001\node2\.\testschemaapi_shard1_replica1\data\]
[junit4] 2> 1467923 INFO (qtp624124007-10916) [n:127.0.0.1:63411_solr c:testschemaapi s:shard1 r:core_node1 x:testschemaapi_shard1_replica1] o.a.s.c.SolrCore JMX monitoring not detected for core: testschemaapi_shard1_replica1
[junit4] 2> 1467923 INFO (qtp698945442-10928) [n:127.0.0.1:63407_solr c:testschemaapi s:shard1 r:core_node2 x:testschemaapi_shard1_replica2] o.a.s.c.CachingDirectoryFactory return new directory for C:\Users\jenkins\workspace\Lucene-Solr-6.2-Windows\solr\build\solr-core\test\J1\temp\solr.schema.TestManagedSchemaAPI_48109BEB7F21738A-001\tempDir-001\node1\.\testschemaapi_shard1_replica2\data\snapshot_metadata
[junit4] 2> 1467923 INFO (qtp698945442-10928) [n:127.0.0.1:63407_solr c:testschemaapi s:shard1 r:core_node2 x:testschemaapi_shard1_replica2] o.a.s.c.s.SolrSnapshotMetaDataManager Loading from snapshot metadata file...
[junit4] 2> 1467923 INFO (qtp624124007-10916) [n:127.0.0.1:63411_solr c:testschemaapi s:shard1 r:core_node1 x:testschemaapi_shard1_replica1] o.a.s.c.CachingDirectoryFactory return new directory for C:\Users\jenkins\workspace\Lucene-Solr-6.2-Windows\solr\build\solr-core\test\J1\temp\solr.schema.TestManagedSchemaAPI_48109BEB7F21738A-001\tempDir-001\node2\.\testschemaapi_shard1_replica1\data\snapshot_metadata
[junit4] 2> 1467923 INFO (qtp624124007-10916) [n:127.0.0.1:63411_solr c:testschemaapi s:shard1 r:core_node1 x:testschemaapi_shard1_replica1] o.a.s.c.s.SolrSnapshotMetaDataManager Loading from snapshot metadata file...
[junit4] 2> 1467924 INFO (qtp698945442-10928) [n:127.0.0.1:63407_solr c:testschemaapi s:shard1 r:core_node2 x:testschemaapi_shard1_replica2] o.a.s.c.CachingDirectoryFactory return new directory for C:\Users\jenkins\workspace\Lucene-Solr-6.2-Windows\solr\build\solr-core\test\J1\temp\solr.schema.TestManagedSchemaAPI_48109BEB7F21738A-001\tempDir-001\node1\.\testschemaapi_shard1_replica2\data\
[junit4] 2> 1467924 INFO (qtp698945442-10928) [n:127.0.0.1:63407_solr c:testschemaapi s:shard1 r:core_node2 x:testschemaapi_shard1_replica2] o.a.s.c.SolrCore New index directory detected: old=null new=C:\Users\jenkins\workspace\Lucene-Solr-6.2-Windows\solr\build\solr-core\test\J1\temp\solr.schema.TestManagedSchemaAPI_48109BEB7F21738A-001\tempDir-001\node1\.\testschemaapi_shard1_replica2\data\index/
[junit4] 2> 1467924 WARN (qtp698945442-10928) [n:127.0.0.1:63407_solr c:testschemaapi s:shard1 r:core_node2 x:testschemaapi_shard1_replica2] o.a.s.c.SolrCore [testschemaapi_shard1_replica2] Solr index directory 'C:\Users\jenkins\workspace\Lucene-Solr-6.2-Windows\solr\build\solr-core\test\J1\temp\solr.schema.TestManagedSchemaAPI_48109BEB7F21738A-001\tempDir-001\node1\.\testschemaapi_shard1_replica2\data\index' doesn't exist. Creating new index...
[junit4] 2> 1467924 INFO (qtp624124007-10916) [n:127.0.0.1:63411_solr c:testschemaapi s:shard1 r:core_node1 x:testschemaapi_shard1_replica1] o.a.s.c.CachingDirectoryFactory return new directory for C:\Users\jenkins\workspace\Lucene-Solr-6.2-Windows\solr\build\solr-core\test\J1\temp\solr.schema.TestManagedSchemaAPI_48109BEB7F21738A-001\tempDir-001\node2\.\testschemaapi_shard1_replica1\data\
[junit4] 2> 1467924 INFO (qtp624124007-10916) [n:127.0.0.1:63411_solr c:testschemaapi s:shard1 r:core_node1 x:testschemaapi_shard1_replica1] o.a.s.c.SolrCore New index directory detected: old=null new=C:\Users\jenkins\workspace\Lucene-Solr-6.2-Windows\solr\build\solr-core\test\J1\temp\solr.schema.TestManagedSchemaAPI_48109BEB7F21738A-001\tempDir-001\node2\.\testschemaapi_shard1_replica1\data\index/
[junit4] 2> 1467924 WARN (qtp624124007-10916) [n:127.0.0.1:63411_solr c:testschemaapi s:shard1 r:core_node1 x:testschemaapi_shard1_replica1] o.a.s.c.SolrCore [testschemaapi_shard1_replica1] Solr index directory 'C:\Users\jenkins\workspace\Lucene-Solr-6.2-Windows\solr\build\solr-core\test\J1\temp\solr.schema.TestManagedSchemaAPI_48109BEB7F21738A-001\tempDir-001\node2\.\testschemaapi_shard1_replica1\data\index' doesn't exist. Creating new index...
[junit4] 2> 1467924 INFO (qtp698945442-10928) [n:127.0.0.1:63407_solr c:testschemaapi s:shard1 r:core_node2 x:testschemaapi_shard1_replica2] o.a.s.c.CachingDirectoryFactory return new directory for C:\Users\jenkins\workspace\Lucene-Solr-6.2-Windows\solr\build\solr-core\test\J1\temp\solr.schema.TestManagedSchemaAPI_48109BEB7F21738A-001\tempDir-001\node1\.\testschemaapi_shard1_replica2\data\index
[junit4] 2> 1467925 INFO (qtp624124007-10916) [n:127.0.0.1:63411_solr c:testschemaapi s:shard1 r:core_node1 x:testschemaapi_shard1_replica1] o.a.s.c.CachingDirectoryFactory return new directory for C:\Users\jenkins\workspace\Lucene-Solr-6.2-Windows\solr\build\solr-core\test\J1\temp\solr.schema.TestManagedSchemaAPI_48109BEB7F21738A-001\tempDir-001\node2\.\testschemaapi_shard1_replica1\data\index
[junit4] 2> 1467925 INFO (qtp698945442-10928) [n:127.0.0.1:63407_solr c:testschemaapi s:shard1 r:core_node2 x:testschemaapi_shard1_replica2] o.a.s.c.SolrDeletionPolicy SolrDeletionPolicy.onCommit: commits: num=1
[junit4] 2> commit{dir=MockDirectoryWrapper(RAMDirectory@6dbecf14 lockFactory=org.apache.lucene.store.SingleInstanceLockFactory@6519c99a),segFN=segments_1,generation=1}
[junit4] 2> 1467925 INFO (qtp698945442-10928) [n:127.0.0.1:63407_solr c:testschemaapi s:shard1 r:core_node2 x:testschemaapi_shard1_replica2] o.a.s.c.SolrDeletionPolicy newest commit generation = 1
[junit4] 2> 1467925 INFO (qtp624124007-10916) [n:127.0.0.1:63411_solr c:testschemaapi s:shard1 r:core_node1 x:testschemaapi_shard1_replica1] o.a.s.c.SolrDeletionPolicy SolrDeletionPolicy.onCommit: commits: num=1
[junit4] 2> commit{dir=MockDirectoryWrapper(RAMDirectory@38ae437f lockFactory=org.apache.lucene.store.SingleInstanceLockFactory@67f067d),segFN=segments_1,generation=1}
[junit4] 2> 1467925 INFO (qtp624124007-10916) [n:127.0.0.1:63411_solr c:testschemaapi s:shard1 r:core_node1 x:testschemaapi_shard1_replica1] o.a.s.c.SolrDeletionPolicy newest commit generation = 1
[junit4] 2> 1467926 INFO (OldIndexDirectoryCleanupThreadForCore-testschemaapi_shard1_replica2) [n:127.0.0.1:63407_solr c:testschemaapi s:shard1 r:core_node2 x:testschemaapi_shard1_replica2] o.a.s.c.SolrCore Looking for old index directories to cleanup for core testschemaapi_shard1_replica2 in C:\Users\jenkins\workspace\Lucene-Solr-6.2-Windows\solr\build\solr-core\test\J1\temp\solr.schema.TestManagedSchemaAPI_48109BEB7F21738A-001\tempDir-001\node1\.\testschemaapi_shard1_replica2\data\
[junit4] 2> 1467927 INFO (qtp624124007-10916) [n:127.0.0.1:63411_solr c:testschemaapi s:shard1 r:core_node1 x:testschemaapi_shard1_replica1] o.a.s.c.SolrCore no updateRequestProcessorChain defined as default, creating implicit default
[junit4] 2> 1467927 INFO (qtp698945442-10928) [n:127.0.0.1:63407_solr c:testschemaapi s:shard1 r:core_node2 x:testschemaapi_shard1_replica2] o.a.s.c.SolrCore no updateRequestProcessorChain defined as default, creating implicit default
[junit4] 2> 1467927 WARN (OldIndexDirectoryCleanupThreadForCore-testschemaapi_shard1_replica2) [n:127.0.0.1:63407_solr c:testschemaapi s:shard1 r:core_node2 x:testschemaapi_shard1_replica2] o.a.s.c.DirectoryFactory C:\Users\jenkins\workspace\Lucene-Solr-6.2-Windows\solr\build\solr-core\test\J1\temp\solr.schema.TestManagedSchemaAPI_48109BEB7F21738A-001\tempDir-001\node1\.\testschemaapi_shard1_replica2\data\ does not point to a valid data directory; skipping clean-up of old index directories.
[junit4] 2> 1467927 INFO (OldIndexDirectoryCleanupThreadForCore-testschemaapi_shard1_replica1) [n:127.0.0.1:63411_solr c:testschemaapi s:shard1 r:core_node1 x:testschemaapi_shard1_replica1] o.a.s.c.SolrCore Looking for old index directories to cleanup for core testschemaapi_shard1_replica1 in C:\Users\jenkins\workspace\Lucene-Solr-6.2-Windows\solr\build\solr-core\test\J1\temp\solr.schema.TestManagedSchemaAPI_48109BEB7F21738A-001\tempDir-001\node2\.\testschemaapi_shard1_replica1\data\
[junit4] 2> 1467928 WARN (OldIndexDirectoryCleanupThreadForCore-testschemaapi_shard1_replica1) [n:127.0.0.1:63411_solr c:testschemaapi s:shard1 r:core_node1 x:testschemaapi_shard1_replica1] o.a.s.c.DirectoryFactory C:\Users\jenkins\workspace\Lucene-Solr-6.2-Windows\solr\build\solr-core\test\J1\temp\solr.schema.TestManagedSchemaAPI_48109BEB7F21738A-001\tempDir-001\node2\.\testschemaapi_shard1_replica1\data\ does not point to a valid data directory; skipping clean-up of old index directories.
[junit4] 2> 1467928 INFO (qtp698945442-10928) [n:127.0.0.1:63407_solr c:testschemaapi s:shard1 r:core_node2 x:testschemaapi_shard1_replica2] o.a.s.h.l.XMLLoader xsltCacheLifetimeSeconds=60
[junit4] 2> 1467929 INFO (qtp624124007-10916) [n:127.0.0.1:63411_solr c:testschemaapi s:shard1 r:core_node1 x:testschemaapi_shard1_replica1] o.a.s.h.l.XMLLoader xsltCacheLifetimeSeconds=60
[junit4] 2> 1467930 INFO (qtp698945442-10928) [n:127.0.0.1:63407_solr c:testschemaapi s:shard1 r:core_node2 x:testschemaapi_shard1_replica2] o.a.s.h.l.XMLLoader xsltCacheLifetimeSeconds=60
[junit4] 2> 1467930 INFO (qtp624124007-10916) [n:127.0.0.1:63411_solr c:testschemaapi s:shard1 r:core_node1 x:testschemaapi_shard1_replica1] o.a.s.h.l.XMLLoader xsltCacheLifetimeSeconds=60
[junit4] 2> 1467931 INFO (qtp624124007-10916) [n:127.0.0.1:63411_solr c:testschemaapi s:shard1 r:core_node1 x:testschemaapi_shard1_replica1] o.a.s.h.l.XMLLoader xsltCacheLifetimeSeconds=60
[junit4] 2> 1467931 INFO (qtp698945442-10928) [n:127.0.0.1:63407_solr c:testschemaapi s:shard1 r:core_node2 x:testschemaapi_shard1_replica2] o.a.s.h.l.XMLLoader xsltCacheLifetimeSeconds=60
[junit4] 2> 1467933 INFO (qtp624124007-10916) [n:127.0.0.1:63411_solr c:testschemaapi s:shard1 r:core_node1 x:testschemaapi_shard1_replica1] o.a.s.h.l.XMLLoader xsltCacheLifetimeSeconds=60
[junit4] 2> 1467933 INFO (qtp698945442-10928) [n:127.0.0.1:63407_solr c:testschemaapi s:shard1 r:core_node2 x:testschemaapi_shard1_replica2] o.a.s.h.l.XMLLoader xsltCacheLifetimeSeconds=60
[junit4] 2> 1467934 INFO (qtp624124007-10916) [n:127.0.0.1:63411_solr c:testschemaapi s:shard1 r:core_node1 x:testschemaapi_shard1_replica1] o.a.s.c.RequestHandlers Registered paths: /admin/mbeans,/update/json/docs,/admin/luke,/export,/get,/admin/properties,/update/json,/admin/threads,/update/csv,/sql,/graph,/select,/admin/segments,/admin/system,/replication,/config,/stream,/schema,/admin/plugins,/admin/logging,/admin/ping,/update,/admin/file,/terms
[junit4] 2> 1467934 INFO (qtp624124007-10916) [n:127.0.0.1:63411_solr c:testschemaapi s:shard1 r:core_node1 x:testschemaapi_shard1_replica1] o.a.s.c.SolrCore Using default statsCache cache: org.apache.solr.search.stats.LocalStatsCache
[junit4] 2> 1467935 INFO (qtp698945442-10928) [n:127.0.0.1:63407_solr c:testschemaapi s:shard1 r:core_node2 x:testschemaapi_shard1_replica2] o.a.s.c.RequestHandlers Registered paths: /admin/mbeans,/update/json/docs,/admin/luke,/export,/get,/admin/properties,/update/json,/admin/threads,/update/csv,/sql,/graph,/select,/admin/segments,/admin/system,/replication,/config,/stream,/schema,/admin/plugins,/admin/logging,/admin/ping,/update,/admin/file,/terms
[junit4] 2> 1467935 INFO (qtp698945442-10928) [n:127.0.0.1:63407_solr c:testschemaapi s:shard1 r:core_node2 x:testschemaapi_shard1_replica2] o.a.s.c.SolrCore Using default statsCache cache: org.apache.solr.search.stats.LocalStatsCache
[junit4] 2> 1467936 INFO (qtp624124007-10916) [n:127.0.0.1:63411_solr c:testschemaapi s:shard1 r:core_node1 x:testschemaapi_shard1_replica1] o.a.s.u.UpdateHandler Using UpdateLog implementation: org.apache.solr.update.UpdateLog
[junit4] 2> 1467936 INFO (qtp698945442-10928) [n:127.0.0.1:63407_solr c:testschemaapi s:shard1 r:core_node2 x:testschemaapi_shard1_replica2] o.a.s.u.UpdateHandler Using UpdateLog implementation: org.apache.solr.update.UpdateLog
[junit4] 2> 1467936 INFO (qtp698945442-10928) [n:127.0.0.1:63407_solr c:testschemaapi s:shard1 r:core_node2 x:testschemaapi_shard1_replica2] o.a.s.u.UpdateLog Initializing UpdateLog: dataDir=null defaultSyncLevel=FLUSH numRecordsToKeep=100 maxNumLogsToKeep=10 numVersionBuckets=65536
[junit4] 2> 1467936 INFO (qtp624124007-10916) [n:127.0.0.1:63411_solr c:testschemaapi s:shard1 r:core_node1 x:testschemaapi_shard1_replica1] o.a.s.u.UpdateLog Initializing UpdateLog: dataDir=null defaultSyncLevel=FLUSH numRecordsToKeep=100 maxNumLogsToKeep=10 numVersionBuckets=65536
[junit4] 2> 1467938 INFO (qtp698945442-10928) [n:127.0.0.1:63407_solr c:testschemaapi s:shard1 r:core_node2 x:testschemaapi_shard1_replica2] o.a.s.u.CommitTracker Hard AutoCommit: disabled
[junit4] 2> 1467938 INFO (qtp624124007-10916) [n:127.0.0.1:63411_solr c:testschemaapi s:shard1 r:core_node1 x:testschemaapi_shard1_replica1] o.a.s.u.CommitTracker Hard AutoCommit: disabled
[junit4] 2> 1467938 INFO (qtp624124007-10916) [n:127.0.0.1:63411_solr c:testschemaapi s:shard1 r:core_node1 x:testschemaapi_shard1_replica1] o.a.s.u.CommitTracker Soft AutoCommit: disabled
[junit4] 2> 1467938 INFO (qtp698945442-10928) [n:127.0.0.1:63407_solr c:testschemaapi s:shard1 r:core_node2 x:testschemaapi_shard1_replica2] o.a.s.u.CommitTracker Soft AutoCommit: disabled
[junit4] 2> 1467938 INFO (qtp698945442-10928) [n:127.0.0.1:63407_solr c:testschemaapi s:shard1 r:core_node2 x:testschemaapi_shard1_replica2] o.a.s.c.SolrDeletionPolicy SolrDeletionPolicy.onInit: commits: num=1
[junit4] 2> commit{dir=MockDirectoryWrapper(RAMDirectory@6dbecf14 lockFactory=org.apache.lucene.store.SingleInstanceLockFactory@6519c99a),segFN=segments_1,generation=1}
[junit4] 2> 1467939 INFO (qtp698945442-10928) [n:127.0.0.1:63407_solr c:testschemaapi s:shard1 r:core_node2 x:testschemaapi_shard1_replica2] o.a.s.c.SolrDeletionPolicy newest commit generation = 1
[junit4] 2> 1467938 INFO (qtp624124007-10916) [n:127.0.0.1:63411_solr c:testschemaapi s:shard1 r:core_node1 x:testschemaapi_shard1_replica1] o.a.s.c.SolrDeletionPolicy SolrDeletionPolicy.onInit: commits: num=1
[junit4] 2> commit{dir=MockDirectoryWrapper(RAMDirectory@38ae437f lockFactory=org.apache.lucene.store.SingleInstanceLockFactory@67f067d),segFN=segments_1,generation=1}
[junit4] 2> 1467939 INFO (qtp698945442-10928) [n:127.0.0.1:63407_solr c:testschemaapi s:shard1 r:core_node2 x:testschemaapi_shard1_replica2] o.a.s.s.SolrIndexSearcher Opening [Searcher@6a76bcf7[testschemaapi_shard1_replica2] main]
[junit4] 2> 1467939 INFO (qtp624124007-10916) [n:127.0.0.1:63411_solr c:testschemaapi s:shard1 r:core_node1 x:testschemaapi_shard1_replica1] o.a.s.c.SolrDeletionPolicy newest commit generation = 1
[junit4] 2> 1467939 INFO (qtp624124007-10916) [n:127.0.0.1:63411_solr c:testschemaapi s:shard1 r:core_node1 x:testschemaapi_shard1_replica1] o.a.s.s.SolrIndexSearcher Opening [Searcher@5c7b5f8f[testschemaapi_shard1_replica1] main]
[junit4] 2> 1467939 INFO (qtp698945442-10928) [n:127.0.0.1:63407_solr c:testschemaapi s:shard1 r:core_node2 x:testschemaapi_shard1_replica2] o.a.s.c.c.ZkStateReader Load collection config from: [/collections/testschemaapi]
[junit4] 2> 1467939 INFO (qtp624124007-10916) [n:127.0.0.1:63411_solr c:testschemaapi s:shard1 r:core_node1 x:testschemaapi_shard1_replica1] o.a.s.c.c.ZkStateReader Load collection config from: [/collections/testschemaapi]
[junit4] 2> 1467939 INFO (qtp624124007-10916) [n:127.0.0.1:63411_solr c:testschemaapi s:shard1 r:core_node1 x:testschemaapi_shard1_replica1] o.a.s.c.c.ZkStateReader path=[/collections/testschemaapi] [configName]=[conf1] specified config exists in ZooKeeper
[junit4] 2> 1467939 INFO (qtp624124007-10916) [n:127.0.0.1:63411_solr c:testschemaapi s:shard1 r:core_node1 x:testschemaapi_shard1_replica1] o.a.s.r.ManagedResourceStorage Setting up ZooKeeper-based storage for the RestManager with znodeBase: /configs/conf1
[junit4] 2> 1467939 INFO (qtp698945442-10928) [n:127.0.0.1:63407_solr c:testschemaapi s:shard1 r:core_node2 x:testschemaapi_shard1_replica2] o.a.s.c.c.ZkStateReader path=[/collections/testschemaapi] [configName]=[conf1] specified config exists in ZooKeeper
[junit4] 2> 1467939 INFO (qtp698945442-10928) [n:127.0.0.1:63407_solr c:testschemaapi s:shard1 r:core_node2 x:testschemaapi_shard1_replica2] o.a.s.r.ManagedResourceStorage Setting up ZooKeeper-based storage for the RestManager with znodeBase: /configs/conf1
[junit4] 2> 1467940 INFO (qtp624124007-10916) [n:127.0.0.1:63411_solr c:testschemaapi s:shard1 r:core_node1 x:testschemaapi_shard1_replica1] o.a.s.r.ManagedResourceStorage Configured ZooKeeperStorageIO with znodeBase: /configs/conf1
[junit4] 2> 1467940 INFO (qtp698945442-10928) [n:127.0.0.1:63407_solr c:testschemaapi s:shard1 r:core_node2 x:testschemaapi_shard1_replica2] o.a.s.r.ManagedResourceStorage Configured ZooKeeperStorageIO with znodeBase: /configs/conf1
[junit4] 2> 1467940 INFO (qtp698945442-10928) [n:127.0.0.1:63407_solr c:testschemaapi s:shard1 r:core_node2 x:testschemaapi_shard1_replica2] o.a.s.r.RestManager Initializing RestManager with initArgs: {}
[junit4] 2> 1467940 INFO (qtp624124007-10916) [n:127.0.0.1:63411_solr c:testschemaapi s:shard1 r:core_node1 x:testschemaapi_shard1_replica1] o.a.s.r.RestManager Initializing RestManager with initArgs: {}
[junit4] 2> 1467940 INFO (qtp698945442-10928) [n:127.0.0.1:63407_solr c:testschemaapi s:shard1 r:core_node2 x:testschemaapi_shard1_replica2] o.a.s.r.ManagedResourceStorage Reading _rest_managed.json using ZooKeeperStorageIO:path=/configs/conf1
[junit4] 2> 1467940 INFO (qtp624124007-10916) [n:127.0.0.1:63411_solr c:testschemaapi s:shard1 r:core_node1 x:testschemaapi_shard1_replica1] o.a.s.r.ManagedResourceStorage Reading _rest_managed.json using ZooKeeperStorageIO:path=/configs/conf1
[junit4] 2> 1467941 INFO (qtp698945442-10928) [n:127.0.0.1:63407_solr c:testschemaapi s:shard1 r:core_node2 x:testschemaapi_shard1_replica2] o.a.s.r.ManagedResourceStorage No data found for znode /configs/conf1/_rest_managed.json
[junit4] 2> 1467941 INFO (qtp698945442-10928) [n:127.0.0.1:63407_solr c:testschemaapi s:shard1 r:core_node2 x:testschemaapi_shard1_replica2] o.a.s.r.ManagedResourceStorage Loaded null at path _rest_managed.json using ZooKeeperStorageIO:path=/configs/conf1
[junit4] 2> 1467941 INFO (qtp698945442-10928) [n:127.0.0.1:63407_solr c:testschemaapi s:shard1 r:core_node2 x:testschemaapi_shard1_replica2] o.a.s.r.RestManager Initializing 0 registered ManagedResources
[junit4] 2> 1467941 INFO (qtp624124007-10916) [n:127.0.0.1:63411_solr c:testschemaapi s:shard1 r:core_node1 x:testschemaapi_shard1_replica1] o.a.s.r.ManagedResourceStorage No data found for znode /configs/conf1/_rest_managed.json
[junit4] 2> 1467941 INFO (qtp698945442-10928) [n:127.0.0.1:63407_solr c:testschemaapi s:shard1 r:core_node2 x:testschemaapi_shard1_replica2] o.a.s.s.ZkIndexSchemaReader Creating ZooKeeper watch for the managed schema at /configs/conf1/managed-schema
[junit4] 2> 1467941 INFO (qtp624124007-10916) [n:127.0.0.1:63411_solr c:testschemaapi s:shard1 r:core_node1 x:testschemaapi_shard1_replica1] o.a.s.r.ManagedResourceStorage Loaded null at path _rest_managed.json using ZooKeeperStorageIO:path=/configs/conf1
[junit4] 2> 1467941 INFO (qtp624124007-10916) [n:127.0.0.1:63411_solr c:testschemaapi s:shard1 r:core_node1 x:testschemaapi_shard1_replica1] o.a.s.r.RestManager Initializing 0 registered ManagedResources
[junit4] 2> 1467941 INFO (qtp624124007-10916) [n:127.0.0.1:63411_solr c:testschemaapi s:shard1 r:core_node1 x:testschemaapi_shard1_replica1] o.a.s.s.ZkIndexSchemaReader Creating ZooKeeper watch for the managed schema at /configs/conf1/managed-schema
[junit4] 2> 1467942 INFO (qtp698945442-10928) [n:127.0.0.1:63407_solr c:testschemaapi s:shard1 r:core_node2 x:testschemaapi_shard1_replica2] o.a.s.c.ZkController Added new OnReconnect listener ZkIndexSchemaReader: /configs/conf1/managed-schema, uniqueCoreId: testschemaapi_shard1_replica2:165764988443637
[junit4] 2> 1467942 INFO (qtp698945442-10928) [n:127.0.0.1:63407_solr c:testschemaapi s:shard1 r:core_node2 x:testschemaapi_shard1_replica2] o.a.s.h.ReplicationHandler Commits will be reserved for 10000
[junit4] 2> 1467942 INFO (qtp624124007-10916) [n:127.0.0.1:63411_solr c:testschemaapi s:shard1 r:core_node1 x:testschemaapi_shard1_replica1] o.a.s.c.ZkController Added new OnReconnect listener ZkIndexSchemaReader: /configs/conf1/managed-schema, uniqueCoreId: testschemaapi_shard1_replica1:165764988563241
[junit4] 2> 1467942 INFO (searcherExecutor-4976-thread-1-processing-n:127.0.0.1:63407_solr x:testschemaapi_shard1_replica2 s:shard1 c:testschemaapi r:core_node2) [n:127.0.0.1:63407_solr c:testschemaapi s:shard1 r:core_node2 x:testschemaapi_shard1_replica2] o.a.s.c.SolrCore [testschemaapi_shard1_replica2] Registered new searcher Searcher@6a76bcf7[testschemaapi_shard1_replica2] main{ExitableDirectoryReader(UninvertingDirectoryReader())}
[junit4] 2> 1467942 INFO (qtp698945442-10928) [n:127.0.0.1:63407_solr c:testschemaapi s:shard1 r:core_node2 x:testschemaapi_shard1_replica2] o.a.s.u.UpdateLog Looking up max value of version field to seed version buckets
[junit4] 2> 1467942 INFO (qtp624124007-10916) [n:127.0.0.1:63411_solr c:testschemaapi s:shard1 r:core_node1 x:testschemaapi_shard1_replica1] o.a.s.h.ReplicationHandler Commits will be reserved for 10000
[junit4] 2> 1467942 INFO (qtp698945442-10928) [n:127.0.0.1:63407_solr c:testschemaapi s:shard1 r:core_node2 x:testschemaapi_shard1_replica2] o.a.s.u.VersionInfo Refreshing highest value of _version_ for 65536 version buckets from index
[junit4] 2> 1467942 INFO (qtp698945442-10928) [n:127.0.0.1:63407_solr c:testschemaapi s:shard1 r:core_node2 x:testschemaapi_shard1_replica2] o.a.s.u.VersionInfo No terms found for _version_, cannot seed version bucket highest value from index
[junit4] 2> 1467942 INFO (searcherExecutor-4977-thread-1-processing-n:127.0.0.1:63411_solr x:testschemaapi_shard1_replica1 s:shard1 c:testschemaapi r:core_node1) [n:127.0.0.1:63411_solr c:testschemaapi s:shard1 r:core_node1 x:testschemaapi_shard1_replica1] o.a.s.c.SolrCore [testschemaapi_shard1_replica1] Registered new searcher Searcher@5c7b5f8f[testschemaapi_shard1_replica1] main{ExitableDirectoryReader(UninvertingDirectoryReader())}
[junit4] 2> 1467942 INFO (qtp698945442-10928) [n:127.0.0.1:63407_solr c:testschemaapi s:shard1 r:core_node2 x:testschemaapi_shard1_replica2] o.a.s.u.UpdateLog Could not find max version in index or recent updates, using new clock 1545915003034402816
[junit4] 2> 1467942 INFO (qtp624124007-10916) [n:127.0.0.1:63411_solr c:testschemaapi s:shard1 r:core_node1 x:testschemaapi_shard1_replica1] o.a.s.u.UpdateLog Looking up max value of version field to seed version buckets
[junit4] 2> 1467942 INFO (qtp624124007-10916) [n:127.0.0.1:63411_solr c:testschemaapi s:shard1 r:core_node1 x:testschemaapi_shard1_replica1] o.a.s.u.VersionInfo Refreshing highest value of _version_ for 65536 version buckets from index
[junit4] 2> 1467942 INFO (qtp624124007-10916) [n:127.0.0.1:63411_solr c:testschemaapi s:shard1 r:core_node1 x:testschemaapi_shard1_replica1] o.a.s.u.VersionInfo No terms found for _version_, cannot seed version bucket highest value from index
[junit4] 2> 1467942 INFO (qtp624124007-10916) [n:127.0.0.1:63411_solr c:testschemaapi s:shard1 r:core_node1 x:testschemaapi_shard1_replica1] o.a.s.u.UpdateLog Could not find max version in index or recent updates, using new clock 1545915003034402816
[junit4] 2> 1467944 INFO (qtp698945442-10928) [n:127.0.0.1:63407_solr c:testschemaapi s:shard1 r:core_node2 x:testschemaapi_shard1_replica2] o.a.s.u.UpdateLog Took 1.0ms to seed version buckets with highest version 1545915003034402816
[junit4] 2> 1467944 INFO (qtp698945442-10928) [n:127.0.0.1:63407_solr c:testschemaapi s:shard1 r:core_node2 x:testschemaapi_shard1_replica2] o.a.s.c.ZkController watch zkdir /configs/conf1
[junit4] 2> 1467944 INFO (qtp624124007-10916) [n:127.0.0.1:63411_solr c:testschemaapi s:shard1 r:core_node1 x:testschemaapi_shard1_replica1] o.a.s.u.UpdateLog Took 1.0ms to seed version buckets with highest version 1545915003034402816
[junit4] 2> 1467944 INFO (qtp624124007-10916) [n:127.0.0.1:63411_solr c:testschemaapi s:shard1 r:core_node1 x:testschemaapi_shard1_replica1] o.a.s.c.ZkController watch zkdir /configs/conf1
[junit4] 2> 1467945 INFO (qtp698945442-10928) [n:127.0.0.1:63407_solr c:testschemaapi s:shard1 r:core_node2 x:testschemaapi_shard1_replica2] o.a.s.c.CoreContainer registering core: testschemaapi_shard1_replica2
[junit4] 2> 1467945 INFO (qtp624124007-10916) [n:127.0.0.1:63411_solr c:testschemaapi s:shard1 r:core_node1 x:testschemaapi_shard1_replica1] o.a.s.c.CoreContainer registering core: testschemaapi_shard1_replica1
[junit4] 2> 1467945 INFO (qtp698945442-10928) [n:127.0.0.1:63407_solr c:testschemaapi s:shard1 r:core_node2 x:testschemaapi_shard1_replica2] o.a.s.c.ZkController Register replica - core:testschemaapi_shard1_replica2 address:http://127.0.0.1:63407/solr collection:testschemaapi shard:shard1
[junit4] 2> 1467945 INFO (qtp624124007-10916) [n:127.0.0.1:63411_solr c:testschemaapi s:shard1 r:core_node1 x:testschemaapi_shard1_replica1] o.a.s.c.ZkController Register replica - core:testschemaapi_shard1_replica1 address:http://127.0.0.1:63411/solr collection:testschemaapi shard:shard1
[junit4] 2> 1467945 INFO (qtp698945442-10928) [n:127.0.0.1:63407_solr c:testschemaapi s:shard1 r:core_node2 x:testschemaapi_shard1_replica2] o.a.s.c.c.SolrZkClient makePath: /collections/testschemaapi/leader_elect/shard1/election
[junit4] 2> 1467947 INFO (qtp624124007-10916) [n:127.0.0.1:63411_solr c:testschemaapi s:shard1 r:core_node1 x:testschemaapi_shard1_replica1] o.a.s.c.c.SolrZkClient makePath: /collections/testschemaapi/leader_elect/shard1/election
[junit4] 2> 1467949 INFO (qtp698945442-10928) [n:127.0.0.1:63407_solr c:testschemaapi s:shard1 r:core_node2 x:testschemaapi_shard1_replica2] o.a.s.c.LeaderElector Joined leadership election with path: /collections/testschemaapi/leader_elect/shard1/election/96619687593377797-core_node2-n_0000000000
[junit4] 2> 1467949 INFO (qtp624124007-10916) [n:127.0.0.1:63411_solr c:testschemaapi s:shard1 r:core_node1 x:testschemaapi_shard1_replica1] o.a.s.c.LeaderElector Joined leadership election with path: /collections/testschemaapi/leader_elect/shard1/election/96619687593377798-core_node1-n_0000000001
[junit4] 2> 1467950 INFO (qtp698945442-10928) [n:127.0.0.1:63407_solr c:testschemaapi s:shard1 r:core_node2 x:testschemaapi_shard1_replica2] o.a.s.c.ShardLeaderElectionContext Running the leader process for shard=shard1 and weAreReplacement=false and leaderVoteWait=10000
[junit4] 2> 1467951 INFO (qtp624124007-10916) [n:127.0.0.1:63411_solr c:testschemaapi s:shard1 r:core_node1 x:testschemaapi_shard1_replica1] o.a.s.c.LeaderElector Watching path /collections/testschemaapi/leader_elect/shard1/election/96619687593377797-core_node2-n_0000000000 to know if I could be the leader
[junit4] 2> 1467951 INFO (qtp698945442-10928) [n:127.0.0.1:63407_solr c:testschemaapi s:shard1 r:core_node2 x:testschemaapi_shard1_replica2] o.a.s.c.ShardLeaderElectionContext Enough replicas found to continue.
[junit4] 2> 1467951 INFO (qtp698945442-10928) [n:127.0.0.1:63407_solr c:testschemaapi s:shard1 r:core_node2 x:testschemaapi_shard1_replica2] o.a.s.c.ShardLeaderElectionContext I may be the new leader - try and sync
[junit4] 2> 1467951 INFO (qtp698945442-10928) [n:127.0.0.1:63407_solr c:testschemaapi s:shard1 r:core_node2 x:testschemaapi_shard1_replica2] o.a.s.c.SyncStrategy Sync replicas to http://127.0.0.1:63407/solr/testschemaapi_shard1_replica2/
[junit4] 2> 1467951 INFO (qtp698945442-10928) [n:127.0.0.1:63407_solr c:testschemaapi s:shard1 r:core_node2 x:testschemaapi_shard1_replica2] o.a.s.u.PeerSync PeerSync: core=testschemaapi_shard1_replica2 url=http://127.0.0.1:63407/solr START replicas=[http://127.0.0.1:63411/solr/testschemaapi_shard1_replica1/] nUpdates=100
[junit4] 2> 1467952 INFO (qtp698945442-10928) [n:127.0.0.1:63407_solr c:testschemaapi s:shard1 r:core_node2 x:testschemaapi_shard1_replica2] o.a.s.u.PeerSync PeerSync: core=testschemaapi_shard1_replica2 url=http://127.0.0.1:63407/solr DONE. We have no versions. sync failed.
[junit4] 2> 1467952 INFO (qtp698945442-10928) [n:127.0.0.1:63407_solr c:testschemaapi s:shard1 r:core_node2 x:testschemaapi_shard1_replica2] o.a.s.c.SyncStrategy Leader's attempt to sync with shard failed, moving to the next candidate
[junit4] 2> 1467952 INFO (OverseerStateUpdate-96619687593377797-127.0.0.1:63407_solr-n_0000000000) [n:127.0.0.1:63407_solr ] o.a.s.c.Overseer processMessage: queueSize: 1, message = {
[junit4] 2> "operation":"leader",
[junit4] 2> "shard":"shard1",
[junit4] 2> "collection":"testschemaapi"} current state version: 0
[junit4] 2> 1467952 INFO (qtp698945442-10928) [n:127.0.0.1:63407_solr c:testschemaapi s:shard1 r:core_node2 x:testschemaapi_shard1_replica2] o.a.s.c.ShardLeaderElectionContext We failed sync, but we have no versions - we can't sync in that case - we were active before, so become leader anyway
[junit4] 2> 1467954 INFO (qtp698945442-10928) [n:127.0.0.1:63407_solr c:testschemaapi s:shard1 r:core_node2 x:testschemaapi_shard1_replica2] o.a.s.c.c.SolrZkClient makePath: /collections/testschemaapi/leaders/shard1
[junit4] 2> 1467956 INFO (qtp624124007-10914) [n:127.0.0.1:63411_solr c:testschemaapi s:shard1 r:core_node1 x:testschemaapi_shard1_replica1] o.a.s.c.S.Request [testschemaapi_shard1_replica1] webapp=/solr path=/get params={distrib=false&qt=/get&fingerprint=false&getVersions=100&wt=javabin&version=2} status=0 QTime=0
[junit4] 2> 1467957 INFO (qtp698945442-10928) [n:127.0.0.1:63407_solr c:testschemaapi s:shard1 r:core_node2 x:testschemaapi_shard1_replica2] o.a.s.c.ShardLeaderElectionContextBase Creating leader registration node /collections/testschemaapi/leaders/shard1/leader after winning as /collections/testschemaapi/leader_elect/shard1/election/96619687593377797-core_node2-n_0000000000
[junit4] 2> 1467961 INFO (qtp698945442-10928) [n:127.0.0.1:63407_solr c:testschemaapi s:shard1 r:core_node2 x:testschemaapi_shard1_replica2] o.a.s.c.ShardLeaderElectionContext I am the new leader: http://127.0.0.1:63407/solr/testschemaapi_shard1_replica2/ shard1
[junit4] 2> 1467962 INFO (OverseerStateUpdate-96619687593377797-127.0.0.1:63407_solr-n_0000000000) [n:127.0.0.1:63407_solr ] o.a.s.c.Overseer processMessage: queueSize: 1, message = {
[junit4] 2> "operation":"leader",
[junit4] 2> "shard":"shard1",
[junit4] 2> "collection":"testschemaapi",
[junit4] 2> "base_url":"http://127.0.0.1:63407/solr",
[junit4] 2> "core":"testschemaapi_shard1_replica2",
[junit4] 2> "state":"active"} current state version: 0
[junit4] 2> 1468064 INFO (OverseerStateUpdate-96619687593377797-127.0.0.1:63407_solr-n_0000000000) [n:127.0.0.1:63407_solr ] o.a.s.c.o.ZkStateWriter going to update_collection /collections/testschemaapi/state.json version: 1
[junit4] 2> 1468065 INFO (zkCallback-1793-thread-1-processing-n:127.0.0.1:63411_solr) [n:127.0.0.1:63411_solr ] o.a.s.c.c.ZkStateReader A cluster state change: [WatchedEvent state:SyncConnected type:NodeDataChanged path:/collections/testschemaapi/state.json] for collection [testschemaapi] has occurred - updating... (live nodes size: [2])
[junit4] 2> 1468065 INFO (zkCallback-1792-thread-3-processing-n:127.0.0.1:63407_solr) [n:127.0.0.1:63407_solr ] o.a.s.c.c.ZkStateReader A cluster state change: [WatchedEvent state:SyncConnected type:NodeDataChanged path:/collections/testschemaapi/state.json] for collection [testschemaapi] has occurred - updating... (live nodes size: [2])
[junit4] 2> 1468065 INFO (zkCallback-1793-thread-1-processing-n:127.0.0.1:63411_solr) [n:127.0.0.1:63411_solr ] o.a.s.c.c.ZkStateReader Updating data for [testschemaapi] from [1] to [2]
[junit4] 2> 1468065 INFO (zkCallback-1792-thread-3-processing-n:127.0.0.1:63407_solr) [n:127.0.0.1:63407_solr ] o.a.s.c.c.ZkStateReader Updating data for [testschemaapi] from [1] to [2]
[junit4] 2> 1468113 INFO (qtp698945442-10928) [n:127.0.0.1:63407_solr c:testschemaapi s:shard1 r:core_node2 x:testschemaapi_shard1_replica2] o.a.s.c.ZkController We are http://127.0.0.1:63407/solr/testschemaapi_shard1_replica2/ and leader is http://127.0.0.1:63407/solr/testschemaapi_shard1_replica2/
[junit4] 2> 1468113 INFO (qtp698945442-10928) [n:127.0.0.1:63407_solr c:testschemaapi s:shard1 r:core_node2 x:testschemaapi_shard1_replica2] o.a.s.c.ZkController No LogReplay needed for core=testschemaapi_shard1_replica2 baseURL=http://127.0.0.1:63407/solr
[junit4] 2> 1468113 INFO (qtp698945442-10928) [n:127.0.0.1:63407_solr c:testschemaapi s:shard1 r:core_node2 x:testschemaapi_shard1_replica2] o.a.s.c.ZkController I am the leader, no recovery necessary
[junit4] 2> 1468113 INFO (qtp698945442-10928) [n:127.0.0.1:63407_solr c:testschemaapi s:shard1 r:core_node2 x:testschemaapi_shard1_replica2] o.a.s.c.ZkController publishing state=active
[junit4] 2> 1468114 INFO (qtp698945442-10928) [n:127.0.0.1:63407_solr c:testschemaapi s:shard1 r:core_node2 x:testschemaapi_shard1_replica2] o.a.s.c.c.ZkStateReader Forcing refresh of watched collection state for testschemaapi
[junit4] 2> 1468115 INFO (OverseerStateUpdate-96619687593377797-127.0.0.1:63407_solr-n_0000000000) [n:127.0.0.1:63407_solr ] o.a.s.c.Overseer processMessage: queueSize: 1, message = {
[junit4] 2> "core":"testschemaapi_shard1_replica2",
[junit4] 2> "core_node_name":"core_node2",
[junit4] 2> "roles":null,
[junit4] 2> "base_url":"http://127.0.0.1:63407/solr",
[junit4] 2> "node_name":"127.0.0.1:63407_solr",
[junit4] 2> "numShards":"1",
[junit4] 2> "state":"active",
[junit4] 2> "shard":"shard1",
[junit4] 2> "collection":"testschemaapi",
[junit4] 2> "operation":"state"} current state version: 0
[junit4] 2> 1468115 INFO (OverseerStateUpdate-96619687593377797-127.0.0.1:63407_solr-n_0000000000) [n:127.0.0.1:63407_solr ] o.a.s.c.o.ReplicaMutator Update state numShards=1 message={
[junit4] 2> "core":"testschemaapi_shard1_replica2",
[junit4] 2> "core_node_name":"core_node2",
[junit4] 2> "roles":null,
[junit4] 2> "base_url":"http://127.0.0.1:63407/solr",
[junit4] 2> "node_name":"127.0.0.1:63407_solr",
[junit4] 2> "numShards":"1",
[junit4] 2> "state":"active",
[junit4] 2> "shard":"shard1",
[junit4] 2> "collection":"testschemaapi",
[junit4] 2> "operation":"state"}
[junit4] 2> 1468117 INFO (qtp698945442-10928) [n:127.0.0.1:63407_solr c:testschemaapi
[...truncated too long message...]
d1 r:core_node1 x:testschemaapi_shard1_replica1] o.a.s.c.SolrCore [testschemaapi_shard1_replica1] Closing main searcher on request.
[junit4] 2> 1478348 INFO (Thread-2809) [n:127.0.0.1:63411_solr c:testschemaapi s:shard1 r:core_node1 x:testschemaapi_shard1_replica1] o.a.s.c.CachingDirectoryFactory Closing MockDirectoryFactory - 3 directories currently being tracked
[junit4] 2> 1478348 INFO (Thread-2809) [n:127.0.0.1:63411_solr c:testschemaapi s:shard1 r:core_node1 x:testschemaapi_shard1_replica1] o.a.s.c.CachingDirectoryFactory looking to close C:\Users\jenkins\workspace\Lucene-Solr-6.2-Windows\solr\build\solr-core\test\J1\temp\solr.schema.TestManagedSchemaAPI_48109BEB7F21738A-001\tempDir-001\node2\.\testschemaapi_shard1_replica1\data\snapshot_metadata [CachedDir<<refCount=0;path=C:\Users\jenkins\workspace\Lucene-Solr-6.2-Windows\solr\build\solr-core\test\J1\temp\solr.schema.TestManagedSchemaAPI_48109BEB7F21738A-001\tempDir-001\node2\.\testschemaapi_shard1_replica1\data\snapshot_metadata;done=false>>]
[junit4] 2> 1478348 INFO (Thread-2809) [n:127.0.0.1:63411_solr c:testschemaapi s:shard1 r:core_node1 x:testschemaapi_shard1_replica1] o.a.s.c.CachingDirectoryFactory Closing directory, CoreContainer#isShutdown=true
[junit4] 2> 1478348 INFO (Thread-2809) [n:127.0.0.1:63411_solr c:testschemaapi s:shard1 r:core_node1 x:testschemaapi_shard1_replica1] o.a.s.c.CachingDirectoryFactory Closing directory: C:\Users\jenkins\workspace\Lucene-Solr-6.2-Windows\solr\build\solr-core\test\J1\temp\solr.schema.TestManagedSchemaAPI_48109BEB7F21738A-001\tempDir-001\node2\.\testschemaapi_shard1_replica1\data\snapshot_metadata
[junit4] 2> 1478348 INFO (Thread-2809) [n:127.0.0.1:63411_solr c:testschemaapi s:shard1 r:core_node1 x:testschemaapi_shard1_replica1] o.a.s.c.CachingDirectoryFactory looking to close C:\Users\jenkins\workspace\Lucene-Solr-6.2-Windows\solr\build\solr-core\test\J1\temp\solr.schema.TestManagedSchemaAPI_48109BEB7F21738A-001\tempDir-001\node2\.\testschemaapi_shard1_replica1\data\ [CachedDir<<refCount=0;path=C:\Users\jenkins\workspace\Lucene-Solr-6.2-Windows\solr\build\solr-core\test\J1\temp\solr.schema.TestManagedSchemaAPI_48109BEB7F21738A-001\tempDir-001\node2\.\testschemaapi_shard1_replica1\data\;done=false>>]
[junit4] 2> 1478348 INFO (Thread-2809) [n:127.0.0.1:63411_solr c:testschemaapi s:shard1 r:core_node1 x:testschemaapi_shard1_replica1] o.a.s.c.CachingDirectoryFactory Closing directory, CoreContainer#isShutdown=true
[junit4] 2> 1478348 INFO (Thread-2809) [n:127.0.0.1:63411_solr c:testschemaapi s:shard1 r:core_node1 x:testschemaapi_shard1_replica1] o.a.s.c.CachingDirectoryFactory Closing directory: C:\Users\jenkins\workspace\Lucene-Solr-6.2-Windows\solr\build\solr-core\test\J1\temp\solr.schema.TestManagedSchemaAPI_48109BEB7F21738A-001\tempDir-001\node2\.\testschemaapi_shard1_replica1\data\
[junit4] 2> 1478348 INFO (Thread-2809) [n:127.0.0.1:63411_solr c:testschemaapi s:shard1 r:core_node1 x:testschemaapi_shard1_replica1] o.a.s.c.CachingDirectoryFactory looking to close C:\Users\jenkins\workspace\Lucene-Solr-6.2-Windows\solr\build\solr-core\test\J1\temp\solr.schema.TestManagedSchemaAPI_48109BEB7F21738A-001\tempDir-001\node2\.\testschemaapi_shard1_replica1\data\index [CachedDir<<refCount=0;path=C:\Users\jenkins\workspace\Lucene-Solr-6.2-Windows\solr\build\solr-core\test\J1\temp\solr.schema.TestManagedSchemaAPI_48109BEB7F21738A-001\tempDir-001\node2\.\testschemaapi_shard1_replica1\data\index;done=false>>]
[junit4] 2> 1478348 INFO (Thread-2809) [n:127.0.0.1:63411_solr c:testschemaapi s:shard1 r:core_node1 x:testschemaapi_shard1_replica1] o.a.s.c.CachingDirectoryFactory Closing directory, CoreContainer#isShutdown=true
[junit4] 2> 1478348 INFO (Thread-2809) [n:127.0.0.1:63411_solr c:testschemaapi s:shard1 r:core_node1 x:testschemaapi_shard1_replica1] o.a.s.c.CachingDirectoryFactory Closing directory: C:\Users\jenkins\workspace\Lucene-Solr-6.2-Windows\solr\build\solr-core\test\J1\temp\solr.schema.TestManagedSchemaAPI_48109BEB7F21738A-001\tempDir-001\node2\.\testschemaapi_shard1_replica1\data\index
[junit4] 2> 1478349 WARN (Thread-2809) [n:127.0.0.1:63411_solr c:testschemaapi s:shard1 r:core_node1 x:testschemaapi_shard1_replica1] o.a.s.c.ZkController listener throws error
[junit4] 2> org.apache.solr.common.SolrException: Unable to reload core [testschemaapi_shard1_replica1]
[junit4] 2> at org.apache.solr.core.CoreContainer.reload(CoreContainer.java:946)
[junit4] 2> at org.apache.solr.core.SolrCore.lambda$getConfListener$6(SolrCore.java:2578)
[junit4] 2> at org.apache.solr.cloud.ZkController.lambda$fireEventListeners$3(ZkController.java:2443)
[junit4] 2> at java.lang.Thread.run(Thread.java:745)
[junit4] 2> Caused by: org.apache.solr.common.SolrException: Could not find config name for collection:testschemaapi
[junit4] 2> at org.apache.solr.core.SolrCore.<init>(SolrCore.java:815)
[junit4] 2> at org.apache.solr.core.SolrCore.reload(SolrCore.java:503)
[junit4] 2> at org.apache.solr.core.CoreContainer.reload(CoreContainer.java:940)
[junit4] 2> ... 3 more
[junit4] 2> Caused by: org.apache.solr.common.SolrException: Could not find config name for collection:testschemaapi
[junit4] 2> at org.apache.solr.rest.ManagedResourceStorage.newStorageIO(ManagedResourceStorage.java:101)
[junit4] 2> at org.apache.solr.core.SolrCore.initRestManager(SolrCore.java:2358)
[junit4] 2> at org.apache.solr.core.SolrCore.<init>(SolrCore.java:791)
[junit4] 2> ... 5 more
[junit4] 2> Sep 19, 2016 3:37:24 PM com.carrotsearch.randomizedtesting.ThreadLeakControl checkThreadLeaks
[junit4] 2> WARNING: Will linger awaiting termination of 4 leaked thread(s).
[junit4] 2> NOTE: test params are: codec=FastCompressingStoredFields(storedFieldsFormat=CompressingStoredFieldsFormat(compressionMode=FAST, chunkSize=7, maxDocsPerChunk=223, blockSize=810), termVectorsFormat=CompressingTermVectorsFormat(compressionMode=FAST, chunkSize=7, blockSize=810)), sim=ClassicSimilarity, locale=ar-SA, timezone=Europe/Andorra
[junit4] 2> NOTE: Windows 10 10.0 amd64/Oracle Corporation 1.8.0_102 (64-bit)/cpus=3,threads=1,free=87205944,total=351952896
[junit4] 2> NOTE: All tests run in this JVM: [TermVectorComponentTest, DistribDocExpirationUpdateProcessorTest, RAMDirectoryFactoryTest, TestLRUStatsCache, TestPKIAuthenticationPlugin, ConvertedLegacyTest, TestCollationFieldDocValues, DateMathParserTest, HighlighterConfigTest, TestRecovery, TestInfoStreamLogging, TestNumericTerms32, TestFieldCacheSortRandom, OverseerModifyCollectionTest, SolrIndexSplitterTest, InfoHandlerTest, ReplaceNodeTest, OpenCloseCoreStressTest, CoreAdminHandlerTest, CdcrRequestHandlerTest, TestSearcherReuse, TestSubQueryTransformerCrossCore, AutoCommitTest, TestCloudDeleteByQuery, TestSolrJ, DistributedIntervalFacetingTest, TestCharFilters, ConnectionManagerTest, CloudExitableDirectoryReaderTest, IndexSchemaRuntimeFieldTest, TestSolrDynamicMBean, TestMaxScoreQueryParser, ConnectionReuseTest, HdfsLockFactoryTest, DefaultValueUpdateProcessorTest, LeaderFailoverAfterPartitionTest, DistributedFacetPivotLongTailTest, TestRealTimeGet, TestSchemaVersionResource, DirectSolrConnectionTest, TestFuzzyAnalyzedSuggestions, UpdateRequestProcessorFactoryTest, MinimalSchemaTest, TestStressRecovery, TestQueryUtils, WordBreakSolrSpellCheckerTest, TestExactSharedStatsCache, TestJsonFacets, ZkStateReaderTest, CopyFieldTest, TestXmlQParser, TestDefaultStatsCache, TestCryptoKeys, SpellingQueryConverterTest, TestFieldCacheSanityChecker, TestCustomSort, SortByFunctionTest, TestHashQParserPlugin, AliasIntegrationTest, PluginInfoTest, DistributedTermsComponentTest, TestFoldingMultitermQuery, TestSolrCoreProperties, IgnoreCommitOptimizeUpdateProcessorFactoryTest, ChaosMonkeySafeLeaderTest, TestSolrQueryParserDefaultOperatorResource, DistanceFunctionTest, TestIndexingPerformance, TestConfigSetsAPIExclusivity, TestReload, SignatureUpdateProcessorFactoryTest, CSVRequestHandlerTest, ShardSplitTest, TestWriterPerf, TestScoreJoinQPScore, TestDistributedMissingSort, TestFilteredDocIdSet, TestAtomicUpdateErrorCases, DistributedQueueTest, TestSha256AuthenticationProvider, TestBinaryResponseWriter, ShardRoutingCustomTest, TestSimpleTrackingShardHandler, TestRestManager, DateFieldTest, NoCacheHeaderTest, TestAddFieldRealTimeGet, TestRebalanceLeaders, TestMiniSolrCloudClusterSSL, BasicDistributedZk2Test, BinaryUpdateRequestHandlerTest, SolrCLIZkUtilsTest, QueryResultKeyTest, TestSchemaResource, TestRTimerTree, HdfsRecoverLeaseTest, RulesTest, SuggesterTest, TestCSVResponseWriter, TestBadConfig, PKIAuthenticationIntegrationTest, TestMiniSolrCloudClusterBase, TestCrossCoreJoin, DistributedSuggestComponentTest, TestCollapseQParserPlugin, TestBM25SimilarityFactory, CollectionsAPIAsyncDistributedZkTest, TestDynamicFieldResource, VersionInfoTest, TestReqParamsAPI, TestManagedSchemaAPI]
[junit4] 2> NOTE: reproduce with: ant test -Dtestcase=TestManagedSchemaAPI -Dtests.seed=48109BEB7F21738A -Dtests.slow=true -Dtests.locale=ar-SA -Dtests.timezone=Europe/Andorra -Dtests.asserts=true -Dtests.file.encoding=Cp1252
[junit4] ERROR 0.00s J1 | TestManagedSchemaAPI (suite) <<<
[junit4] > Throwable #1: java.lang.AssertionError: ObjectTracker found 10 object(s) that were not released!!! [TransactionLog, MockDirectoryWrapper, MDCAwareThreadPoolExecutor, MockDirectoryWrapper, MockDirectoryWrapper, MDCAwareThreadPoolExecutor, MockDirectoryWrapper, MockDirectoryWrapper, MockDirectoryWrapper, TransactionLog]
[junit4] > at __randomizedtesting.SeedInfo.seed([48109BEB7F21738A]:0)
[junit4] > at org.apache.solr.SolrTestCaseJ4.teardownTestCases(SolrTestCaseJ4.java:258)
[junit4] > at java.lang.Thread.run(Thread.java:745)
[junit4] Completed [279/629 (1!)] on J1 in 12.91s, 1 test, 1 failure <<< FAILURES!
[...truncated 61355 lines...]