You are viewing a plain text version of this content. The canonical link for it is here.
Posted to dev@lucene.apache.org by Apache Hudson Server <hu...@hudson.apache.org> on 2011/03/11 22:07:17 UTC
[HUDSON] Lucene-Solr-tests-only-trunk - Build # 5823 - Still
Failing
Build: https://hudson.apache.org/hudson/job/Lucene-Solr-tests-only-trunk/5823/
2 tests failed.
FAILED: org.apache.solr.update.DirectUpdateHandlerOptimizeTest.testWatchChildren
Error Message:
Forked Java VM exited abnormally. Please note the time in the report does not reflect the time until the VM exit.
Stack Trace:
junit.framework.AssertionFailedError: Forked Java VM exited abnormally. Please note the time in the report does not reflect the time until the VM exit.
at java.lang.Thread.run(Thread.java:636)
FAILED: TEST-org.apache.solr.cloud.ZkSolrClientTest.xml.<init>
Error Message:
Stack Trace:
Test report file /home/hudson/hudson-slave/workspace/Lucene-Solr-tests-only-trunk/checkout/solr/build/test-results/TEST-org.apache.solr.cloud.ZkSolrClientTest.xml was length 0
Build Log (for compile errors):
[...truncated 8479 lines...]
---------------------------------------------------------------------
To unsubscribe, e-mail: dev-unsubscribe@lucene.apache.org
For additional commands, e-mail: dev-help@lucene.apache.org
[HUDSON] Lucene-Solr-tests-only-trunk - Build # 5826 - Still
Failing
Posted by Apache Hudson Server <hu...@hudson.apache.org>.
Build: https://hudson.apache.org/hudson/job/Lucene-Solr-tests-only-trunk/5826/
2 tests failed.
FAILED: org.apache.solr.update.DirectUpdateHandlerOptimizeTest.testWatchChildren
Error Message:
Forked Java VM exited abnormally. Please note the time in the report does not reflect the time until the VM exit.
Stack Trace:
junit.framework.AssertionFailedError: Forked Java VM exited abnormally. Please note the time in the report does not reflect the time until the VM exit.
at java.lang.Thread.run(Thread.java:636)
FAILED: TEST-org.apache.solr.cloud.ZkSolrClientTest.xml.<init>
Error Message:
Stack Trace:
Test report file /home/hudson/hudson-slave/workspace/Lucene-Solr-tests-only-trunk/checkout/solr/build/test-results/TEST-org.apache.solr.cloud.ZkSolrClientTest.xml was length 0
Build Log (for compile errors):
[...truncated 8495 lines...]
---------------------------------------------------------------------
To unsubscribe, e-mail: dev-unsubscribe@lucene.apache.org
For additional commands, e-mail: dev-help@lucene.apache.org
[HUDSON] Lucene-Solr-tests-only-trunk - Build # 5825 - Still
Failing
Posted by Apache Hudson Server <hu...@hudson.apache.org>.
Build: https://hudson.apache.org/hudson/job/Lucene-Solr-tests-only-trunk/5825/
2 tests failed.
FAILED: org.apache.solr.update.DirectUpdateHandlerOptimizeTest.testWatchChildren
Error Message:
Forked Java VM exited abnormally. Please note the time in the report does not reflect the time until the VM exit.
Stack Trace:
junit.framework.AssertionFailedError: Forked Java VM exited abnormally. Please note the time in the report does not reflect the time until the VM exit.
at java.lang.Thread.run(Thread.java:636)
FAILED: TEST-org.apache.solr.cloud.ZkSolrClientTest.xml.<init>
Error Message:
Stack Trace:
Test report file /home/hudson/hudson-slave/workspace/Lucene-Solr-tests-only-trunk/checkout/solr/build/test-results/TEST-org.apache.solr.cloud.ZkSolrClientTest.xml was length 0
Build Log (for compile errors):
[...truncated 8477 lines...]
---------------------------------------------------------------------
To unsubscribe, e-mail: dev-unsubscribe@lucene.apache.org
For additional commands, e-mail: dev-help@lucene.apache.org
[HUDSON] Lucene-Solr-tests-only-trunk - Build # 5824 - Still
Failing
Posted by Apache Hudson Server <hu...@hudson.apache.org>.
Build: https://hudson.apache.org/hudson/job/Lucene-Solr-tests-only-trunk/5824/
2 tests failed.
FAILED: org.apache.solr.update.DirectUpdateHandlerOptimizeTest.testWatchChildren
Error Message:
Forked Java VM exited abnormally. Please note the time in the report does not reflect the time until the VM exit.
Stack Trace:
junit.framework.AssertionFailedError: Forked Java VM exited abnormally. Please note the time in the report does not reflect the time until the VM exit.
at java.lang.Thread.run(Thread.java:636)
FAILED: TEST-org.apache.solr.cloud.ZkSolrClientTest.xml.<init>
Error Message:
Stack Trace:
Test report file /home/hudson/hudson-slave/workspace/Lucene-Solr-tests-only-trunk/checkout/solr/build/test-results/TEST-org.apache.solr.cloud.ZkSolrClientTest.xml was length 0
Build Log (for compile errors):
[...truncated 8477 lines...]
---------------------------------------------------------------------
To unsubscribe, e-mail: dev-unsubscribe@lucene.apache.org
For additional commands, e-mail: dev-help@lucene.apache.org