You are viewing a plain text version of this content. The canonical link for it is here.
Posted to dev@geronimo.apache.org by ga...@apache.org on 2008/12/31 17:19:56 UTC
[BUILD] trunk: Failed for Revision: 730401
Geronimo Revision: 730401 built with tests included
See the full build-0900.log file at http://people.apache.org/builds/geronimo/server/binaries/trunk/20081231/build-0900.log
Download the binaries from http://people.apache.org/builds/geronimo/server/binaries/trunk/20081231
[INFO] BUILD SUCCESSFUL
[INFO] ------------------------------------------------------------------------
[INFO] Total time: 38 minutes 47 seconds
[INFO] Finished at: Wed Dec 31 09:43:25 EST 2008
[INFO] Final Memory: 390M/1013M
[INFO] ------------------------------------------------------------------------
TESTSUITE RESULTS (Failures only)
=================================
See detailed results at http://people.apache.org/builds/geronimo/server/testsuite/ResultsSummary.html
Assembly: tomcat
=================================
See the full test.log file at http://people.apache.org/builds/geronimo/server/binaries/trunk/20081231/logs-0900-tomcat/test.log
[INFO] snapshot org.apache.geronimo.assemblies:geronimo-tomcat6-javaee5:2.2-SNAPSHOT: checking for updates from codehaus-snapshots
[INFO] Using assembly artifact: org.apache.geronimo.assemblies:geronimo-tomcat6-javaee5:zip:bin:2.2-SNAPSHOT:provided
[INFO] Using geronimoHome: /home/geronimo/geronimo/trunk/testsuite/target/geronimo-tomcat6-javaee5-2.2-SNAPSHOT
[INFO] Installing assembly...
[INFO] Expanding: /home/geronimo/.m2/repository/org/apache/geronimo/assemblies/geronimo-tomcat6-javaee5/2.2-SNAPSHOT/geronimo-tomcat6-javaee5-2.2-SNAPSHOT-bin.zip into /home/geronimo/geronimo/trunk/testsuite/target
[INFO] Starting Geronimo server...
[INFO] Selected option set: default
[INFO] Redirecting output to: /home/geronimo/geronimo/trunk/testsuite/target/geronimo-logs/org.apache.geronimo.mavenplugins.geronimo.server.StartServerMojo.log
[INFO] Waiting for Geronimo server...
[INFO] Geronimo server started in 0:00:45.972
[INFO] [shitty:install {execution: default}]
[INFO] Installing /home/geronimo/geronimo/trunk/testsuite/pom.xml to /home/geronimo/.m2/repository/org/apache/geronimo/testsuite/testsuite/2.2-SNAPSHOT/testsuite-2.2-SNAPSHOT.pom
[INFO] [shitty:test {execution: default}]
[INFO] Starting 35 test builds
[INFO]
[INFO] -------------------------------------------------------------------------------
[INFO]
[INFO] commands-testsuite/deploy RUNNING
[INFO] commands-testsuite/deploy SUCCESS (0:01:10.559)
[INFO] commands-testsuite/gshell RUNNING
[INFO] commands-testsuite/gshell SUCCESS (0:00:29.688)
[INFO] commands-testsuite/jaxws RUNNING
[INFO] commands-testsuite/jaxws SUCCESS (0:00:36.910)
[INFO] commands-testsuite/shutdown RUNNING
[INFO] commands-testsuite/shutdown SUCCESS (0:00:15.947)
[INFO] concurrent-testsuite/concurrent-basic RUNNING
[INFO] concurrent-testsuite/concurrent-basic SUCCESS (0:06:12.360)
[INFO] console-testsuite/advanced RUNNING
[INFO] console-testsuite/advanced FAILURE (0:00:58.921) Java returned: 1
[INFO] console-testsuite/basic RUNNING
[INFO] console-testsuite/basic FAILURE (0:01:36.633) Java returned: 1
[INFO] corba-testsuite/corba-helloworld RUNNING
[INFO] corba-testsuite/corba-helloworld SUCCESS (0:00:46.685)
[INFO] corba-testsuite/corba-marshal RUNNING
[INFO] corba-testsuite/corba-marshal SUCCESS (0:00:56.218)
[INFO] corba-testsuite/corba-mytime RUNNING
[INFO] corba-testsuite/corba-mytime SUCCESS (0:00:45.604)
[INFO] deployment-testsuite/deployment-tests RUNNING
[INFO] deployment-testsuite/deployment-tests SUCCESS (0:00:30.898)
[INFO] deployment-testsuite/jca-cms-tests RUNNING
[INFO] deployment-testsuite/jca-cms-tests SUCCESS (0:00:27.497)
[INFO] deployment-testsuite/manifestcp-tests RUNNING
[INFO] deployment-testsuite/manifestcp-tests SUCCESS (0:00:29.542)
[INFO] enterprise-testsuite/ejb-tests RUNNING
[INFO] enterprise-testsuite/ejb-tests SUCCESS (0:00:47.462)
[INFO] enterprise-testsuite/jms-tests RUNNING
[INFO] enterprise-testsuite/jms-tests FAILURE (0:00:40.042) Java returned: 1
[INFO] enterprise-testsuite/jpa-tests RUNNING
[INFO] enterprise-testsuite/jpa-tests SUCCESS (0:00:50.982)
[INFO] enterprise-testsuite/sec-client RUNNING
[INFO] enterprise-testsuite/sec-client SUCCESS (0:00:26.675)
[INFO] enterprise-testsuite/sec-tests RUNNING
[INFO] enterprise-testsuite/sec-tests SUCCESS (0:00:50.764)
[INFO] security-testsuite/test-security RUNNING
[INFO] security-testsuite/test-security SUCCESS (0:00:40.973)
[INFO] web-testsuite/test-2.1-jsps RUNNING
[INFO] web-testsuite/test-2.1-jsps SUCCESS (0:00:36.856)
[INFO] web-testsuite/test-2.5-servlets RUNNING
[INFO] web-testsuite/test-2.5-servlets SUCCESS (0:00:26.031)
[INFO] web-testsuite/test-myfaces RUNNING
[INFO] web-testsuite/test-myfaces SUCCESS (0:00:33.681)
[INFO] web-testsuite/test-tomcat RUNNING
[INFO] web-testsuite/test-tomcat SUCCESS (0:00:19.875)
[INFO] web-testsuite/test-web-forward RUNNING
[INFO] web-testsuite/test-web-forward SUCCESS (0:00:32.594)
[INFO] web-testsuite/test-web-references RUNNING
[INFO] web-testsuite/test-web-references SUCCESS (0:00:37.582)
[INFO] webservices-testsuite/jaxb-tests RUNNING
[INFO] webservices-testsuite/jaxb-tests SUCCESS (0:00:51.641)
[INFO] webservices-testsuite/jaxr-tests RUNNING
[INFO] webservices-testsuite/jaxr-tests SUCCESS (0:00:49.470)
[INFO] webservices-testsuite/jaxrpc-jaxws-tests RUNNING
[INFO] webservices-testsuite/jaxrpc-jaxws-tests SUCCESS (0:00:31.198)
[INFO] webservices-testsuite/jaxrpc-tests RUNNING
[INFO] webservices-testsuite/jaxrpc-tests SUCCESS (0:00:38.309)
[INFO] webservices-testsuite/jaxws-mtom-tests RUNNING
[INFO] webservices-testsuite/jaxws-mtom-tests SUCCESS (0:00:45.875)
[INFO] webservices-testsuite/jaxws-provider-tests RUNNING
[INFO] webservices-testsuite/jaxws-provider-tests SUCCESS (0:00:46.332)
[INFO] webservices-testsuite/jaxws-tests RUNNING
[INFO] webservices-testsuite/jaxws-tests SUCCESS (0:04:44.516)
[INFO] webservices-testsuite/jaxws-wsa-tests RUNNING
[INFO] webservices-testsuite/jaxws-wsa-tests SUCCESS (0:00:49.448)
[INFO] webservices-testsuite/saaj-tests RUNNING
[INFO] webservices-testsuite/saaj-tests SUCCESS (0:00:37.759)
[INFO] webservices-testsuite/stax-tests RUNNING
[INFO] webservices-testsuite/stax-tests SUCCESS (0:00:51.158)
[INFO]
[INFO] -------------------------------------------------------------------------------
[INFO] Test Summary (0:34:06.888)
[INFO] Passed: 32
[INFO] Failed: 3
[INFO] -------------------------------------------------------------------------------
[INFO]
[INFO] The following tests failed:
[INFO] * console-testsuite/advanced - /home/geronimo/geronimo/trunk/testsuite/console-testsuite/advanced/build.log
[INFO] * console-testsuite/basic - /home/geronimo/geronimo/trunk/testsuite/console-testsuite/basic/build.log
[INFO] * enterprise-testsuite/jms-tests - /home/geronimo/geronimo/trunk/testsuite/enterprise-testsuite/jms-tests/build.log
[INFO]
[INFO] ------------------------------------------------------------------------
[ERROR] BUILD ERROR
Assembly: jetty
=================================
See the full test.log file at http://people.apache.org/builds/geronimo/server/binaries/trunk/20081231/logs-0900-jetty/test.log
[INFO] snapshot org.apache.geronimo.assemblies:geronimo-jetty6-javaee5:2.2-SNAPSHOT: checking for updates from codehaus-snapshots
[INFO] Using assembly artifact: org.apache.geronimo.assemblies:geronimo-jetty6-javaee5:zip:bin:2.2-SNAPSHOT:provided
[INFO] Using geronimoHome: /home/geronimo/geronimo/trunk/testsuite/target/geronimo-jetty6-javaee5-2.2-SNAPSHOT
[INFO] Installing assembly...
[INFO] Expanding: /home/geronimo/.m2/repository/org/apache/geronimo/assemblies/geronimo-jetty6-javaee5/2.2-SNAPSHOT/geronimo-jetty6-javaee5-2.2-SNAPSHOT-bin.zip into /home/geronimo/geronimo/trunk/testsuite/target
[INFO] Starting Geronimo server...
[INFO] Selected option set: default
[INFO] Redirecting output to: /home/geronimo/geronimo/trunk/testsuite/target/geronimo-logs/org.apache.geronimo.mavenplugins.geronimo.server.StartServerMojo.log
[INFO] Waiting for Geronimo server...
[INFO] Geronimo server started in 0:00:47.511
[INFO] [shitty:install {execution: default}]
[INFO] Installing /home/geronimo/geronimo/trunk/testsuite/pom.xml to /home/geronimo/.m2/repository/org/apache/geronimo/testsuite/testsuite/2.2-SNAPSHOT/testsuite-2.2-SNAPSHOT.pom
[INFO] [shitty:test {execution: default}]
[INFO] Starting 35 test builds
[INFO]
[INFO] -------------------------------------------------------------------------------
[INFO]
[INFO] commands-testsuite/deploy RUNNING
[INFO] commands-testsuite/deploy SUCCESS (0:01:10.442)
[INFO] commands-testsuite/gshell RUNNING
[INFO] commands-testsuite/gshell SUCCESS (0:00:30.972)
[INFO] commands-testsuite/jaxws RUNNING
[INFO] commands-testsuite/jaxws SUCCESS (0:00:35.951)
[INFO] commands-testsuite/shutdown RUNNING
[INFO] commands-testsuite/shutdown SUCCESS (0:00:16.240)
[INFO] concurrent-testsuite/concurrent-basic RUNNING
[INFO] concurrent-testsuite/concurrent-basic SUCCESS (0:06:08.210)
[INFO] console-testsuite/advanced RUNNING
[INFO] console-testsuite/advanced FAILURE (0:00:57.114) Java returned: 1
[INFO] console-testsuite/basic RUNNING
[INFO] console-testsuite/basic FAILURE (0:01:43.442) Java returned: 1
[INFO] corba-testsuite/corba-helloworld RUNNING
[INFO] corba-testsuite/corba-helloworld SUCCESS (0:00:44.755)
[INFO] corba-testsuite/corba-marshal RUNNING
[INFO] corba-testsuite/corba-marshal SUCCESS (0:01:03.654)
[INFO] corba-testsuite/corba-mytime RUNNING
[INFO] corba-testsuite/corba-mytime SUCCESS (0:00:46.606)
[INFO] deployment-testsuite/deployment-tests RUNNING
[INFO] deployment-testsuite/deployment-tests SUCCESS (0:00:30.224)
[INFO] deployment-testsuite/jca-cms-tests RUNNING
[INFO] deployment-testsuite/jca-cms-tests SUCCESS (0:00:28.328)
[INFO] deployment-testsuite/manifestcp-tests RUNNING
[INFO] deployment-testsuite/manifestcp-tests SUCCESS (0:00:30.048)
[INFO] enterprise-testsuite/ejb-tests RUNNING
[INFO] enterprise-testsuite/ejb-tests SUCCESS (0:00:34.535)
[INFO] enterprise-testsuite/jms-tests RUNNING
[INFO] enterprise-testsuite/jms-tests FAILURE (0:00:39.885) Java returned: 1
[INFO] enterprise-testsuite/jpa-tests RUNNING
[INFO] enterprise-testsuite/jpa-tests SUCCESS (0:00:40.251)
[INFO] enterprise-testsuite/sec-client RUNNING
[INFO] enterprise-testsuite/sec-client SUCCESS (0:00:27.412)
[INFO] enterprise-testsuite/sec-tests RUNNING
[INFO] enterprise-testsuite/sec-tests SUCCESS (0:00:49.595)
[INFO] security-testsuite/test-security RUNNING
[INFO] security-testsuite/test-security SUCCESS (0:00:41.315)
[INFO] web-testsuite/test-2.1-jsps RUNNING
[INFO] web-testsuite/test-2.1-jsps SUCCESS (0:00:36.736)
[INFO] web-testsuite/test-2.5-servlets RUNNING
[INFO] web-testsuite/test-2.5-servlets SUCCESS (0:00:26.534)
[INFO] web-testsuite/test-jetty RUNNING
[INFO] web-testsuite/test-jetty SUCCESS (0:00:20.344)
[INFO] web-testsuite/test-myfaces RUNNING
[INFO] web-testsuite/test-myfaces SUCCESS (0:00:34.282)
[INFO] web-testsuite/test-web-forward RUNNING
[INFO] web-testsuite/test-web-forward SUCCESS (0:00:31.932)
[INFO] web-testsuite/test-web-references RUNNING
[INFO] web-testsuite/test-web-references SUCCESS (0:00:37.466)
[INFO] webservices-testsuite/jaxb-tests RUNNING
[INFO] webservices-testsuite/jaxb-tests SUCCESS (0:00:52.815)
[INFO] webservices-testsuite/jaxr-tests RUNNING
[INFO] webservices-testsuite/jaxr-tests SUCCESS (0:00:52.248)
[INFO] webservices-testsuite/jaxrpc-jaxws-tests RUNNING
[INFO] webservices-testsuite/jaxrpc-jaxws-tests SUCCESS (0:00:28.168)
[INFO] webservices-testsuite/jaxrpc-tests RUNNING
[INFO] webservices-testsuite/jaxrpc-tests SUCCESS (0:00:39.370)
[INFO] webservices-testsuite/jaxws-mtom-tests RUNNING
[INFO] webservices-testsuite/jaxws-mtom-tests SUCCESS (0:00:42.611)
[INFO] webservices-testsuite/jaxws-provider-tests RUNNING
[INFO] webservices-testsuite/jaxws-provider-tests SUCCESS (0:00:59.693)
[INFO] webservices-testsuite/jaxws-tests RUNNING
[INFO] webservices-testsuite/jaxws-tests SUCCESS (0:01:24.727)
[INFO] webservices-testsuite/jaxws-wsa-tests RUNNING
[INFO] webservices-testsuite/jaxws-wsa-tests SUCCESS (0:00:45.312)
[INFO] webservices-testsuite/saaj-tests RUNNING
[INFO] webservices-testsuite/saaj-tests SUCCESS (0:00:37.738)
[INFO] webservices-testsuite/stax-tests RUNNING
[INFO] webservices-testsuite/stax-tests SUCCESS (0:00:53.052)
[INFO]
[INFO] -------------------------------------------------------------------------------
[INFO] Test Summary (0:30:42.250)
[INFO] Passed: 32
[INFO] Failed: 3
[INFO] -------------------------------------------------------------------------------
[INFO]
[INFO] The following tests failed:
[INFO] * console-testsuite/advanced - /home/geronimo/geronimo/trunk/testsuite/console-testsuite/advanced/build.log
[INFO] * console-testsuite/basic - /home/geronimo/geronimo/trunk/testsuite/console-testsuite/basic/build.log
[INFO] * enterprise-testsuite/jms-tests - /home/geronimo/geronimo/trunk/testsuite/enterprise-testsuite/jms-tests/build.log
[INFO]
[INFO] ------------------------------------------------------------------------
[ERROR] BUILD ERROR
Samples: trunk
=================================
Log: http://people.apache.org/builds/geronimo/server/binaries/trunk/20081231/samples-0900.log
Build status: OK