You are viewing a plain text version of this content. The canonical link for it is here.
Posted to dev@lucene.apache.org by Apache Jenkins Server <je...@builds.apache.org> on 2017/02/10 08:33:21 UTC

[JENKINS] Lucene-Artifacts-5.5 - Build # 5 - Failure

Build: https://builds.apache.org/job/Lucene-Artifacts-5.5/5/

No tests ran.

Build Log:
[...truncated 6370 lines...]
BUILD FAILED
/x1/jenkins/jenkins-slave/workspace/Lucene-Artifacts-5.5/lucene/common-build.xml:792: The following error occurred while executing this line:
/x1/jenkins/jenkins-slave/workspace/Lucene-Artifacts-5.5/lucene/core/build.xml:52: The following error occurred while executing this line:
/x1/jenkins/jenkins-slave/workspace/Lucene-Artifacts-5.5/lucene/common-build.xml:2159: error running fixcrlf on file /x1/jenkins/jenkins-slave/workspace/Lucene-Artifacts-5.5/lucene/build/docs/core/script.js

Total time: 1 minute 8 seconds
Build step 'Invoke Ant' marked build as failure
Archiving artifacts
Publishing Javadoc
Email was triggered for: Failure - Any
Sending email for trigger: Failure - Any




[JENKINS] Lucene-Artifacts-5.5 - Build # 6 - Still Failing

Posted by Apache Jenkins Server <je...@builds.apache.org>.
Build: https://builds.apache.org/job/Lucene-Artifacts-5.5/6/

No tests ran.

Build Log:
[...truncated 6370 lines...]
BUILD FAILED
/x1/jenkins/jenkins-slave/workspace/Lucene-Artifacts-5.5/lucene/common-build.xml:792: The following error occurred while executing this line:
/x1/jenkins/jenkins-slave/workspace/Lucene-Artifacts-5.5/lucene/core/build.xml:52: The following error occurred while executing this line:
/x1/jenkins/jenkins-slave/workspace/Lucene-Artifacts-5.5/lucene/common-build.xml:2159: error running fixcrlf on file /x1/jenkins/jenkins-slave/workspace/Lucene-Artifacts-5.5/lucene/build/docs/core/script.js

Total time: 1 minute 10 seconds
Build step 'Invoke Ant' marked build as failure
Archiving artifacts
Publishing Javadoc
Email was triggered for: Failure - Any
Sending email for trigger: Failure - Any