You are viewing a plain text version of this content. The canonical link for it is here.
Posted to commits@karaf.apache.org by Apache Hudson Server <hu...@hudson.apache.org> on 2010/09/14 22:29:36 UTC

Build failed in Hudson: Karaf » Apache Karaf :: JAAS Jasypt Encryption #69

See <https://hudson.apache.org/hudson/job/Karaf/org.apache.karaf.jaas$org.apache.karaf.jaas.jasypt/69/changes>

Changes:

[gnodet] KARAF-34: Introduce an EncryptionService interface for more flexibility

------------------------------------------
[INFO] ------------------------------------------------------------------------
[INFO] Building Apache Karaf :: JAAS Jasypt Encryption
[INFO]    task-segment: [clean, install]
[INFO] ------------------------------------------------------------------------
[INFO] [clean:clean {execution: default-clean}]
[INFO] [bundle:cleanVersions {execution: cleanVersions}]
[INFO] [remote-resources:process {execution: default}]
[INFO] snapshot org.apache.servicemix.bundles:org.apache.servicemix.bundles.jasypt:1.6_1-SNAPSHOT: checking for updates from apache-snapshots
[INFO] snapshot org.apache.servicemix.bundles:org.apache.servicemix.bundles.jasypt:1.6_1-SNAPSHOT: checking for updates from apache.snapshots
Downloading: http://repository.apache.org/snapshots/org/apache/servicemix/bundles/org.apache.servicemix.bundles.jasypt/1.6_1-SNAPSHOT/org.apache.servicemix.bundles.jasypt-1.6_1-20100908.070418-1.pom
2K downloaded  (org.apache.servicemix.bundles.jasypt-1.6_1-20100908.070418-1.pom)
Downloading: http://svn.apache.org/repos/asf/servicemix/m2-repo/commons-codec/commons-codec/1.1/commons-codec-1.1.pom
[INFO] Unable to find resource 'commons-codec:commons-codec:pom:1.1' in repository servicemix (http://svn.apache.org/repos/asf/servicemix/m2-repo)
Downloading: http://jansi.fusesource.org/repo/release/commons-codec/commons-codec/1.1/commons-codec-1.1.pom
[INFO] Unable to find resource 'commons-codec:commons-codec:pom:1.1' in repository jansi.release.m2 (http://jansi.fusesource.org/repo/release)
Downloading: http://svn.apache.org/repos/asf/servicemix/m2-repo//commons-codec/commons-codec/1.1/commons-codec-1.1.pom
[INFO] Unable to find resource 'commons-codec:commons-codec:pom:1.1' in repository servicemix.m2 (http://svn.apache.org/repos/asf/servicemix/m2-repo/)
Downloading: http://people.apache.org/repo/m2-incubating-repository/commons-codec/commons-codec/1.1/commons-codec-1.1.pom
[INFO] Unable to find resource 'commons-codec:commons-codec:pom:1.1' in repository apache.incubating (http://people.apache.org/repo/m2-incubating-repository)
Downloading: http://repository.codehaus.org/commons-codec/commons-codec/1.1/commons-codec-1.1.pom
[INFO] Unable to find resource 'commons-codec:commons-codec:pom:1.1' in repository codehaus (http://repository.codehaus.org)
Downloading: http://download.java.net/maven/1/commons-codec/poms/commons-codec-1.1.pom
[INFO] Unable to find resource 'commons-codec:commons-codec:pom:1.1' in repository java.net (http://download.java.net/maven/1)
Downloading: http://repo1.maven.org/maven2/commons-codec/commons-codec/1.1/commons-codec-1.1.pom

Downloading: http://svn.apache.org/repos/asf/servicemix/m2-repo/com/ibm/icu/icu4j/3.4.4/icu4j-3.4.4.pom
[INFO] Unable to find resource 'com.ibm.icu:icu4j:pom:3.4.4' in repository servicemix (http://svn.apache.org/repos/asf/servicemix/m2-repo)
Downloading: http://jansi.fusesource.org/repo/release/com/ibm/icu/icu4j/3.4.4/icu4j-3.4.4.pom
[INFO] Unable to find resource 'com.ibm.icu:icu4j:pom:3.4.4' in repository jansi.release.m2 (http://jansi.fusesource.org/repo/release)
Downloading: http://repo1.maven.org/maven2/com/ibm/icu/icu4j/3.4.4/icu4j-3.4.4.pom

Downloading: http://svn.apache.org/repos/asf/servicemix/m2-repo/commons-codec/commons-codec/1.1/commons-codec-1.1.jar
[INFO] snapshot org.apache.karaf.jaas:org.apache.karaf.jaas.modules:2.0.1-SNAPSHOT: checking for updates from apache-snapshots
Downloading: http://svn.apache.org/repos/asf/servicemix/m2-repo/com/ibm/icu/icu4j/3.4.4/icu4j-3.4.4.jar
Downloading: http://repository.apache.org/snapshots/org/apache/servicemix/bundles/org.apache.servicemix.bundles.jasypt/1.6_1-SNAPSHOT/org.apache.servicemix.bundles.jasypt-1.6_1-20100908.070418-1.jar
[INFO] Unable to find resource 'commons-codec:commons-codec:jar:1.1' in repository servicemix (http://svn.apache.org/repos/asf/servicemix/m2-repo)
Downloading: http://jansi.fusesource.org/repo/release/commons-codec/commons-codec/1.1/commons-codec-1.1.jar
[INFO] Unable to find resource 'com.ibm.icu:icu4j:jar:3.4.4' in repository servicemix (http://svn.apache.org/repos/asf/servicemix/m2-repo)
Downloading: http://jansi.fusesource.org/repo/release/com/ibm/icu/icu4j/3.4.4/icu4j-3.4.4.jar
[INFO] Unable to find resource 'commons-codec:commons-codec:jar:1.1' in repository jansi.release.m2 (http://jansi.fusesource.org/repo/release)
Downloading: http://svn.apache.org/repos/asf/servicemix/m2-repo//commons-codec/commons-codec/1.1/commons-codec-1.1.jar
[INFO] snapshot org.apache.karaf.jaas:org.apache.karaf.jaas.modules:2.0.1-SNAPSHOT: checking for updates from apache.snapshots
[INFO] Unable to find resource 'com.ibm.icu:icu4j:jar:3.4.4' in repository jansi.release.m2 (http://jansi.fusesource.org/repo/release)
Downloading: http://repo1.maven.org/maven2/com/ibm/icu/icu4j/3.4.4/icu4j-3.4.4.jar
[INFO] Unable to find resource 'commons-codec:commons-codec:jar:1.1' in repository servicemix.m2 (http://svn.apache.org/repos/asf/servicemix/m2-repo/)
Downloading: http://people.apache.org/repo/m2-incubating-repository/commons-codec/commons-codec/1.1/commons-codec-1.1.jar
135K downloaded  (org.apache.servicemix.bundles.jasypt-1.6_1-20100908.070418-1.jar)
[INFO] Unable to find resource 'commons-codec:commons-codec:jar:1.1' in repository apache.incubating (http://people.apache.org/repo/m2-incubating-repository)
Downloading: http://repository.codehaus.org/commons-codec/commons-codec/1.1/commons-codec-1.1.jar
[INFO] Unable to find resource 'commons-codec:commons-codec:jar:1.1' in repository codehaus (http://repository.codehaus.org)
Downloading: http://download.java.net/maven/1/commons-codec/jars/commons-codec-1.1.jar
[INFO] Unable to find resource 'commons-codec:commons-codec:jar:1.1' in repository java.net (http://download.java.net/maven/1)
Downloading: http://repo1.maven.org/maven2/commons-codec/commons-codec/1.1/commons-codec-1.1.jar


[INFO] [antrun:run {execution: copy-notice}]
[INFO] Executing tasks
     [copy] Warning: Could not find file <https://hudson.apache.org/hudson/job/Karaf/org.apache.karaf.jaas$org.apache.karaf.jaas.jasypt/ws/NOTICE> to copy.
[INFO] Executed tasks
[INFO] [resources:resources {execution: default-resources}]
[INFO] Using 'UTF-8' encoding to copy filtered resources.
[INFO] Copying 1 resource
[INFO] Copying 3 resources
[INFO] [compiler:compile {execution: default-compile}]
[INFO] Compiling 2 source files to <https://hudson.apache.org/hudson/job/Karaf/org.apache.karaf.jaas$org.apache.karaf.jaas.jasypt/ws/target/classes>
[INFO] [resources:testResources {execution: default-testResources}]
[INFO] Using 'UTF-8' encoding to copy filtered resources.
[INFO] skip non existing resourceDirectory <https://hudson.apache.org/hudson/job/Karaf/org.apache.karaf.jaas$org.apache.karaf.jaas.jasypt/ws/src/test/resources>
[INFO] Copying 3 resources
[INFO] [compiler:testCompile {execution: default-testCompile}]
[INFO] Compiling 1 source file to <https://hudson.apache.org/hudson/job/Karaf/org.apache.karaf.jaas$org.apache.karaf.jaas.jasypt/ws/target/test-classes>
[HUDSON] Archiving <https://hudson.apache.org/hudson/job/Karaf/org.apache.karaf.jaas$org.apache.karaf.jaas.jasypt/ws/pom.xml> to /home/hudson/hudson/jobs/Karaf/modules/org.apache.karaf.jaas$org.apache.karaf.jaas.jasypt/builds/2010-09-14_20-20-43/archive/org.apache.karaf.jaas/org.apache.karaf.jaas.jasypt/2.0.1-SNAPSHOT/pom.xml
[INFO] ------------------------------------------------------------------------
[ERROR] BUILD FAILURE
[INFO] ------------------------------------------------------------------------
[INFO] Compilation failure
<https://hudson.apache.org/hudson/job/Karaf/org.apache.karaf.jaas$org.apache.karaf.jaas.jasypt/ws/src/test/java/org/apache/karaf/jaas/jasypt/impl/JasyptEncryptionTest.java>:[35,26] cannot find symbol
symbol  : constructor JasyptEncryption(java.lang.String)
location: class org.apache.karaf.jaas.jasypt.impl.JasyptEncryption


[INFO] ------------------------------------------------------------------------
[INFO] Trace
org.apache.maven.BuildFailureException: Compilation failure
<https://hudson.apache.org/hudson/job/Karaf/org.apache.karaf.jaas$org.apache.karaf.jaas.jasypt/ws/src/test/java/org/apache/karaf/jaas/jasypt/impl/JasyptEncryptionTest.java>:[35,26] cannot find symbol
symbol  : constructor JasyptEncryption(java.lang.String)
location: class org.apache.karaf.jaas.jasypt.impl.JasyptEncryption


	at org.apache.maven.lifecycle.DefaultLifecycleExecutor.executeGoals(DefaultLifecycleExecutor.java:715)
	at org.apache.maven.lifecycle.DefaultLifecycleExecutor.executeGoalWithLifecycle(DefaultLifecycleExecutor.java:556)
	at org.apache.maven.lifecycle.DefaultLifecycleExecutor.executeGoal(DefaultLifecycleExecutor.java:535)
	at org.apache.maven.lifecycle.DefaultLifecycleExecutor.executeGoalAndHandleFailures(DefaultLifecycleExecutor.java:387)
	at org.apache.maven.lifecycle.DefaultLifecycleExecutor.executeTaskSegments(DefaultLifecycleExecutor.java:348)
	at org.apache.maven.lifecycle.DefaultLifecycleExecutor.execute(DefaultLifecycleExecutor.java:180)
	at org.apache.maven.lifecycle.LifecycleExecutorInterceptor.execute(LifecycleExecutorInterceptor.java:65)
	at org.apache.maven.DefaultMaven.doExecute(DefaultMaven.java:328)
	at org.apache.maven.DefaultMaven.execute(DefaultMaven.java:138)
	at org.apache.maven.cli.MavenCli.main(MavenCli.java:362)
	at sun.reflect.NativeMethodAccessorImpl.invoke0(Native Method)
	at sun.reflect.NativeMethodAccessorImpl.invoke(NativeMethodAccessorImpl.java:39)
	at sun.reflect.DelegatingMethodAccessorImpl.invoke(DelegatingMethodAccessorImpl.java:25)
	at java.lang.reflect.Method.invoke(Method.java:592)
	at org.codehaus.classworlds.Launcher.launchEnhanced(Launcher.java:315)
	at org.codehaus.classworlds.Launcher.launch(Launcher.java:255)
	at hudson.maven.agent.Main.launch(Main.java:165)
	at hudson.maven.MavenBuilder.call(MavenBuilder.java:165)
	at hudson.maven.MavenModuleSetBuild$Builder.call(MavenModuleSetBuild.java:681)
	at hudson.maven.MavenModuleSetBuild$Builder.call(MavenModuleSetBuild.java:625)
	at hudson.remoting.UserRequest.perform(UserRequest.java:114)
	at hudson.remoting.UserRequest.perform(UserRequest.java:48)
	at hudson.remoting.Request$2.run(Request.java:270)
	at java.util.concurrent.Executors$RunnableAdapter.call(Executors.java:417)
	at java.util.concurrent.FutureTask$Sync.innerRun(FutureTask.java:269)
	at java.util.concurrent.FutureTask.run(FutureTask.java:123)
	at java.util.concurrent.ThreadPoolExecutor$Worker.runTask(ThreadPoolExecutor.java:651)
	at java.util.concurrent.ThreadPoolExecutor$Worker.run(ThreadPoolExecutor.java:676)
	at java.lang.Thread.run(Thread.java:595)
Caused by: org.apache.maven.plugin.CompilationFailureException: Compilation failure
<https://hudson.apache.org/hudson/job/Karaf/org.apache.karaf.jaas$org.apache.karaf.jaas.jasypt/ws/src/test/java/org/apache/karaf/jaas/jasypt/impl/JasyptEncryptionTest.java>:[35,26] cannot find symbol
symbol  : constructor JasyptEncryption(java.lang.String)
location: class org.apache.karaf.jaas.jasypt.impl.JasyptEncryption


	at org.apache.maven.plugin.AbstractCompilerMojo.execute(AbstractCompilerMojo.java:516)
	at org.apache.maven.plugin.TestCompilerMojo.execute(TestCompilerMojo.java:102)
	at org.apache.maven.plugin.DefaultPluginManager.executeMojo(DefaultPluginManager.java:490)
	at hudson.maven.agent.PluginManagerInterceptor.executeMojo(PluginManagerInterceptor.java:182)
	at org.apache.maven.lifecycle.DefaultLifecycleExecutor.executeGoals(DefaultLifecycleExecutor.java:694)
	... 28 more
[INFO] ------------------------------------------------------------------------
[INFO] Total time: 8 minutes 45 seconds
[INFO] Finished at: Tue Sep 14 20:29:35 UTC 2010
[INFO] Final Memory: 44M/343M
[INFO] ------------------------------------------------------------------------


Hudson build is back to normal : Karaf » Apache Karaf :: JAAS Jasypt Encryption #70

Posted by Apache Hudson Server <hu...@hudson.apache.org>.
See <https://hudson.apache.org/hudson/job/Karaf/org.apache.karaf.jaas$org.apache.karaf.jaas.jasypt/70/changes>