You are viewing a plain text version of this content. The canonical link for it is here.
Posted to builds@beam.apache.org by Apache Jenkins Server <je...@builds.apache.org> on 2020/02/27 18:32:12 UTC
Build failed in Jenkins: beam_PostCommit_Java_Nexmark_Dataflow
#5172
See <https://builds.apache.org/job/beam_PostCommit_Java_Nexmark_Dataflow/5172/display/redirect?page=changes>
Changes:
[lcwik] [BEAM-5524] Fix minor issue in style guide.
------------------------------------------
Started by timer
Started by GitHub push by lukecwik
Running as SYSTEM
[EnvInject] - Loading node environment variables.
Building remotely on apache-beam-jenkins-5 (beam) in workspace <https://builds.apache.org/job/beam_PostCommit_Java_Nexmark_Dataflow/ws/>
No credentials specified
Wiping out workspace first.
Cloning the remote Git repository
Cloning repository https://github.com/apache/beam.git
> git init <https://builds.apache.org/job/beam_PostCommit_Java_Nexmark_Dataflow/ws/src> # timeout=10
Fetching upstream changes from https://github.com/apache/beam.git
> git --version # timeout=10
> git fetch --tags --progress https://github.com/apache/beam.git +refs/heads/*:refs/remotes/origin/*
> git config remote.origin.url https://github.com/apache/beam.git # timeout=10
> git config --add remote.origin.fetch +refs/heads/*:refs/remotes/origin/* # timeout=10
> git config remote.origin.url https://github.com/apache/beam.git # timeout=10
Fetching upstream changes from https://github.com/apache/beam.git
> git fetch --tags --progress https://github.com/apache/beam.git +refs/heads/*:refs/remotes/origin/* +refs/pull/${ghprbPullId}/*:refs/remotes/origin/pr/${ghprbPullId}/*
> git rev-parse origin/master^{commit} # timeout=10
Checking out Revision 8b69513c6cdceec9efeb5ee16a7e22b610f7a847 (origin/master)
> git config core.sparsecheckout # timeout=10
> git checkout -f 8b69513c6cdceec9efeb5ee16a7e22b610f7a847
Commit message: "Merge pull request #10987 from lukecwik/beam5524"
> git rev-list --no-walk 1388bca9314e23f205b17a18e32554ea351dd21e # timeout=10
No emails were triggered.
[EnvInject] - Executing scripts and injecting environment variables after the SCM step.
[EnvInject] - Injecting as environment variables the properties content
SPARK_LOCAL_IP=127.0.0.1
[EnvInject] - Variables injected successfully.
[beam_PostCommit_Java_Nexmark_Dataflow] $ /bin/bash -xe /tmp/jenkins8624533235641947290.sh
+ echo src RUN NEXMARK IN BATCH MODE USING DATAFLOW RUNNER src
src RUN NEXMARK IN BATCH MODE USING DATAFLOW RUNNER src
[Gradle] - Launching build.
[src] $ <https://builds.apache.org/job/beam_PostCommit_Java_Nexmark_Dataflow/ws/src/gradlew> --continue --max-workers=12 -Dorg.gradle.jvmargs=-Xms2g -Dorg.gradle.jvmargs=-Xmx4g -Pnexmark.runner=:runners:google-cloud-dataflow-java "-Pnexmark.args=--bigQueryTable=nexmark --bigQueryDataset=nexmark --project=apache-beam-testing --resourceNameMode=QUERY_RUNNER_AND_MODE --exportSummaryToBigQuery=true --tempLocation=gs://temp-storage-for-perf-tests/nexmark --runner=DataflowRunner --numWorkers=4 --maxNumWorkers=4 --autoscalingAlgorithm=NONE --nexmarkParallel=16 --streaming=false --suite=STRESS --manageResources=false --monitorJobs=true --enforceEncodability=true --enforceImmutability=true" :sdks:java:testing:nexmark:run
Starting a Gradle Daemon, 1 stopped Daemon could not be reused, use --status for details
> Task :buildSrc:compileJava NO-SOURCE
> Task :buildSrc:compileGroovy FROM-CACHE
> Task :buildSrc:pluginDescriptors
> Task :buildSrc:processResources
> Task :buildSrc:classes
> Task :buildSrc:jar
> Task :buildSrc:assemble
> Task :buildSrc:spotlessGroovy
> Task :buildSrc:spotlessGroovyCheck
> Task :buildSrc:spotlessGroovyGradle
> Task :buildSrc:spotlessGroovyGradleCheck
> Task :buildSrc:spotlessCheck
> Task :buildSrc:pluginUnderTestMetadata
> Task :buildSrc:compileTestJava NO-SOURCE
> Task :buildSrc:compileTestGroovy NO-SOURCE
> Task :buildSrc:processTestResources NO-SOURCE
> Task :buildSrc:testClasses UP-TO-DATE
> Task :buildSrc:test NO-SOURCE
> Task :buildSrc:validateTaskProperties FROM-CACHE
> Task :buildSrc:check
> Task :buildSrc:build
Configuration on demand is an incubating feature.
FAILURE: Build failed with an exception.
* What went wrong:
Could not determine the dependencies of task ':sdks:java:testing:nexmark:run'.
> Could not resolve all dependencies for configuration ':sdks:java:testing:nexmark:gradleRun'.
> A problem occurred configuring project ':runners:google-cloud-dataflow-java'.
> Failed to create directory '/home/jenkins/.gradle/caches/5.2.1/scripts-remapped/build_7m1dhn8h6rrwujty6plcqmf7a/9e0fvznw0on33j8ink86fd5ii/cp_projbbb6e7abca8cb12f6fb5641da74ae495'
* Try:
Run with --stacktrace option to get the stack trace. Run with --info or --debug option to get more log output. Run with --scan to get full insights.
* Get more help at https://help.gradle.org
Deprecated Gradle features were used in this build, making it incompatible with Gradle 6.0.
Use '--warning-mode all' to show the individual deprecation warnings.
See https://docs.gradle.org/5.2.1/userguide/command_line_interface.html#sec:command_line_warnings
BUILD FAILED in 11s
A build scan cannot be produced as an error occurred spooling the build data.
Please report this problem via https://gradle.com/scans/help/plugin and include the following via copy/paste:
----------
Gradle version: 5.2.1
Plugin version: 2.3
java.lang.IllegalStateException: java.io.IOException: No space left on device
at com.gradle.scan.a.e.b.flush(SourceFile:233)
at com.gradle.scan.a.e.b.close(SourceFile:244)
at com.gradle.scan.a.e.c.close(SourceFile:66)
at com.gradle.scan.plugin.internal.n.a(SourceFile:78)
at com.gradle.scan.plugin.internal.e.c.c.b(SourceFile:125)
at com.gradle.scan.plugin.internal.e.c.c.a(SourceFile:117)
at com.gradle.scan.plugin.internal.o.a$a.a(SourceFile:30)
at com.gradle.scan.plugin.internal.o.a$a.a(SourceFile:19)
at com.gradle.scan.plugin.internal.o.a.c(SourceFile:60)
Caused by: java.io.IOException: No space left on device
at com.gradle.scan.a.e.b.flush(SourceFile:231)
... 8 more
----------
FAILURE: Build failed with an exception.
* What went wrong:
Failed to notify root build lifecycle listener.
> Could not update /home/jenkins/.gradle/caches/5.2.1/file-changes/last-build.bin
> Could not update <https://builds.apache.org/job/beam_PostCommit_Java_Nexmark_Dataflow/ws/src/.gradle/5.2.1/fileChanges/last-build.bin>
* Try:
Run with --stacktrace option to get the stack trace. Run with --info or --debug option to get more log output. Run with --scan to get full insights.
* Get more help at https://help.gradle.org
Deprecated Gradle features were used in this build, making it incompatible with Gradle 6.0.
Use '--warning-mode all' to show the individual deprecation warnings.
See https://docs.gradle.org/5.2.1/userguide/command_line_interface.html#sec:command_line_warnings
BUILD FAILED in 12s
FAILURE: Build failed with an exception.
* What went wrong:
Could not receive a message from the daemon.
* Try:
Run with --stacktrace option to get the stack trace. Run with --info or --debug option to get more log output. Run with --scan to get full insights.
* Get more help at https://help.gradle.org
Build step 'Invoke Gradle script' changed build result to FAILURE
Build step 'Invoke Gradle script' marked build as failure
---------------------------------------------------------------------
To unsubscribe, e-mail: builds-unsubscribe@beam.apache.org
For additional commands, e-mail: builds-help@beam.apache.org
Jenkins build is back to normal :
beam_PostCommit_Java_Nexmark_Dataflow #5173
Posted by Apache Jenkins Server <je...@builds.apache.org>.
See <https://builds.apache.org/job/beam_PostCommit_Java_Nexmark_Dataflow/5173/display/redirect?page=changes>
---------------------------------------------------------------------
To unsubscribe, e-mail: builds-unsubscribe@beam.apache.org
For additional commands, e-mail: builds-help@beam.apache.org