You are viewing a plain text version of this content. The canonical link for it is here.
Posted to dev@zookeeper.apache.org by Apache Jenkins Server <je...@builds.apache.org> on 2015/02/09 11:24:31 UTC

ZooKeeper_branch35_jdk7 - Build # 198 - Still Failing

See https://builds.apache.org/job/ZooKeeper_branch35_jdk7/198/

###################################################################################
########################## LAST 60 LINES OF THE CONSOLE ###########################
[...truncated 348462 lines...]
    [junit] 2015-02-09 10:24:25,035 [myid:] - INFO  [main:JMXEnv@142] - ensureOnly:[]
    [junit] 2015-02-09 10:24:25,036 [myid:] - INFO  [main:ClientBase@444] - STARTING server
    [junit] 2015-02-09 10:24:25,036 [myid:] - INFO  [main:ClientBase@365] - CREATING server instance 127.0.0.1:11221
    [junit] 2015-02-09 10:24:25,037 [myid:] - INFO  [main:NIOServerCnxnFactory@670] - Configuring NIO connection handler with 10s sessionless connection timeout, 2 selector thread(s), 32 worker threads, and 64 kB direct buffers.
    [junit] 2015-02-09 10:24:25,037 [myid:] - INFO  [main:NIOServerCnxnFactory@683] - binding to port 0.0.0.0/0.0.0.0:11221
    [junit] 2015-02-09 10:24:25,037 [myid:] - INFO  [main:ClientBase@340] - STARTING server instance 127.0.0.1:11221
    [junit] 2015-02-09 10:24:25,038 [myid:] - INFO  [main:ZooKeeperServer@778] - minSessionTimeout set to 6000
    [junit] 2015-02-09 10:24:25,038 [myid:] - INFO  [main:ZooKeeperServer@787] - maxSessionTimeout set to 60000
    [junit] 2015-02-09 10:24:25,038 [myid:] - INFO  [main:ZooKeeperServer@153] - Created server with tickTime 3000 minSessionTimeout 6000 maxSessionTimeout 60000 datadir /home/jenkins/jenkins-slave/workspace/ZooKeeper_branch35_jdk7/branch-3.5/build/test/tmp/test2640407701954686952.junit.dir/version-2 snapdir /home/jenkins/jenkins-slave/workspace/ZooKeeper_branch35_jdk7/branch-3.5/build/test/tmp/test2640407701954686952.junit.dir/version-2
    [junit] 2015-02-09 10:24:25,039 [myid:] - INFO  [main:FileSnap@83] - Reading snapshot /home/jenkins/jenkins-slave/workspace/ZooKeeper_branch35_jdk7/branch-3.5/build/test/tmp/test2640407701954686952.junit.dir/version-2/snapshot.b
    [junit] 2015-02-09 10:24:25,042 [myid:] - INFO  [main:FileTxnSnapLog@298] - Snapshotting: 0xb to /home/jenkins/jenkins-slave/workspace/ZooKeeper_branch35_jdk7/branch-3.5/build/test/tmp/test2640407701954686952.junit.dir/version-2/snapshot.b
    [junit] 2015-02-09 10:24:25,044 [myid:] - INFO  [main:FourLetterWordMain@43] - connecting to 127.0.0.1 11221
    [junit] 2015-02-09 10:24:25,045 [myid:] - INFO  [NIOServerCxnFactory.AcceptThread:0.0.0.0/0.0.0.0:11221:NIOServerCnxnFactory$AcceptThread@296] - Accepted socket connection from /127.0.0.1:50942
    [junit] 2015-02-09 10:24:25,046 [myid:] - INFO  [NIOWorkerThread-1:NIOServerCnxn@835] - Processing stat command from /127.0.0.1:50942
    [junit] 2015-02-09 10:24:25,046 [myid:] - INFO  [NIOWorkerThread-1:NIOServerCnxn$StatCommand@684] - Stat command output
    [junit] 2015-02-09 10:24:25,046 [myid:] - INFO  [NIOWorkerThread-1:NIOServerCnxn@1006] - Closed socket connection for client /127.0.0.1:50942 (no session established for client)
    [junit] 2015-02-09 10:24:25,047 [myid:] - INFO  [main:JMXEnv@224] - ensureParent:[InMemoryDataTree, StandaloneServer_port]
    [junit] 2015-02-09 10:24:25,049 [myid:] - INFO  [main:JMXEnv@241] - expect:InMemoryDataTree
    [junit] 2015-02-09 10:24:25,049 [myid:] - INFO  [main:JMXEnv@245] - found:InMemoryDataTree org.apache.ZooKeeperService:name0=StandaloneServer_port11221,name1=InMemoryDataTree
    [junit] 2015-02-09 10:24:25,049 [myid:] - INFO  [main:JMXEnv@241] - expect:StandaloneServer_port
    [junit] 2015-02-09 10:24:25,049 [myid:] - INFO  [main:JMXEnv@245] - found:StandaloneServer_port org.apache.ZooKeeperService:name0=StandaloneServer_port11221
    [junit] 2015-02-09 10:24:25,050 [myid:] - INFO  [main:JUnit4ZKTestRunner$LoggedInvokeMethod@55] - Memory used 18106
    [junit] 2015-02-09 10:24:25,050 [myid:] - INFO  [main:JUnit4ZKTestRunner$LoggedInvokeMethod@60] - Number of threads 24
    [junit] 2015-02-09 10:24:25,050 [myid:] - INFO  [main:JUnit4ZKTestRunner$LoggedInvokeMethod@65] - FINISHED TEST METHOD testQuota
    [junit] 2015-02-09 10:24:25,050 [myid:] - INFO  [main:ClientBase@521] - tearDown starting
    [junit] 2015-02-09 10:24:25,112 [myid:] - INFO  [main:ZooKeeper@968] - Session: 0x102963457190000 closed
    [junit] 2015-02-09 10:24:25,113 [myid:] - INFO  [main:ClientBase@491] - STOPPING server
    [junit] 2015-02-09 10:24:25,112 [myid:] - INFO  [main-EventThread:ClientCnxn$EventThread@531] - EventThread shut down
    [junit] 2015-02-09 10:24:25,113 [myid:] - INFO  [ConnnectionExpirer:NIOServerCnxnFactory$ConnectionExpirerThread@583] - ConnnectionExpirerThread interrupted
    [junit] 2015-02-09 10:24:25,113 [myid:] - INFO  [NIOServerCxnFactory.SelectorThread-0:NIOServerCnxnFactory$SelectorThread@420] - selector thread exitted run method
    [junit] 2015-02-09 10:24:25,113 [myid:] - INFO  [NIOServerCxnFactory.SelectorThread-1:NIOServerCnxnFactory$SelectorThread@420] - selector thread exitted run method
    [junit] 2015-02-09 10:24:25,113 [myid:] - INFO  [NIOServerCxnFactory.AcceptThread:0.0.0.0/0.0.0.0:11221:NIOServerCnxnFactory$AcceptThread@219] - accept thread exitted run method
    [junit] 2015-02-09 10:24:25,114 [myid:] - INFO  [main:ZooKeeperServer@440] - shutting down
    [junit] 2015-02-09 10:24:25,114 [myid:] - INFO  [main:SessionTrackerImpl@232] - Shutting down
    [junit] 2015-02-09 10:24:25,114 [myid:] - INFO  [main:PrepRequestProcessor@974] - Shutting down
    [junit] 2015-02-09 10:24:25,115 [myid:] - INFO  [main:SyncRequestProcessor@191] - Shutting down
    [junit] 2015-02-09 10:24:25,115 [myid:] - INFO  [ProcessThread(sid:0 cport:11221)::PrepRequestProcessor@156] - PrepRequestProcessor exited loop!
    [junit] 2015-02-09 10:24:25,115 [myid:] - INFO  [SyncThread:0:SyncRequestProcessor@169] - SyncRequestProcessor exited!
    [junit] 2015-02-09 10:24:25,115 [myid:] - INFO  [main:FinalRequestProcessor@477] - shutdown of request processor complete
    [junit] 2015-02-09 10:24:25,116 [myid:] - INFO  [main:MBeanRegistry@119] - Unregister MBean [org.apache.ZooKeeperService:name0=StandaloneServer_port11221,name1=InMemoryDataTree]
    [junit] 2015-02-09 10:24:25,116 [myid:] - INFO  [main:MBeanRegistry@119] - Unregister MBean [org.apache.ZooKeeperService:name0=StandaloneServer_port11221]
    [junit] 2015-02-09 10:24:25,116 [myid:] - INFO  [main:FourLetterWordMain@43] - connecting to 127.0.0.1 11221
    [junit] 2015-02-09 10:24:25,117 [myid:] - INFO  [main:JMXEnv@142] - ensureOnly:[]
    [junit] 2015-02-09 10:24:25,128 [myid:] - INFO  [main:ClientBase@546] - fdcount after test is: 47 at start it was 33
    [junit] 2015-02-09 10:24:25,128 [myid:] - INFO  [main:ClientBase@548] - sleeping for 20 secs
    [junit] 2015-02-09 10:24:25,129 [myid:] - INFO  [main:ZKTestCase$1@65] - SUCCEEDED testQuota
    [junit] 2015-02-09 10:24:25,130 [myid:] - INFO  [main:ZKTestCase$1@60] - FINISHED testQuota
    [junit] Tests run: 1, Failures: 0, Errors: 0, Skipped: 0, Time elapsed: 0.582 sec

BUILD FAILED
/home/jenkins/jenkins-slave/workspace/ZooKeeper_branch35_jdk7/branch-3.5/build.xml:1422: The following error occurred while executing this line:
/home/jenkins/jenkins-slave/workspace/ZooKeeper_branch35_jdk7/branch-3.5/build.xml:1333: Tests failed!

Total time: 43 minutes 14 seconds
Build step 'Invoke Ant' marked build as failure
Archiving artifacts
Recording test results
Email was triggered for: Failure
Sending email for trigger: Failure



###################################################################################
############################## FAILED TESTS (if any) ##############################
1 tests failed.
REGRESSION:  org.apache.zookeeper.test.ClientPortBindTest.testBindByAddress

Error Message:
No such device

Stack Trace:
java.net.SocketException: No such device
	at java.net.NetworkInterface.isLoopback0(Native Method)
	at java.net.NetworkInterface.isLoopback(NetworkInterface.java:390)
	at org.apache.zookeeper.test.ClientPortBindTest.testBindByAddress(ClientPortBindTest.java:61)
	at org.apache.zookeeper.JUnit4ZKTestRunner$LoggedInvokeMethod.evaluate(JUnit4ZKTestRunner.java:52)



ZooKeeper_branch35_jdk7 - Build # 202 - Still Failing

Posted by Apache Jenkins Server <je...@builds.apache.org>.
See https://builds.apache.org/job/ZooKeeper_branch35_jdk7/202/

###################################################################################
########################## LAST 60 LINES OF THE CONSOLE ###########################
[...truncated 350154 lines...]
    [junit] 2015-02-13 20:03:05,444 [myid:] - INFO  [main:JMXEnv@142] - ensureOnly:[]
    [junit] 2015-02-13 20:03:05,445 [myid:] - INFO  [main:ClientBase@444] - STARTING server
    [junit] 2015-02-13 20:03:05,445 [myid:] - INFO  [main:ClientBase@365] - CREATING server instance 127.0.0.1:11221
    [junit] 2015-02-13 20:03:05,446 [myid:] - INFO  [main:NIOServerCnxnFactory@670] - Configuring NIO connection handler with 10s sessionless connection timeout, 2 selector thread(s), 32 worker threads, and 64 kB direct buffers.
    [junit] 2015-02-13 20:03:05,446 [myid:] - INFO  [main:NIOServerCnxnFactory@683] - binding to port 0.0.0.0/0.0.0.0:11221
    [junit] 2015-02-13 20:03:05,446 [myid:] - INFO  [main:ClientBase@340] - STARTING server instance 127.0.0.1:11221
    [junit] 2015-02-13 20:03:05,447 [myid:] - INFO  [main:ZooKeeperServer@778] - minSessionTimeout set to 6000
    [junit] 2015-02-13 20:03:05,447 [myid:] - INFO  [main:ZooKeeperServer@787] - maxSessionTimeout set to 60000
    [junit] 2015-02-13 20:03:05,447 [myid:] - INFO  [main:ZooKeeperServer@153] - Created server with tickTime 3000 minSessionTimeout 6000 maxSessionTimeout 60000 datadir /home/jenkins/jenkins-slave/workspace/ZooKeeper_branch35_jdk7/branch-3.5/build/test/tmp/test3721450864680462101.junit.dir/version-2 snapdir /home/jenkins/jenkins-slave/workspace/ZooKeeper_branch35_jdk7/branch-3.5/build/test/tmp/test3721450864680462101.junit.dir/version-2
    [junit] 2015-02-13 20:03:05,448 [myid:] - INFO  [main:FileSnap@83] - Reading snapshot /home/jenkins/jenkins-slave/workspace/ZooKeeper_branch35_jdk7/branch-3.5/build/test/tmp/test3721450864680462101.junit.dir/version-2/snapshot.b
    [junit] 2015-02-13 20:03:05,450 [myid:] - INFO  [main:FileTxnSnapLog@298] - Snapshotting: 0xb to /home/jenkins/jenkins-slave/workspace/ZooKeeper_branch35_jdk7/branch-3.5/build/test/tmp/test3721450864680462101.junit.dir/version-2/snapshot.b
    [junit] 2015-02-13 20:03:05,452 [myid:] - INFO  [main:FourLetterWordMain@43] - connecting to 127.0.0.1 11221
    [junit] 2015-02-13 20:03:05,453 [myid:] - INFO  [NIOServerCxnFactory.AcceptThread:0.0.0.0/0.0.0.0:11221:NIOServerCnxnFactory$AcceptThread@296] - Accepted socket connection from /127.0.0.1:35805
    [junit] 2015-02-13 20:03:05,454 [myid:] - INFO  [NIOWorkerThread-1:NIOServerCnxn@835] - Processing stat command from /127.0.0.1:35805
    [junit] 2015-02-13 20:03:05,454 [myid:] - INFO  [NIOWorkerThread-1:NIOServerCnxn$StatCommand@684] - Stat command output
    [junit] 2015-02-13 20:03:05,454 [myid:] - INFO  [NIOWorkerThread-1:NIOServerCnxn@1006] - Closed socket connection for client /127.0.0.1:35805 (no session established for client)
    [junit] 2015-02-13 20:03:05,455 [myid:] - INFO  [main:JMXEnv@224] - ensureParent:[InMemoryDataTree, StandaloneServer_port]
    [junit] 2015-02-13 20:03:05,457 [myid:] - INFO  [main:JMXEnv@241] - expect:InMemoryDataTree
    [junit] 2015-02-13 20:03:05,457 [myid:] - INFO  [main:JMXEnv@245] - found:InMemoryDataTree org.apache.ZooKeeperService:name0=StandaloneServer_port11221,name1=InMemoryDataTree
    [junit] 2015-02-13 20:03:05,457 [myid:] - INFO  [main:JMXEnv@241] - expect:StandaloneServer_port
    [junit] 2015-02-13 20:03:05,458 [myid:] - INFO  [main:JMXEnv@245] - found:StandaloneServer_port org.apache.ZooKeeperService:name0=StandaloneServer_port11221
    [junit] 2015-02-13 20:03:05,458 [myid:] - INFO  [main:JUnit4ZKTestRunner$LoggedInvokeMethod@55] - Memory used 18060
    [junit] 2015-02-13 20:03:05,458 [myid:] - INFO  [main:JUnit4ZKTestRunner$LoggedInvokeMethod@60] - Number of threads 24
    [junit] 2015-02-13 20:03:05,458 [myid:] - INFO  [main:JUnit4ZKTestRunner$LoggedInvokeMethod@65] - FINISHED TEST METHOD testQuota
    [junit] 2015-02-13 20:03:05,459 [myid:] - INFO  [main:ClientBase@521] - tearDown starting
    [junit] 2015-02-13 20:03:05,523 [myid:] - INFO  [main:ZooKeeper@968] - Session: 0x100997432e30000 closed
    [junit] 2015-02-13 20:03:05,523 [myid:] - INFO  [main:ClientBase@491] - STOPPING server
    [junit] 2015-02-13 20:03:05,523 [myid:] - INFO  [main-EventThread:ClientCnxn$EventThread@531] - EventThread shut down
    [junit] 2015-02-13 20:03:05,523 [myid:] - INFO  [ConnnectionExpirer:NIOServerCnxnFactory$ConnectionExpirerThread@583] - ConnnectionExpirerThread interrupted
    [junit] 2015-02-13 20:03:05,524 [myid:] - INFO  [NIOServerCxnFactory.AcceptThread:0.0.0.0/0.0.0.0:11221:NIOServerCnxnFactory$AcceptThread@219] - accept thread exitted run method
    [junit] 2015-02-13 20:03:05,524 [myid:] - INFO  [NIOServerCxnFactory.SelectorThread-0:NIOServerCnxnFactory$SelectorThread@420] - selector thread exitted run method
    [junit] 2015-02-13 20:03:05,524 [myid:] - INFO  [NIOServerCxnFactory.SelectorThread-1:NIOServerCnxnFactory$SelectorThread@420] - selector thread exitted run method
    [junit] 2015-02-13 20:03:05,524 [myid:] - INFO  [main:ZooKeeperServer@440] - shutting down
    [junit] 2015-02-13 20:03:05,525 [myid:] - INFO  [main:SessionTrackerImpl@232] - Shutting down
    [junit] 2015-02-13 20:03:05,525 [myid:] - INFO  [main:PrepRequestProcessor@974] - Shutting down
    [junit] 2015-02-13 20:03:05,525 [myid:] - INFO  [main:SyncRequestProcessor@191] - Shutting down
    [junit] 2015-02-13 20:03:05,525 [myid:] - INFO  [ProcessThread(sid:0 cport:11221)::PrepRequestProcessor@156] - PrepRequestProcessor exited loop!
    [junit] 2015-02-13 20:03:05,525 [myid:] - INFO  [SyncThread:0:SyncRequestProcessor@169] - SyncRequestProcessor exited!
    [junit] 2015-02-13 20:03:05,526 [myid:] - INFO  [main:FinalRequestProcessor@477] - shutdown of request processor complete
    [junit] 2015-02-13 20:03:05,526 [myid:] - INFO  [main:MBeanRegistry@119] - Unregister MBean [org.apache.ZooKeeperService:name0=StandaloneServer_port11221,name1=InMemoryDataTree]
    [junit] 2015-02-13 20:03:05,526 [myid:] - INFO  [main:MBeanRegistry@119] - Unregister MBean [org.apache.ZooKeeperService:name0=StandaloneServer_port11221]
    [junit] 2015-02-13 20:03:05,527 [myid:] - INFO  [main:FourLetterWordMain@43] - connecting to 127.0.0.1 11221
    [junit] 2015-02-13 20:03:05,527 [myid:] - INFO  [main:JMXEnv@142] - ensureOnly:[]
    [junit] 2015-02-13 20:03:05,539 [myid:] - INFO  [main:ClientBase@546] - fdcount after test is: 47 at start it was 33
    [junit] 2015-02-13 20:03:05,539 [myid:] - INFO  [main:ClientBase@548] - sleeping for 20 secs
    [junit] 2015-02-13 20:03:05,541 [myid:] - INFO  [main:ZKTestCase$1@65] - SUCCEEDED testQuota
    [junit] 2015-02-13 20:03:05,541 [myid:] - INFO  [main:ZKTestCase$1@60] - FINISHED testQuota
    [junit] Tests run: 1, Failures: 0, Errors: 0, Skipped: 0, Time elapsed: 0.6 sec

BUILD FAILED
/home/jenkins/jenkins-slave/workspace/ZooKeeper_branch35_jdk7/branch-3.5/build.xml:1422: The following error occurred while executing this line:
/home/jenkins/jenkins-slave/workspace/ZooKeeper_branch35_jdk7/branch-3.5/build.xml:1333: Tests failed!

Total time: 43 minutes 24 seconds
Build step 'Invoke Ant' marked build as failure
Archiving artifacts
Recording test results
Email was triggered for: Failure
Sending email for trigger: Failure



###################################################################################
############################## FAILED TESTS (if any) ##############################
1 tests failed.
REGRESSION:  org.apache.zookeeper.test.ReconfigTest.testPortChange

Error Message:
expected:<test[1]> but was:<test[0]>

Stack Trace:
junit.framework.AssertionFailedError: expected:<test[1]> but was:<test[0]>
	at org.apache.zookeeper.test.ReconfigTest.testNormalOperation(ReconfigTest.java:151)
	at org.apache.zookeeper.test.ReconfigTest.testPortChange(ReconfigTest.java:600)
	at org.apache.zookeeper.JUnit4ZKTestRunner$LoggedInvokeMethod.evaluate(JUnit4ZKTestRunner.java:52)



ZooKeeper_branch35_jdk7 - Build # 201 - Still Failing

Posted by Apache Jenkins Server <je...@builds.apache.org>.
See https://builds.apache.org/job/ZooKeeper_branch35_jdk7/201/

###################################################################################
########################## LAST 60 LINES OF THE CONSOLE ###########################
[...truncated 344804 lines...]
    [junit] 2015-02-12 12:18:19,527 [myid:] - INFO  [main:JMXEnv@142] - ensureOnly:[]
    [junit] 2015-02-12 12:18:19,529 [myid:] - INFO  [main:ClientBase@444] - STARTING server
    [junit] 2015-02-12 12:18:19,529 [myid:] - INFO  [main:ClientBase@365] - CREATING server instance 127.0.0.1:11221
    [junit] 2015-02-12 12:18:19,529 [myid:] - INFO  [main:NIOServerCnxnFactory@670] - Configuring NIO connection handler with 10s sessionless connection timeout, 2 selector thread(s), 32 worker threads, and 64 kB direct buffers.
    [junit] 2015-02-12 12:18:19,530 [myid:] - INFO  [main:NIOServerCnxnFactory@683] - binding to port 0.0.0.0/0.0.0.0:11221
    [junit] 2015-02-12 12:18:19,530 [myid:] - INFO  [main:ClientBase@340] - STARTING server instance 127.0.0.1:11221
    [junit] 2015-02-12 12:18:19,530 [myid:] - INFO  [main:ZooKeeperServer@778] - minSessionTimeout set to 6000
    [junit] 2015-02-12 12:18:19,531 [myid:] - INFO  [main:ZooKeeperServer@787] - maxSessionTimeout set to 60000
    [junit] 2015-02-12 12:18:19,531 [myid:] - INFO  [main:ZooKeeperServer@153] - Created server with tickTime 3000 minSessionTimeout 6000 maxSessionTimeout 60000 datadir /home/jenkins/jenkins-slave/workspace/ZooKeeper_branch35_jdk7/branch-3.5/build/test/tmp/test4550012508534052734.junit.dir/version-2 snapdir /home/jenkins/jenkins-slave/workspace/ZooKeeper_branch35_jdk7/branch-3.5/build/test/tmp/test4550012508534052734.junit.dir/version-2
    [junit] 2015-02-12 12:18:19,532 [myid:] - INFO  [main:FileSnap@83] - Reading snapshot /home/jenkins/jenkins-slave/workspace/ZooKeeper_branch35_jdk7/branch-3.5/build/test/tmp/test4550012508534052734.junit.dir/version-2/snapshot.b
    [junit] 2015-02-12 12:18:19,535 [myid:] - INFO  [main:FileTxnSnapLog@298] - Snapshotting: 0xb to /home/jenkins/jenkins-slave/workspace/ZooKeeper_branch35_jdk7/branch-3.5/build/test/tmp/test4550012508534052734.junit.dir/version-2/snapshot.b
    [junit] 2015-02-12 12:18:19,537 [myid:] - INFO  [main:FourLetterWordMain@43] - connecting to 127.0.0.1 11221
    [junit] 2015-02-12 12:18:19,537 [myid:] - INFO  [NIOServerCxnFactory.AcceptThread:0.0.0.0/0.0.0.0:11221:NIOServerCnxnFactory$AcceptThread@296] - Accepted socket connection from /127.0.0.1:41683
    [junit] 2015-02-12 12:18:19,538 [myid:] - INFO  [NIOWorkerThread-1:NIOServerCnxn@835] - Processing stat command from /127.0.0.1:41683
    [junit] 2015-02-12 12:18:19,539 [myid:] - INFO  [NIOWorkerThread-1:NIOServerCnxn$StatCommand@684] - Stat command output
    [junit] 2015-02-12 12:18:19,539 [myid:] - INFO  [NIOWorkerThread-1:NIOServerCnxn@1006] - Closed socket connection for client /127.0.0.1:41683 (no session established for client)
    [junit] 2015-02-12 12:18:19,539 [myid:] - INFO  [main:JMXEnv@224] - ensureParent:[InMemoryDataTree, StandaloneServer_port]
    [junit] 2015-02-12 12:18:19,541 [myid:] - INFO  [main:JMXEnv@241] - expect:InMemoryDataTree
    [junit] 2015-02-12 12:18:19,541 [myid:] - INFO  [main:JMXEnv@245] - found:InMemoryDataTree org.apache.ZooKeeperService:name0=StandaloneServer_port11221,name1=InMemoryDataTree
    [junit] 2015-02-12 12:18:19,542 [myid:] - INFO  [main:JMXEnv@241] - expect:StandaloneServer_port
    [junit] 2015-02-12 12:18:19,542 [myid:] - INFO  [main:JMXEnv@245] - found:StandaloneServer_port org.apache.ZooKeeperService:name0=StandaloneServer_port11221
    [junit] 2015-02-12 12:18:19,542 [myid:] - INFO  [main:JUnit4ZKTestRunner$LoggedInvokeMethod@55] - Memory used 18104
    [junit] 2015-02-12 12:18:19,542 [myid:] - INFO  [main:JUnit4ZKTestRunner$LoggedInvokeMethod@60] - Number of threads 24
    [junit] 2015-02-12 12:18:19,542 [myid:] - INFO  [main:JUnit4ZKTestRunner$LoggedInvokeMethod@65] - FINISHED TEST METHOD testQuota
    [junit] 2015-02-12 12:18:19,543 [myid:] - INFO  [main:ClientBase@521] - tearDown starting
    [junit] 2015-02-12 12:18:19,602 [myid:] - INFO  [main:ZooKeeper@968] - Session: 0x102a60fe79a0000 closed
    [junit] 2015-02-12 12:18:19,603 [myid:] - INFO  [main:ClientBase@491] - STOPPING server
    [junit] 2015-02-12 12:18:19,603 [myid:] - INFO  [main-EventThread:ClientCnxn$EventThread@531] - EventThread shut down
    [junit] 2015-02-12 12:18:19,603 [myid:] - INFO  [NIOServerCxnFactory.AcceptThread:0.0.0.0/0.0.0.0:11221:NIOServerCnxnFactory$AcceptThread@219] - accept thread exitted run method
    [junit] 2015-02-12 12:18:19,603 [myid:] - INFO  [ConnnectionExpirer:NIOServerCnxnFactory$ConnectionExpirerThread@583] - ConnnectionExpirerThread interrupted
    [junit] 2015-02-12 12:18:19,603 [myid:] - INFO  [NIOServerCxnFactory.SelectorThread-0:NIOServerCnxnFactory$SelectorThread@420] - selector thread exitted run method
    [junit] 2015-02-12 12:18:19,603 [myid:] - INFO  [NIOServerCxnFactory.SelectorThread-1:NIOServerCnxnFactory$SelectorThread@420] - selector thread exitted run method
    [junit] 2015-02-12 12:18:19,604 [myid:] - INFO  [main:ZooKeeperServer@440] - shutting down
    [junit] 2015-02-12 12:18:19,604 [myid:] - INFO  [main:SessionTrackerImpl@232] - Shutting down
    [junit] 2015-02-12 12:18:19,605 [myid:] - INFO  [main:PrepRequestProcessor@974] - Shutting down
    [junit] 2015-02-12 12:18:19,605 [myid:] - INFO  [main:SyncRequestProcessor@191] - Shutting down
    [junit] 2015-02-12 12:18:19,605 [myid:] - INFO  [ProcessThread(sid:0 cport:11221)::PrepRequestProcessor@156] - PrepRequestProcessor exited loop!
    [junit] 2015-02-12 12:18:19,605 [myid:] - INFO  [SyncThread:0:SyncRequestProcessor@169] - SyncRequestProcessor exited!
    [junit] 2015-02-12 12:18:19,605 [myid:] - INFO  [main:FinalRequestProcessor@477] - shutdown of request processor complete
    [junit] 2015-02-12 12:18:19,606 [myid:] - INFO  [main:MBeanRegistry@119] - Unregister MBean [org.apache.ZooKeeperService:name0=StandaloneServer_port11221,name1=InMemoryDataTree]
    [junit] 2015-02-12 12:18:19,606 [myid:] - INFO  [main:MBeanRegistry@119] - Unregister MBean [org.apache.ZooKeeperService:name0=StandaloneServer_port11221]
    [junit] 2015-02-12 12:18:19,607 [myid:] - INFO  [main:FourLetterWordMain@43] - connecting to 127.0.0.1 11221
    [junit] 2015-02-12 12:18:19,607 [myid:] - INFO  [main:JMXEnv@142] - ensureOnly:[]
    [junit] 2015-02-12 12:18:19,620 [myid:] - INFO  [main:ClientBase@546] - fdcount after test is: 47 at start it was 33
    [junit] 2015-02-12 12:18:19,620 [myid:] - INFO  [main:ClientBase@548] - sleeping for 20 secs
    [junit] 2015-02-12 12:18:19,622 [myid:] - INFO  [main:ZKTestCase$1@65] - SUCCEEDED testQuota
    [junit] 2015-02-12 12:18:19,622 [myid:] - INFO  [main:ZKTestCase$1@60] - FINISHED testQuota
    [junit] Tests run: 1, Failures: 0, Errors: 0, Skipped: 0, Time elapsed: 0.58 sec

BUILD FAILED
/home/jenkins/jenkins-slave/workspace/ZooKeeper_branch35_jdk7/branch-3.5/build.xml:1422: The following error occurred while executing this line:
/home/jenkins/jenkins-slave/workspace/ZooKeeper_branch35_jdk7/branch-3.5/build.xml:1333: Tests failed!

Total time: 42 minutes 58 seconds
Build step 'Invoke Ant' marked build as failure
Archiving artifacts
Recording test results
Email was triggered for: Failure
Sending email for trigger: Failure



###################################################################################
############################## FAILED TESTS (if any) ##############################
1 tests failed.
REGRESSION:  org.apache.zookeeper.test.AsyncHammerTest.testHammer

Error Message:
null

Stack Trace:
junit.framework.AssertionFailedError
	at org.apache.zookeeper.test.AsyncHammerTest.testHammer(AsyncHammerTest.java:186)
	at org.apache.zookeeper.JUnit4ZKTestRunner$LoggedInvokeMethod.evaluate(JUnit4ZKTestRunner.java:52)



ZooKeeper_branch35_jdk7 - Build # 200 - Still Failing

Posted by Apache Jenkins Server <je...@builds.apache.org>.
See https://builds.apache.org/job/ZooKeeper_branch35_jdk7/200/

###################################################################################
########################## LAST 60 LINES OF THE CONSOLE ###########################
[...truncated 345611 lines...]
    [junit] 2015-02-11 11:10:26,958 [myid:] - INFO  [main:JMXEnv@142] - ensureOnly:[]
    [junit] 2015-02-11 11:10:26,959 [myid:] - INFO  [main:ClientBase@444] - STARTING server
    [junit] 2015-02-11 11:10:26,959 [myid:] - INFO  [main:ClientBase@365] - CREATING server instance 127.0.0.1:11221
    [junit] 2015-02-11 11:10:26,959 [myid:] - INFO  [main:NIOServerCnxnFactory@670] - Configuring NIO connection handler with 10s sessionless connection timeout, 2 selector thread(s), 32 worker threads, and 64 kB direct buffers.
    [junit] 2015-02-11 11:10:26,959 [myid:] - INFO  [main:NIOServerCnxnFactory@683] - binding to port 0.0.0.0/0.0.0.0:11221
    [junit] 2015-02-11 11:10:26,960 [myid:] - INFO  [main:ClientBase@340] - STARTING server instance 127.0.0.1:11221
    [junit] 2015-02-11 11:10:26,960 [myid:] - INFO  [main:ZooKeeperServer@778] - minSessionTimeout set to 6000
    [junit] 2015-02-11 11:10:26,960 [myid:] - INFO  [main:ZooKeeperServer@787] - maxSessionTimeout set to 60000
    [junit] 2015-02-11 11:10:26,960 [myid:] - INFO  [main:ZooKeeperServer@153] - Created server with tickTime 3000 minSessionTimeout 6000 maxSessionTimeout 60000 datadir /home/jenkins/jenkins-slave/workspace/ZooKeeper_branch35_jdk7/branch-3.5/build/test/tmp/test7914013408244339525.junit.dir/version-2 snapdir /home/jenkins/jenkins-slave/workspace/ZooKeeper_branch35_jdk7/branch-3.5/build/test/tmp/test7914013408244339525.junit.dir/version-2
    [junit] 2015-02-11 11:10:26,962 [myid:] - INFO  [main:FileSnap@83] - Reading snapshot /home/jenkins/jenkins-slave/workspace/ZooKeeper_branch35_jdk7/branch-3.5/build/test/tmp/test7914013408244339525.junit.dir/version-2/snapshot.b
    [junit] 2015-02-11 11:10:26,964 [myid:] - INFO  [main:FileTxnSnapLog@298] - Snapshotting: 0xb to /home/jenkins/jenkins-slave/workspace/ZooKeeper_branch35_jdk7/branch-3.5/build/test/tmp/test7914013408244339525.junit.dir/version-2/snapshot.b
    [junit] 2015-02-11 11:10:26,965 [myid:] - INFO  [main:FourLetterWordMain@43] - connecting to 127.0.0.1 11221
    [junit] 2015-02-11 11:10:26,966 [myid:] - INFO  [NIOServerCxnFactory.AcceptThread:0.0.0.0/0.0.0.0:11221:NIOServerCnxnFactory$AcceptThread@296] - Accepted socket connection from /127.0.0.1:48014
    [junit] 2015-02-11 11:10:26,967 [myid:] - INFO  [NIOWorkerThread-1:NIOServerCnxn@835] - Processing stat command from /127.0.0.1:48014
    [junit] 2015-02-11 11:10:26,967 [myid:] - INFO  [NIOWorkerThread-1:NIOServerCnxn$StatCommand@684] - Stat command output
    [junit] 2015-02-11 11:10:26,967 [myid:] - INFO  [NIOWorkerThread-1:NIOServerCnxn@1006] - Closed socket connection for client /127.0.0.1:48014 (no session established for client)
    [junit] 2015-02-11 11:10:26,967 [myid:] - INFO  [main:JMXEnv@224] - ensureParent:[InMemoryDataTree, StandaloneServer_port]
    [junit] 2015-02-11 11:10:26,969 [myid:] - INFO  [main:JMXEnv@241] - expect:InMemoryDataTree
    [junit] 2015-02-11 11:10:26,969 [myid:] - INFO  [main:JMXEnv@245] - found:InMemoryDataTree org.apache.ZooKeeperService:name0=StandaloneServer_port11221,name1=InMemoryDataTree
    [junit] 2015-02-11 11:10:26,969 [myid:] - INFO  [main:JMXEnv@241] - expect:StandaloneServer_port
    [junit] 2015-02-11 11:10:26,970 [myid:] - INFO  [main:JMXEnv@245] - found:StandaloneServer_port org.apache.ZooKeeperService:name0=StandaloneServer_port11221
    [junit] 2015-02-11 11:10:26,970 [myid:] - INFO  [main:JUnit4ZKTestRunner$LoggedInvokeMethod@55] - Memory used 18104
    [junit] 2015-02-11 11:10:26,971 [myid:] - INFO  [main:JUnit4ZKTestRunner$LoggedInvokeMethod@60] - Number of threads 24
    [junit] 2015-02-11 11:10:26,971 [myid:] - INFO  [main:JUnit4ZKTestRunner$LoggedInvokeMethod@65] - FINISHED TEST METHOD testQuota
    [junit] 2015-02-11 11:10:26,971 [myid:] - INFO  [main:ClientBase@521] - tearDown starting
    [junit] 2015-02-11 11:10:27,040 [myid:] - INFO  [main:ZooKeeper@968] - Session: 0x102a0ab33e80000 closed
    [junit] 2015-02-11 11:10:27,040 [myid:] - INFO  [main:ClientBase@491] - STOPPING server
    [junit] 2015-02-11 11:10:27,040 [myid:] - INFO  [main-EventThread:ClientCnxn$EventThread@531] - EventThread shut down
    [junit] 2015-02-11 11:10:27,040 [myid:] - INFO  [NIOServerCxnFactory.SelectorThread-0:NIOServerCnxnFactory$SelectorThread@420] - selector thread exitted run method
    [junit] 2015-02-11 11:10:27,040 [myid:] - INFO  [NIOServerCxnFactory.SelectorThread-1:NIOServerCnxnFactory$SelectorThread@420] - selector thread exitted run method
    [junit] 2015-02-11 11:10:27,040 [myid:] - INFO  [NIOServerCxnFactory.AcceptThread:0.0.0.0/0.0.0.0:11221:NIOServerCnxnFactory$AcceptThread@219] - accept thread exitted run method
    [junit] 2015-02-11 11:10:27,040 [myid:] - INFO  [ConnnectionExpirer:NIOServerCnxnFactory$ConnectionExpirerThread@583] - ConnnectionExpirerThread interrupted
    [junit] 2015-02-11 11:10:27,041 [myid:] - INFO  [main:ZooKeeperServer@440] - shutting down
    [junit] 2015-02-11 11:10:27,041 [myid:] - INFO  [main:SessionTrackerImpl@232] - Shutting down
    [junit] 2015-02-11 11:10:27,042 [myid:] - INFO  [main:PrepRequestProcessor@974] - Shutting down
    [junit] 2015-02-11 11:10:27,042 [myid:] - INFO  [main:SyncRequestProcessor@191] - Shutting down
    [junit] 2015-02-11 11:10:27,042 [myid:] - INFO  [ProcessThread(sid:0 cport:11221)::PrepRequestProcessor@156] - PrepRequestProcessor exited loop!
    [junit] 2015-02-11 11:10:27,042 [myid:] - INFO  [SyncThread:0:SyncRequestProcessor@169] - SyncRequestProcessor exited!
    [junit] 2015-02-11 11:10:27,042 [myid:] - INFO  [main:FinalRequestProcessor@477] - shutdown of request processor complete
    [junit] 2015-02-11 11:10:27,043 [myid:] - INFO  [main:MBeanRegistry@119] - Unregister MBean [org.apache.ZooKeeperService:name0=StandaloneServer_port11221,name1=InMemoryDataTree]
    [junit] 2015-02-11 11:10:27,043 [myid:] - INFO  [main:MBeanRegistry@119] - Unregister MBean [org.apache.ZooKeeperService:name0=StandaloneServer_port11221]
    [junit] 2015-02-11 11:10:27,044 [myid:] - INFO  [main:FourLetterWordMain@43] - connecting to 127.0.0.1 11221
    [junit] 2015-02-11 11:10:27,044 [myid:] - INFO  [main:JMXEnv@142] - ensureOnly:[]
    [junit] 2015-02-11 11:10:27,054 [myid:] - INFO  [main:ClientBase@546] - fdcount after test is: 47 at start it was 33
    [junit] 2015-02-11 11:10:27,054 [myid:] - INFO  [main:ClientBase@548] - sleeping for 20 secs
    [junit] 2015-02-11 11:10:27,055 [myid:] - INFO  [main:ZKTestCase$1@65] - SUCCEEDED testQuota
    [junit] 2015-02-11 11:10:27,055 [myid:] - INFO  [main:ZKTestCase$1@60] - FINISHED testQuota
    [junit] Tests run: 1, Failures: 0, Errors: 0, Skipped: 0, Time elapsed: 0.569 sec

BUILD FAILED
/home/jenkins/jenkins-slave/workspace/ZooKeeper_branch35_jdk7/branch-3.5/build.xml:1422: The following error occurred while executing this line:
/home/jenkins/jenkins-slave/workspace/ZooKeeper_branch35_jdk7/branch-3.5/build.xml:1333: Tests failed!

Total time: 43 minutes 22 seconds
Build step 'Invoke Ant' marked build as failure
Archiving artifacts
Recording test results
Email was triggered for: Failure
Sending email for trigger: Failure



###################################################################################
############################## FAILED TESTS (if any) ##############################
1 tests failed.
REGRESSION:  org.apache.zookeeper.test.ClientPortBindTest.testBindByAddress

Error Message:
No such device

Stack Trace:
java.net.SocketException: No such device
	at java.net.NetworkInterface.isLoopback0(Native Method)
	at java.net.NetworkInterface.isLoopback(NetworkInterface.java:390)
	at org.apache.zookeeper.test.ClientPortBindTest.testBindByAddress(ClientPortBindTest.java:61)
	at org.apache.zookeeper.JUnit4ZKTestRunner$LoggedInvokeMethod.evaluate(JUnit4ZKTestRunner.java:52)



ZooKeeper_branch35_jdk7 - Build # 199 - Still Failing

Posted by Apache Jenkins Server <je...@builds.apache.org>.
See https://builds.apache.org/job/ZooKeeper_branch35_jdk7/199/

###################################################################################
########################## LAST 60 LINES OF THE CONSOLE ###########################
[...truncated 350933 lines...]
    [junit] 2015-02-10 11:31:57,552 [myid:] - INFO  [main:NIOServerCnxnFactory@670] - Configuring NIO connection handler with 10s sessionless connection timeout, 2 selector thread(s), 32 worker threads, and 64 kB direct buffers.
    [junit] 2015-02-10 11:31:57,552 [myid:] - INFO  [main:NIOServerCnxnFactory@683] - binding to port 0.0.0.0/0.0.0.0:11221
    [junit] 2015-02-10 11:31:57,553 [myid:] - INFO  [main:ClientBase@340] - STARTING server instance 127.0.0.1:11221
    [junit] 2015-02-10 11:31:57,553 [myid:] - INFO  [main:ZooKeeperServer@778] - minSessionTimeout set to 6000
    [junit] 2015-02-10 11:31:57,554 [myid:] - INFO  [main:ZooKeeperServer@787] - maxSessionTimeout set to 60000
    [junit] 2015-02-10 11:31:57,554 [myid:] - INFO  [main:ZooKeeperServer@153] - Created server with tickTime 3000 minSessionTimeout 6000 maxSessionTimeout 60000 datadir /home/jenkins/jenkins-slave/workspace/ZooKeeper_branch35_jdk7/branch-3.5/build/test/tmp/test8640085691586222301.junit.dir/version-2 snapdir /home/jenkins/jenkins-slave/workspace/ZooKeeper_branch35_jdk7/branch-3.5/build/test/tmp/test8640085691586222301.junit.dir/version-2
    [junit] 2015-02-10 11:31:57,555 [myid:] - INFO  [main:FileSnap@83] - Reading snapshot /home/jenkins/jenkins-slave/workspace/ZooKeeper_branch35_jdk7/branch-3.5/build/test/tmp/test8640085691586222301.junit.dir/version-2/snapshot.b
    [junit] 2015-02-10 11:31:57,558 [myid:] - INFO  [main:FileTxnSnapLog@298] - Snapshotting: 0xb to /home/jenkins/jenkins-slave/workspace/ZooKeeper_branch35_jdk7/branch-3.5/build/test/tmp/test8640085691586222301.junit.dir/version-2/snapshot.b
    [junit] 2015-02-10 11:31:57,560 [myid:] - INFO  [main:FourLetterWordMain@43] - connecting to 127.0.0.1 11221
    [junit] 2015-02-10 11:31:57,560 [myid:] - INFO  [NIOServerCxnFactory.AcceptThread:0.0.0.0/0.0.0.0:11221:NIOServerCnxnFactory$AcceptThread@296] - Accepted socket connection from /127.0.0.1:37509
    [junit] 2015-02-10 11:31:57,561 [myid:] - INFO  [NIOWorkerThread-1:NIOServerCnxn@835] - Processing stat command from /127.0.0.1:37509
    [junit] 2015-02-10 11:31:57,561 [myid:] - INFO  [NIOWorkerThread-1:NIOServerCnxn$StatCommand@684] - Stat command output
    [junit] 2015-02-10 11:31:57,562 [myid:] - INFO  [NIOWorkerThread-1:NIOServerCnxn@1006] - Closed socket connection for client /127.0.0.1:37509 (no session established for client)
    [junit] 2015-02-10 11:31:57,562 [myid:] - INFO  [main:JMXEnv@224] - ensureParent:[InMemoryDataTree, StandaloneServer_port]
    [junit] 2015-02-10 11:31:57,564 [myid:] - INFO  [main:JMXEnv@241] - expect:InMemoryDataTree
    [junit] 2015-02-10 11:31:57,564 [myid:] - INFO  [main:JMXEnv@245] - found:InMemoryDataTree org.apache.ZooKeeperService:name0=StandaloneServer_port11221,name1=InMemoryDataTree
    [junit] 2015-02-10 11:31:57,564 [myid:] - INFO  [main:JMXEnv@241] - expect:StandaloneServer_port
    [junit] 2015-02-10 11:31:57,564 [myid:] - INFO  [main:JMXEnv@245] - found:StandaloneServer_port org.apache.ZooKeeperService:name0=StandaloneServer_port11221
    [junit] 2015-02-10 11:31:57,565 [myid:] - INFO  [main:JUnit4ZKTestRunner$LoggedInvokeMethod@55] - Memory used 18106
    [junit] 2015-02-10 11:31:57,565 [myid:] - INFO  [main:JUnit4ZKTestRunner$LoggedInvokeMethod@60] - Number of threads 24
    [junit] 2015-02-10 11:31:57,565 [myid:] - INFO  [main:JUnit4ZKTestRunner$LoggedInvokeMethod@65] - FINISHED TEST METHOD testQuota
    [junit] 2015-02-10 11:31:57,565 [myid:] - INFO  [main:ClientBase@521] - tearDown starting
    [junit] 2015-02-10 11:31:57,624 [myid:] - INFO  [main-EventThread:ClientCnxn$EventThread@531] - EventThread shut down
    [junit] 2015-02-10 11:31:57,624 [myid:] - INFO  [main:ZooKeeper@968] - Session: 0x1000329f6010000 closed
    [junit] 2015-02-10 11:31:57,624 [myid:] - INFO  [main:ClientBase@491] - STOPPING server
    [junit] 2015-02-10 11:31:57,625 [myid:] - INFO  [ConnnectionExpirer:NIOServerCnxnFactory$ConnectionExpirerThread@583] - ConnnectionExpirerThread interrupted
    [junit] 2015-02-10 11:31:57,625 [myid:] - INFO  [NIOServerCxnFactory.AcceptThread:0.0.0.0/0.0.0.0:11221:NIOServerCnxnFactory$AcceptThread@219] - accept thread exitted run method
    [junit] 2015-02-10 11:31:57,625 [myid:] - INFO  [NIOServerCxnFactory.SelectorThread-1:NIOServerCnxnFactory$SelectorThread@420] - selector thread exitted run method
    [junit] 2015-02-10 11:31:57,625 [myid:] - INFO  [NIOServerCxnFactory.SelectorThread-0:NIOServerCnxnFactory$SelectorThread@420] - selector thread exitted run method
    [junit] 2015-02-10 11:31:57,625 [myid:] - INFO  [main:ZooKeeperServer@440] - shutting down
    [junit] 2015-02-10 11:31:57,626 [myid:] - INFO  [main:SessionTrackerImpl@232] - Shutting down
    [junit] 2015-02-10 11:31:57,626 [myid:] - INFO  [main:PrepRequestProcessor@974] - Shutting down
    [junit] 2015-02-10 11:31:57,626 [myid:] - INFO  [main:SyncRequestProcessor@191] - Shutting down
    [junit] 2015-02-10 11:31:57,626 [myid:] - INFO  [ProcessThread(sid:0 cport:11221)::PrepRequestProcessor@156] - PrepRequestProcessor exited loop!
    [junit] 2015-02-10 11:31:57,626 [myid:] - INFO  [SyncThread:0:SyncRequestProcessor@169] - SyncRequestProcessor exited!
    [junit] 2015-02-10 11:31:57,627 [myid:] - INFO  [main:FinalRequestProcessor@477] - shutdown of request processor complete
    [junit] 2015-02-10 11:31:57,627 [myid:] - INFO  [main:MBeanRegistry@119] - Unregister MBean [org.apache.ZooKeeperService:name0=StandaloneServer_port11221,name1=InMemoryDataTree]
    [junit] 2015-02-10 11:31:57,628 [myid:] - INFO  [main:MBeanRegistry@119] - Unregister MBean [org.apache.ZooKeeperService:name0=StandaloneServer_port11221]
    [junit] 2015-02-10 11:31:57,628 [myid:] - INFO  [main:FourLetterWordMain@43] - connecting to 127.0.0.1 11221
    [junit] 2015-02-10 11:31:57,628 [myid:] - INFO  [main:JMXEnv@142] - ensureOnly:[]
    [junit] 2015-02-10 11:31:57,652 [myid:] - INFO  [SessionTracker:SessionTrackerImpl@158] - SessionTrackerImpl exited loop!
    [junit] 2015-02-10 11:31:57,652 [myid:] - INFO  [SessionTracker:SessionTrackerImpl@158] - SessionTrackerImpl exited loop!
    [junit] 2015-02-10 11:31:57,652 [myid:] - INFO  [SessionTracker:SessionTrackerImpl@158] - SessionTrackerImpl exited loop!
    [junit] 2015-02-10 11:31:57,655 [myid:] - INFO  [main:ClientBase@546] - fdcount after test is: 47 at start it was 33
    [junit] 2015-02-10 11:31:57,655 [myid:] - INFO  [main:ClientBase@548] - sleeping for 20 secs
    [junit] 2015-02-10 11:31:57,657 [myid:] - INFO  [main:ZKTestCase$1@65] - SUCCEEDED testQuota
    [junit] 2015-02-10 11:31:57,657 [myid:] - INFO  [main:ZKTestCase$1@60] - FINISHED testQuota
    [junit] Tests run: 1, Failures: 0, Errors: 0, Skipped: 0, Time elapsed: 0.72 sec

BUILD FAILED
/home/jenkins/jenkins-slave/workspace/ZooKeeper_branch35_jdk7/branch-3.5/build.xml:1422: The following error occurred while executing this line:
/home/jenkins/jenkins-slave/workspace/ZooKeeper_branch35_jdk7/branch-3.5/build.xml:1333: Tests failed!

Total time: 51 minutes 15 seconds
Build step 'Invoke Ant' marked build as failure
Archiving artifacts
Recording test results
Email was triggered for: Failure
Sending email for trigger: Failure



###################################################################################
############################## FAILED TESTS (if any) ##############################
1 tests failed.
REGRESSION:  org.apache.zookeeper.server.quorum.QuorumPeerMainTest.testInconsistentPeerType

Error Message:
Should warn about inconsistent peer type

Stack Trace:
junit.framework.AssertionFailedError: Should warn about inconsistent peer type
	at org.apache.zookeeper.server.quorum.QuorumPeerMainTest.testInconsistentPeerType(QuorumPeerMainTest.java:533)
	at org.apache.zookeeper.JUnit4ZKTestRunner$LoggedInvokeMethod.evaluate(JUnit4ZKTestRunner.java:52)