You are viewing a plain text version of this content. The canonical link for it is here.
Posted to builds@cassandra.apache.org by Apache Jenkins Server <je...@builds.apache.org> on 2025/11/14 00:28:36 UTC
Build complete: Cassandra-5.0 #534 [UNSTABLE] e2f74ed65bbda8e8d515075a7122b963a13ffbe7
-------------------------------------------------------------------------------
Build Cassandra-5.0 #534 Still unstable
URL: https://ci-cassandra.apache.org/job/Cassandra-5.0/534/
-------------------------------------------------------------------------------
Changes:
[Stefan Miklosovic] Adding missing configs in system_views.settings to be backward
-------------------------------------------------------------------------------
Failed Tests:
14 tests failed.
FAILED: dtest-latest.bootstrap_test.TestBootstrap.Tests / dtest-latest jdk11 15/64 / test_decommissioned_wiped_node_can_join
FAILED: dtest-novnode.rebuild_test.TestRebuild.Tests / dtest-novnode jdk17 29/64 / test_rebuild_with_specific_sources
FAILED: dtest-upgrade-large.upgrade_tests.upgrade_through_versions_test.TestUpgrade_current_4_1_x_To_indev_5_0_x.Tests / dtest-upgrade-large jdk11 4/32 / test_bootstrap_multidc
FAILED: dtest-upgrade-novnode-large.upgrade_tests.upgrade_through_versions_test.TestUpgrade_current_4_1_x_To_indev_5_0_x.Tests / dtest-upgrade-novnode-large jdk11 3/32 / test_bootstrap
FAILED: dtest-upgrade-novnode-large.upgrade_tests.upgrade_through_versions_test.TestUpgrade_current_5_0_x_To_indev_5_0_x.Tests / dtest-upgrade-novnode-large jdk11 10/32 / test_bootstrap_multidc
FAILED: dtest-upgrade-novnode.upgrade_tests.cql_tests.TestCQLNodes3RF3_Upgrade_current_5_0_x_To_indev_5_0_x.Tests / dtest-upgrade-novnode jdk11 53/128 / test_conditional_delete
FAILED: dtest-upgrade-novnode.upgrade_tests.cql_tests.TestCQLNodes3RF3_Upgrade_current_5_0_x_To_indev_5_0_x.Tests / dtest-upgrade-novnode jdk11 54/128 / test_range_key_ordered
FAILED: dtest-upgrade.upgrade_tests.cql_tests.TestCQLNodes3RF3_Upgrade_current_4_0_x_To_indev_5_0_x.Tests / dtest-upgrade jdk11 80/128 / test_date
FAILED: dtest-upgrade.upgrade_tests.cql_tests.TestCQLNodes3RF3_Upgrade_current_4_0_x_To_indev_5_0_x.Tests / dtest-upgrade jdk11 39/128 / test_static_cf
FAILED: dtest-upgrade.upgrade_tests.cql_tests.TestCQLNodes3RF3_Upgrade_current_5_0_x_To_indev_5_0_x.Tests / dtest-upgrade jdk11 44/128 / test_whole_map_conditional
FAILED: dtest.bootstrap_test.TestBootstrap.Tests / dtest jdk17 2/64 / test_read_from_bootstrapped_node
FAILED: org.apache.cassandra.distributed.test.repair.ForceRepairTest.Tests / jvm-dtest jdk11 4/12 / forceWithDifference-cassandra.testtag_IS_UNDEFINED
FAILED: org.apache.cassandra.net.ConnectionTest.Tests / test-oa jdk11 5/16 / testMessageDeliveryOnReconnect-oa_jdk11_x86_64
FAILED: org.apache.cassandra.transport.AuthMessageSizeLimitTest.Tests / test-cdc jdk17 6/8 / sendTooBigAuthMultiFrameMessage-cdc_jdk17_x86_64
-------------------------------------------------------------------------------
For complete test report and logs see https://nightlies.apache.org/cassandra/Cassandra-5.0/534/