You are viewing a plain text version of this content. The canonical link for it is here.
Posted to dev@geronimo.apache.org by ga...@apache.org on 2010/08/19 22:06:54 UTC
[BUILD] branches/2.2: Failed for Revision: 986984
Geronimo Revision: 986984 built with tests included
See the full build-2000.log file at http://people.apache.org/builds/geronimo/server/binaries/2.2/20100818/build-2000.log
Download the binaries from http://people.apache.org/builds/geronimo/server/binaries/2.2/20100818
[INFO] BUILD SUCCESSFUL
[INFO] ------------------------------------------------------------------------
[INFO] Total time: 36 minutes 10 seconds
[INFO] Finished at: Wed Aug 18 20:39:52 EDT 2010
[INFO] Final Memory: 326M/921M
[INFO] ------------------------------------------------------------------------
TESTSUITE RESULTS (Failures only)
=================================
Assembly: tomcat
=================================
See full test results and logs at http://people.apache.org/builds/geronimo/server/binaries/2.2/20100818/logs-2000-tomcat/
[INFO] Running TestSuite
[INFO] Tests run: 40, Failures: 31, Errors: 0, Skipped: 0, Time elapsed: 175.9 sec <<< FAILURE!
[INFO] Running TestSuite
[INFO] Tests run: 12, Failures: 8, Errors: 0, Skipped: 0, Time elapsed: 71.487 sec <<< FAILURE!
--
[INFO] Running TestSuite
[INFO] Tests run: 36, Failures: 1, Errors: 0, Skipped: 0, Time elapsed: 68.534 sec <<< FAILURE!
Assembly: jetty
=================================
See full test results and logs at http://people.apache.org/builds/geronimo/server/binaries/2.2/20100818/logs-2000-jetty/
[INFO] Scanning for projects...
[INFO] Reactor build order:
[INFO] Geronimo TestSuite
[INFO] Geronimo TestSuite :: Commands TestSuite
[INFO] Geronimo TestSuite :: Concurrent TestSuite
[INFO] Geronimo TestSuite :: Console Testsuite
[INFO] Geronimo TestSuite :: CORBA TestSuite
[INFO] Geronimo TestSuite :: Deployment Testsuite
[INFO] Geronimo TestSuite :: Enterprise Testsuite
[INFO] Geronimo TestSuite :: Security Testsuite
[INFO] Geronimo TestSuite :: Web-tier Testsuite
[INFO] Geronimo TestSuite :: WebServices TestSuite
[INFO] ------------------------------------------------------------------------
[INFO] Building Geronimo TestSuite
[INFO] task-segment: [install]
[INFO] ------------------------------------------------------------------------
[INFO] [genesis:validate-configuration {execution: default}]
[INFO] [enforcer:enforce {execution: default}]
[INFO] Setting property: classpath.resource.loader.class => 'org.codehaus.plexus.velocity.ContextClassLoaderResourceLoader'.
[INFO] Setting property: velocimacro.messages.on => 'false'.
[INFO] Setting property: resource.loader => 'classpath'.
[INFO] Setting property: resource.manager.logwhenfound => 'false'.
[INFO] [remote-resources:process {execution: default}]
[INFO] [site:attach-descriptor]
[INFO] [ianal:verify-legal-files {execution: default}]
[INFO] [install:install]
[INFO] Installing /home/geronimo/geronimo/2.2/testsuite/pom.xml to /home/geronimo/.m2/repository/org/apache/geronimo/testsuite/testsuite/2.2.2-SNAPSHOT/testsuite-2.2.2-SNAPSHOT.pom
[INFO] ------------------------------------------------------------------------
[INFO] Building Geronimo TestSuite :: Commands TestSuite
[INFO] task-segment: [install]
[INFO] ------------------------------------------------------------------------
[INFO] [genesis:validate-configuration {execution: default}]
[INFO] [enforcer:enforce {execution: default}]
[INFO] [remote-resources:process {execution: default}]
[INFO] [site:attach-descriptor]
[INFO] [geronimo:start-server {execution: start}]
[INFO] Using assembly configuration: jetty
[INFO] snapshot org.apache.geronimo.assemblies:geronimo-jetty7-javaee5:2.2.2-SNAPSHOT: checking for updates from codehaus.snapshots
[INFO] snapshot org.apache.geronimo.assemblies:geronimo-jetty7-javaee5:2.2.2-SNAPSHOT: checking for updates from apache.snapshots
[INFO] Using assembly artifact: org.apache.geronimo.assemblies:geronimo-jetty7-javaee5:zip:bin:2.2.2-SNAPSHOT:provided
[INFO] Using geronimoHome: /home/geronimo/geronimo/2.2/testsuite/commands-testsuite/target/geronimo-jetty7-javaee5-2.2.2-SNAPSHOT
[INFO] Installing assembly...
[INFO] Expanding: /home/geronimo/.m2/repository/org/apache/geronimo/assemblies/geronimo-jetty7-javaee5/2.2.2-SNAPSHOT/geronimo-jetty7-javaee5-2.2.2-SNAPSHOT-bin.zip into /home/geronimo/geronimo/2.2/testsuite/commands-testsuite/target
[INFO] Starting Geronimo server...
[INFO] Selected option set: default
[INFO] Redirecting output to: /home/geronimo/geronimo/2.2/testsuite/commands-testsuite/target/geronimo-logs/org.apache.geronimo.mavenplugins.geronimo.server.StartServerMojo.log
[INFO] Waiting for Geronimo server...
[INFO] ------------------------------------------------------------------------
[ERROR] BUILD ERROR
Samples: branches/2.2
=================================
Log: http://people.apache.org/builds/geronimo/server/binaries/2.2/20100818/samples-2000.log
Build status: FAILED