You are viewing a plain text version of this content. The canonical link for it is here.
Posted to yarn-dev@hadoop.apache.org by Apache Jenkins Server <je...@builds.apache.org> on 2015/03/17 13:21:04 UTC

Failed: YARN-1974 PreCommit Build #6999

Jira: https://issues.apache.org/jira/browse/YARN-1974
Build: https://builds.apache.org/job/PreCommit-YARN-Build/6999/

###################################################################################
########################## LAST 60 LINES OF THE CONSOLE ###########################
[...truncated 58 lines...]
import org.apache.hadoop.yarn.util.ConverterUtils;
import org.apache.hadoop.yarn.util.Records;

/**
 * Client for Distributed Shell application submission to YARN.

error: patch failed: hadoop-yarn-project/hadoop-yarn/hadoop-yarn-applications/hadoop-yarn-applications-distributedshell/src/main/java/org/apache/hadoop/yarn/applications/distributedshell/Client.java:76
error: hadoop-yarn-project/hadoop-yarn/hadoop-yarn-applications/hadoop-yarn-applications-distributedshell/src/main/java/org/apache/hadoop/yarn/applications/distributedshell/Client.java: patch does not apply
Checking patch hadoop-yarn-project/hadoop-yarn/hadoop-yarn-applications/hadoop-yarn-applications-distributedshell/src/test/java/org/apache/hadoop/yarn/applications/distributedshell/TestDistributedShell.java...
error: while searching for:
import java.net.URL;
import java.util.ArrayList;
import java.util.List;
import java.util.concurrent.atomic.AtomicBoolean;

import org.junit.Assert;

error: patch failed: hadoop-yarn-project/hadoop-yarn/hadoop-yarn-applications/hadoop-yarn-applications-distributedshell/src/test/java/org/apache/hadoop/yarn/applications/distributedshell/TestDistributedShell.java:29
error: hadoop-yarn-project/hadoop-yarn/hadoop-yarn-applications/hadoop-yarn-applications-distributedshell/src/test/java/org/apache/hadoop/yarn/applications/distributedshell/TestDistributedShell.java: patch does not apply
PATCH APPLICATION FAILED




{color:red}-1 overall{color}.  Here are the results of testing the latest attachment 
  http://issues.apache.org/jira/secure/attachment/12641444/YARN-1974.patch
  against trunk revision 7179f94.

    {color:red}-1 patch{color}.  The patch command could not apply the patch.

Console output: https://builds.apache.org/job/PreCommit-YARN-Build/6999//console

This message is automatically generated.


======================================================================
======================================================================
    Adding comment to Jira.
======================================================================
======================================================================


Comment added.
6bab65da7b5bd44f8e48b1acf31a237bd42a4c86 logged out


======================================================================
======================================================================
    Finished build.
======================================================================
======================================================================


Build step 'Execute shell' marked build as failure
Archiving artifacts
[description-setter] Could not determine description.
Recording test results
Email was triggered for: Failure
Sending email for trigger: Failure



###################################################################################
############################## FAILED TESTS (if any) ##############################
No tests ran.

Success: YARN-2495 PreCommit Build #7003

Posted by Apache Jenkins Server <je...@builds.apache.org>.
Jira: https://issues.apache.org/jira/browse/YARN-2495
Build: https://builds.apache.org/job/PreCommit-YARN-Build/7003/

###################################################################################
########################## LAST 60 LINES OF THE CONSOLE ###########################
[...truncated 4120 lines...]




{color:green}+1 overall{color}.  Here are the results of testing the latest attachment 
  http://issues.apache.org/jira/secure/attachment/12705179/YARN-2495.20150318-1.patch
  against trunk revision 968425e.

    {color:green}+1 @author{color}.  The patch does not contain any @author tags.

    {color:green}+1 tests included{color}.  The patch appears to include 5 new or modified test files.

    {color:green}+1 javac{color}.  The applied patch does not increase the total number of javac compiler warnings.

    {color:green}+1 javadoc{color}.  There were no new javadoc warning messages.

    {color:green}+1 eclipse:eclipse{color}.  The patch built with eclipse:eclipse.

    {color:green}+1 findbugs{color}.  The patch does not introduce any new Findbugs (version 2.0.3) warnings.

    {color:green}+1 release audit{color}.  The applied patch does not increase the total number of release audit warnings.

    {color:green}+1 core tests{color}.  The patch passed unit tests in hadoop-yarn-project/hadoop-yarn/hadoop-yarn-api hadoop-yarn-project/hadoop-yarn/hadoop-yarn-client hadoop-yarn-project/hadoop-yarn/hadoop-yarn-server/hadoop-yarn-server-common hadoop-yarn-project/hadoop-yarn/hadoop-yarn-server/hadoop-yarn-server-nodemanager hadoop-yarn-project/hadoop-yarn/hadoop-yarn-server/hadoop-yarn-server-resourcemanager.

Test results: https://builds.apache.org/job/PreCommit-YARN-Build/7003//testReport/
Console output: https://builds.apache.org/job/PreCommit-YARN-Build/7003//console

This message is automatically generated.


======================================================================
======================================================================
    Adding comment to Jira.
======================================================================
======================================================================


Comment added.
142a072660f8af5a27cf4bf2b6403ccd967cabf0 logged out


======================================================================
======================================================================
    Finished build.
======================================================================
======================================================================


Archiving artifacts
Sending artifact delta relative to PreCommit-YARN-Build #6991
Archived 35 artifacts
Archive block size is 32768
Received 50 blocks and 8191988 bytes
Compression is 16.7%
Took 1.8 sec
Description set: YARN-2495
Recording test results
Email was triggered for: Success
Sending email for trigger: Success



###################################################################################
############################## FAILED TESTS (if any) ##############################
All tests passed

Failed: YARN-3345 PreCommit Build #7002

Posted by Apache Jenkins Server <je...@builds.apache.org>.
Jira: https://issues.apache.org/jira/browse/YARN-3345
Build: https://builds.apache.org/job/PreCommit-YARN-Build/7002/

###################################################################################
########################## LAST 60 LINES OF THE CONSOLE ###########################
[...truncated 3227 lines...]


/bin/grep: /home/jenkins/jenkins-slave/workspace/PreCommit-YARN-Build/../patchprocess/patch: No such file or directory
cat: /tmp/tmp.modules.16840: No such file or directory
rm: cannot remove '/tmp/tmp.modules.16840': No such file or directory




{color:red}-1 overall{color}.  Here are the results of testing the latest attachment 
  http://issues.apache.org/jira/secure/attachment/12705175/YARN-3345.4.patch
  against trunk revision 968425e.

    {color:green}+1 @author{color}.  The patch does not contain any @author tags.

    {color:green}+1 tests included{color}.  The patch appears to include 5 new or modified test files.

    {color:green}+1 javac{color}.  The applied patch does not increase the total number of javac compiler warnings.

    {color:green}+1 javadoc{color}.  There were no new javadoc warning messages.

    {color:red}-1 eclipse:eclipse{color}.  The patch failed to build with eclipse:eclipse.

    {color:green}+1 findbugs{color}.  The patch does not introduce any new Findbugs (version 2.0.3) warnings.

    {color:green}+1 release audit{color}.  The applied patch does not increase the total number of release audit warnings.

    {color:green}+1 core tests{color}.  The patch passed unit tests in .

Test results: https://builds.apache.org/job/PreCommit-YARN-Build/7002//testReport/
Console output: https://builds.apache.org/job/PreCommit-YARN-Build/7002//console

This message is automatically generated.


======================================================================
======================================================================
    Adding comment to Jira.
======================================================================
======================================================================


Comment added.
2cb727bca55d4e917e634b5aeb344607bf68114a logged out


======================================================================
======================================================================
    Finished build.
======================================================================
======================================================================


Build step 'Execute shell' marked build as failure
Archiving artifacts
[description-setter] Could not determine description.
Recording test results
Email was triggered for: Failure
Sending email for trigger: Failure



###################################################################################
############################## FAILED TESTS (if any) ##############################
No tests ran.

Failed: YARN-3356 PreCommit Build #7001

Posted by Apache Jenkins Server <je...@builds.apache.org>.
Jira: https://issues.apache.org/jira/browse/YARN-3356
Build: https://builds.apache.org/job/PreCommit-YARN-Build/7001/

###################################################################################
########################## LAST 60 LINES OF THE CONSOLE ###########################
[...truncated 3507 lines...]


{color:red}-1 overall{color}.  Here are the results of testing the latest attachment 
  http://issues.apache.org/jira/secure/attachment/12705148/YARN-3356.1.patch
  against trunk revision d884670.

    {color:green}+1 @author{color}.  The patch does not contain any @author tags.

    {color:green}+1 tests included{color}.  The patch appears to include 5 new or modified test files.

    {color:green}+1 javac{color}.  The applied patch does not increase the total number of javac compiler warnings.

    {color:green}+1 javadoc{color}.  There were no new javadoc warning messages.

    {color:green}+1 eclipse:eclipse{color}.  The patch built with eclipse:eclipse.

    {color:red}-1 findbugs{color}.  The patch appears to introduce 5 new Findbugs (version 2.0.3) warnings.

    {color:green}+1 release audit{color}.  The applied patch does not increase the total number of release audit warnings.

    {color:green}+1 core tests{color}.  The patch passed unit tests in hadoop-yarn-project/hadoop-yarn/hadoop-yarn-server/hadoop-yarn-server-resourcemanager.

Test results: https://builds.apache.org/job/PreCommit-YARN-Build/7001//testReport/
Findbugs warnings: https://builds.apache.org/job/PreCommit-YARN-Build/7001//artifact/patchprocess/newPatchFindbugsWarningshadoop-yarn-server-resourcemanager.html
Console output: https://builds.apache.org/job/PreCommit-YARN-Build/7001//console

This message is automatically generated.


======================================================================
======================================================================
    Adding comment to Jira.
======================================================================
======================================================================


Comment added.
66dff3389e3ecd36fa3007e74e7ae02055232821 logged out


======================================================================
======================================================================
    Finished build.
======================================================================
======================================================================


Build step 'Execute shell' marked build as failure
Archiving artifacts
Sending artifact delta relative to PreCommit-YARN-Build #6991
Archived 15 artifacts
Archive block size is 32768
Received 56 blocks and 7248573 bytes
Compression is 20.2%
Took 3.2 sec
[description-setter] Could not determine description.
Recording test results
Email was triggered for: Failure
Sending email for trigger: Failure



###################################################################################
############################## FAILED TESTS (if any) ##############################
All tests passed

Failed: YARN-3169 PreCommit Build #7000

Posted by Apache Jenkins Server <je...@builds.apache.org>.
Jira: https://issues.apache.org/jira/browse/YARN-3169
Build: https://builds.apache.org/job/PreCommit-YARN-Build/7000/

###################################################################################
########################## LAST 60 LINES OF THE CONSOLE ###########################
[...truncated 3109 lines...]


{color:green}+1 overall{color}.  Here are the results of testing the latest attachment 
  http://issues.apache.org/jira/secure/attachment/12705083/YARN-3169.patch
  against trunk revision 7179f94.

    {color:green}+1 @author{color}.  The patch does not contain any @author tags.

    {color:green}+0 tests included{color}.  The patch appears to be a documentation patch that doesn't require tests.

    {color:green}+1 javac{color}.  The applied patch does not increase the total number of javac compiler warnings.

    {color:green}+1 javadoc{color}.  There were no new javadoc warning messages.

    {color:green}+1 eclipse:eclipse{color}.  The patch built with eclipse:eclipse.

    {color:green}+1 findbugs{color}.  The patch does not introduce any new Findbugs (version 2.0.3) warnings.

    {color:green}+1 release audit{color}.  The applied patch does not increase the total number of release audit warnings.

    {color:green}+1 core tests{color}.  The patch passed unit tests in .

Test results: https://builds.apache.org/job/PreCommit-YARN-Build/7000//testReport/
Console output: https://builds.apache.org/job/PreCommit-YARN-Build/7000//console

This message is automatically generated.


======================================================================
======================================================================
    Adding comment to Jira.
======================================================================
======================================================================


Comment added.
ae352e28f07c5de2ad4627b46a1e4a265ddd291f logged out


======================================================================
======================================================================
    Finished build.
======================================================================
======================================================================


Archiving artifacts
Sending artifact delta relative to PreCommit-YARN-Build #6991
Archived 10 artifacts
Archive block size is 32768
Received 56 blocks and 6900405 bytes
Compression is 21.0%
Took 3.7 sec
Description set: YARN-3169
Recording test results
No test report files were found. Configuration error?
Build step 'Publish JUnit test result report' changed build result to FAILURE
Email was triggered for: Failure
Sending email for trigger: Failure



###################################################################################
############################## FAILED TESTS (if any) ##############################
No tests ran.