You are viewing a plain text version of this content. The canonical link for it is here.
Posted to builds@lucene.apache.org by Apache Jenkins Server <je...@builds.apache.org> on 2025/08/19 03:56:15 UTC
[JENKINS] Lucene » Lucene-NightlyTests-main - Build # 1762 - Unstable!
Build: https://ci-builds.apache.org/job/Lucene/job/Lucene-NightlyTests-main/1762/
1 tests failed.
FAILED: org.apache.lucene.search.TestRescoreTopNQuery.testLateInteractionQuery
Error Message:
java.lang.IllegalStateException: this writer hit an unrecoverable error; cannot merge
Stack Trace:
java.lang.IllegalStateException: this writer hit an unrecoverable error; cannot merge
at org.apache.lucene.index.IndexWriter.hasPendingMerges(IndexWriter.java:2436)
at org.apache.lucene.index.IndexWriter$IndexWriterMergeSource.hasPendingMerges(IndexWriter.java:6507)
at org.apache.lucene.index.ConcurrentMergeScheduler.maybeStall(ConcurrentMergeScheduler.java:615)
at org.apache.lucene.index.ConcurrentMergeScheduler.merge(ConcurrentMergeScheduler.java:570)
at org.apache.lucene.index.IndexWriter.executeMerge(IndexWriter.java:2326)
at org.apache.lucene.index.IndexWriter.maybeMerge(IndexWriter.java:2321)
at org.apache.lucene.index.IndexWriter.flush(IndexWriter.java:4229)
at org.apache.lucene.index.IndexWriter.flush(IndexWriter.java:4207)
at org.apache.lucene.search.TestRescoreTopNQuery.testLateInteractionQuery(TestRescoreTopNQuery.java:198)
at java.base/jdk.internal.reflect.DirectMethodHandleAccessor.invoke(DirectMethodHandleAccessor.java:104)
at java.base/java.lang.reflect.Method.invoke(Method.java:565)
at com.carrotsearch.randomizedtesting.RandomizedRunner.invoke(RandomizedRunner.java:1763)
at com.carrotsearch.randomizedtesting.RandomizedRunner$8.evaluate(RandomizedRunner.java:946)
at com.carrotsearch.randomizedtesting.RandomizedRunner$9.evaluate(RandomizedRunner.java:982)
at com.carrotsearch.randomizedtesting.RandomizedRunner$10.evaluate(RandomizedRunner.java:996)
at org.apache.lucene.tests.util.TestRuleSetupTeardownChained$1.evaluate(TestRuleSetupTeardownChained.java:48)
at org.apache.lucene.tests.util.AbstractBeforeAfterRule$1.evaluate(AbstractBeforeAfterRule.java:43)
at org.apache.lucene.tests.util.TestRuleThreadAndTestName$1.evaluate(TestRuleThreadAndTestName.java:45)
at org.apache.lucene.tests.util.TestRuleIgnoreAfterMaxFailures$1.evaluate(TestRuleIgnoreAfterMaxFailures.java:60)
at org.apache.lucene.tests.util.TestRuleMarkFailure$1.evaluate(TestRuleMarkFailure.java:44)
at org.junit.rules.RunRules.evaluate(RunRules.java:20)
at com.carrotsearch.randomizedtesting.rules.StatementAdapter.evaluate(StatementAdapter.java:36)
at com.carrotsearch.randomizedtesting.ThreadLeakControl$StatementRunner.run(ThreadLeakControl.java:390)
at com.carrotsearch.randomizedtesting.ThreadLeakControl.forkTimeoutingTask(ThreadLeakControl.java:843)
at com.carrotsearch.randomizedtesting.ThreadLeakControl$3.evaluate(ThreadLeakControl.java:490)
at com.carrotsearch.randomizedtesting.RandomizedRunner.runSingleTest(RandomizedRunner.java:955)
at com.carrotsearch.randomizedtesting.RandomizedRunner$5.evaluate(RandomizedRunner.java:840)
at com.carrotsearch.randomizedtesting.RandomizedRunner$6.evaluate(RandomizedRunner.java:891)
at com.carrotsearch.randomizedtesting.RandomizedRunner$7.evaluate(RandomizedRunner.java:902)
at org.apache.lucene.tests.util.AbstractBeforeAfterRule$1.evaluate(AbstractBeforeAfterRule.java:43)
at com.carrotsearch.randomizedtesting.rules.StatementAdapter.evaluate(StatementAdapter.java:36)
at org.apache.lucene.tests.util.TestRuleStoreClassName$1.evaluate(TestRuleStoreClassName.java:38)
at com.carrotsearch.randomizedtesting.rules.NoShadowingOrOverridesOnMethodsRule$1.evaluate(NoShadowingOrOverridesOnMethodsRule.java:40)
at com.carrotsearch.randomizedtesting.rules.NoShadowingOrOverridesOnMethodsRule$1.evaluate(NoShadowingOrOverridesOnMethodsRule.java:40)
at com.carrotsearch.randomizedtesting.rules.StatementAdapter.evaluate(StatementAdapter.java:36)
at com.carrotsearch.randomizedtesting.rules.StatementAdapter.evaluate(StatementAdapter.java:36)
at org.apache.lucene.tests.util.TestRuleAssertionsRequired$1.evaluate(TestRuleAssertionsRequired.java:53)
at org.apache.lucene.tests.util.AbstractBeforeAfterRule$1.evaluate(AbstractBeforeAfterRule.java:43)
at org.apache.lucene.tests.util.TestRuleMarkFailure$1.evaluate(TestRuleMarkFailure.java:44)
at org.apache.lucene.tests.util.TestRuleIgnoreAfterMaxFailures$1.evaluate(TestRuleIgnoreAfterMaxFailures.java:60)
at org.apache.lucene.tests.util.TestRuleIgnoreTestSuites$1.evaluate(TestRuleIgnoreTestSuites.java:47)
at org.junit.rules.RunRules.evaluate(RunRules.java:20)
at com.carrotsearch.randomizedtesting.rules.StatementAdapter.evaluate(StatementAdapter.java:36)
at com.carrotsearch.randomizedtesting.ThreadLeakControl$StatementRunner.run(ThreadLeakControl.java:390)
at com.carrotsearch.randomizedtesting.ThreadLeakControl.lambda$forkTimeoutingTask$0(ThreadLeakControl.java:850)
at java.base/java.lang.Thread.run(Thread.java:1447)
Caused by: java.lang.OutOfMemoryError: Java heap space
at java.base/java.nio.HeapByteBuffer.<init>(HeapByteBuffer.java:75)
at java.base/java.nio.ByteBuffer.allocate(ByteBuffer.java:398)
at org.apache.lucene.store.ByteBuffersDataOutput$$Lambda/0x00007f1c1b19b508.apply(Unknown Source)
at org.apache.lucene.store.ByteBuffersDataOutput.appendBlock(ByteBuffersDataOutput.java:506)
at org.apache.lucene.store.ByteBuffersDataOutput.writeBytes(ByteBuffersDataOutput.java:221)
at org.apache.lucene.store.ByteBuffersDataOutput.rewriteToBlockSize(ByteBuffersDataOutput.java:523)
at org.apache.lucene.store.ByteBuffersDataOutput.appendBlock(ByteBuffersDataOutput.java:499)
at org.apache.lucene.store.ByteBuffersDataOutput.writeBytes(ByteBuffersDataOutput.java:197)
at org.apache.lucene.store.ByteBuffersIndexOutput.writeBytes(ByteBuffersIndexOutput.java:106)
at org.apache.lucene.tests.store.MockIndexOutputWrapper.writeBytes(MockIndexOutputWrapper.java:146)
at org.apache.lucene.tests.store.MockIndexOutputWrapper.writeByte(MockIndexOutputWrapper.java:131)
at org.apache.lucene.store.RateLimitedIndexOutput.writeByte(RateLimitedIndexOutput.java:49)
at org.apache.lucene.codecs.simpletext.SimpleTextDocValuesWriter.doAddBinaryField(SimpleTextDocValuesWriter.java:239)
at org.apache.lucene.codecs.simpletext.SimpleTextDocValuesWriter.addBinaryField(SimpleTextDocValuesWriter.java:184)
at org.apache.lucene.codecs.DocValuesConsumer.mergeBinaryField(DocValuesConsumer.java:302)
at org.apache.lucene.codecs.DocValuesConsumer.merge(DocValuesConsumer.java:145)
at org.apache.lucene.index.SegmentMerger.mergeDocValues(SegmentMerger.java:188)
at org.apache.lucene.index.SegmentMerger$$Lambda/0x00007f1c1b28e528.merge(Unknown Source)
at org.apache.lucene.index.SegmentMerger.mergeWithLogging(SegmentMerger.java:314)
at org.apache.lucene.index.SegmentMerger.merge(SegmentMerger.java:149)
at org.apache.lucene.index.IndexWriter.mergeMiddle(IndexWriter.java:5252)
at org.apache.lucene.index.IndexWriter.merge(IndexWriter.java:4721)
at org.apache.lucene.index.IndexWriter$IndexWriterMergeSource.merge(IndexWriter.java:6513)
at org.apache.lucene.index.ConcurrentMergeScheduler.doMerge(ConcurrentMergeScheduler.java:665)
at org.apache.lucene.index.ConcurrentMergeScheduler$MergeThread.run(ConcurrentMergeScheduler.java:726)
Build Log:
[...truncated 1187 lines...]
ERROR: The following test has failed:
- org.apache.lucene.search.TestRescoreTopNQuery.testLateInteractionQuery (:lucene:core)
Test output: /home/jenkins/jenkins-agent/workspace/Lucene/Lucene-NightlyTests-main/checkout/lucene/core/build/test-results/test/outputs/OUTPUT-org.apache.lucene.search.TestRescoreTopNQuery.txt
Reproduce with: gradlew :lucene:core:test --tests "org.apache.lucene.search.TestRescoreTopNQuery.testLateInteractionQuery" -Ptests.file.encoding=UTF-8 -Ptests.gui=true -Ptests.haltonfailure=false -Ptests.jvmargs= -Ptests.jvms=4 -Ptests.linedocsfile=/home/jenkins/jenkins-agent/workspace/Lucene/Lucene-NightlyTests-main/test-data/enwiki.random.lines.txt -Ptests.multiplier=2 -Ptests.nightly=true -Ptests.seed=C2C0E8D427AE7085 -Ptests.vectorsize=128
[Incubating] Problems report is available at: file:///home/jenkins/jenkins-agent/workspace/Lucene/Lucene-NightlyTests-main/checkout/build/reports/problems/problems-report.html
Deprecated Gradle features were used in this build, making it incompatible with Gradle 9.0.
You can use '--warning-mode all' to show the individual deprecation warnings and determine if they come from your own scripts or plugins.
For more on this, please refer to https://docs.gradle.org/8.14/userguide/command_line_interface.html#sec:command_line_warnings in the Gradle documentation.
BUILD SUCCESSFUL in 1h 41m
257 actionable tasks: 146 executed, 111 up-to-date
Build step 'Invoke Gradle script' changed build result to SUCCESS
Archiving artifacts
Recording test results
[Checks API] No suitable checks publisher found.
Build step 'Publish JUnit test result report' changed build result to UNSTABLE
Email was triggered for: Unstable (Test Failures)
Sending email for trigger: Unstable (Test Failures)