You are viewing a plain text version of this content. The canonical link for it is here.
Posted to dev@cassandra.apache.org by Apache Jenkins Server <je...@builds.apache.org> on 2012/08/21 12:41:04 UTC
Build failed in Jenkins: Cassandra-quick #1127
See <https://builds.apache.org/job/Cassandra-quick/1127/>
------------------------------------------
[...truncated 388 lines...]
[junit] Testsuite: org.apache.cassandra.io.BloomFilterTrackerTest
[junit] Tests run: 3, Failures: 0, Errors: 0, Time elapsed: 5.185 sec
[junit]
[junit] Testsuite: org.apache.cassandra.io.CompactSerializerTest
[junit] Tests run: 2, Failures: 0, Errors: 0, Time elapsed: 6.575 sec
[junit]
[junit] Testsuite: org.apache.cassandra.io.LazilyCompactedRowTest
[junit] Tests run: 7, Failures: 0, Errors: 0, Time elapsed: 6.36 sec
[junit]
[junit] Testsuite: org.apache.cassandra.io.compress.CompressedRandomAccessReaderTest
[junit] Tests run: 3, Failures: 0, Errors: 0, Time elapsed: 0.788 sec
[junit]
[junit] ------------- Standard Error -----------------
[junit] WARN 10:37:35,917 open(null, O_RDONLY) failed, errno (14).
[junit] ------------- ---------------- ---------------
[junit] Testsuite: org.apache.cassandra.io.sstable.DescriptorTest
[junit] Tests run: 3, Failures: 0, Errors: 0, Time elapsed: 0.047 sec
[junit]
[junit] Testsuite: org.apache.cassandra.io.sstable.IndexHelperTest
[junit] Testsuite: org.apache.cassandra.io.sstable.IndexHelperTest
[junit] Tests run: 1, Failures: 0, Errors: 0, Time elapsed: 0.046 sec
[junit]
[junit] Testsuite: org.apache.cassandra.io.sstable.LegacySSTableTest
[junit] Tests run: 1, Failures: 0, Errors: 0, Time elapsed: 5.849 sec
[junit]
[junit] Testsuite: org.apache.cassandra.io.sstable.SSTableMetadataSerializerTest
[junit] Tests run: 1, Failures: 0, Errors: 0, Time elapsed: 0.103 sec
[junit]
[junit] Testsuite: org.apache.cassandra.io.sstable.SSTableReaderTest
[junit] Tests run: 8, Failures: 0, Errors: 0, Time elapsed: 5.354 sec
[junit]
[junit] ------------- Standard Error -----------------
[junit] WARN 10:37:49,673 setting live ratio to maximum of 64.0 instead of 88.44444444444444
[junit] WARN 10:37:49,794 setting live ratio to maximum of 64.0 instead of 66.22009569377991
[junit] ------------- ---------------- ---------------
[junit] Testsuite: org.apache.cassandra.io.sstable.SSTableSimpleWriterTest
[junit] Tests run: 1, Failures: 0, Errors: 0, Time elapsed: 5.357 sec
[junit]
[junit] Testsuite: org.apache.cassandra.io.sstable.SSTableTest
[junit] Tests run: 2, Failures: 0, Errors: 0, Time elapsed: 5.365 sec
[junit]
[junit] Testsuite: org.apache.cassandra.io.util.BufferedRandomAccessFileTest
[junit] Tests run: 18, Failures: 0, Errors: 0, Time elapsed: 0.932 sec
[junit]
[junit] Testsuite: org.apache.cassandra.locator.DynamicEndpointSnitchTest
[junit] Tests run: 1, Failures: 0, Errors: 0, Time elapsed: 2.012 sec
[junit]
[junit] Testsuite: org.apache.cassandra.locator.EC2SnitchTest
[junit] Tests run: 2, Failures: 0, Errors: 0, Time elapsed: 0.703 sec
[junit]
[junit] Testsuite: org.apache.cassandra.locator.NetworkTopologyStrategyTest
[junit] Tests run: 3, Failures: 0, Errors: 0, Time elapsed: 0.937 sec
[junit]
[junit] Testsuite: org.apache.cassandra.locator.OldNetworkTopologyStrategyTest
[junit] Tests run: 8, Failures: 0, Errors: 0, Time elapsed: 5.321 sec
[junit]
[junit] ------------- Standard Output ---------------
[junit] toStream : [(158873535527910577765226390751398592512,0], (0,34028236692093846346337460743176821145]]
[junit] toFetch : [(127605887595351923798765477786913079296,148873535527910577765226390751398592512]]
[junit] toStreamExpected : [(158873535527910577765226390751398592512,0], (0,34028236692093846346337460743176821145]]
[junit] toFetchExpected : [(127605887595351923798765477786913079296,148873535527910577765226390751398592512]]
[junit] ------------- ---------------- ---------------
[junit] Testsuite: org.apache.cassandra.locator.ReplicationStrategyEndpointCacheTest
[junit] Tests run: 2, Failures: 0, Errors: 0, Time elapsed: 5.375 sec
[junit]
[junit] Testsuite: org.apache.cassandra.locator.SimpleStrategyTest
[junit] Tests run: 4, Failures: 0, Errors: 0, Time elapsed: 5.41 sec
[junit]
[junit] Testsuite: org.apache.cassandra.locator.TokenMetadataTest
[junit] Tests run: 3, Failures: 0, Errors: 0, Time elapsed: 0.72 sec
[junit]
[junit] Testsuite: org.apache.cassandra.service.AntiEntropyServiceCounterTest
[junit] Tests run: 6, Failures: 0, Errors: 0, Time elapsed: 6.475 sec
[junit]
[junit] ------------- Standard Error -----------------
[junit] WARN 10:38:35,949 No host ID found, created 3dcdefb7-bdf0-4d83-ab11-42cc1615be1e (Note: This should happen exactly once per node).
[junit] WARN 10:38:36,132 Generated random token [Token(bytes[b030242a447ac46465f5587ce86afa33])]. Random tokens will result in an unbalanced ring; see http://wiki.apache.org/cassandra/Operations
[junit] ------------- ---------------- ---------------
[junit] Testsuite: org.apache.cassandra.service.AntiEntropyServiceStandardTest
[junit] Tests run: 6, Failures: 0, Errors: 0, Time elapsed: 6.352 sec
[junit]
[junit] ------------- Standard Error -----------------
[junit] WARN 10:38:43,732 No host ID found, created 7f49a437-456a-46f7-a23a-87bada6c5d95 (Note: This should happen exactly once per node).
[junit] WARN 10:38:43,907 Generated random token [Token(bytes[f5144e3d3d2b4b15c6dced1ac3034cdb])]. Random tokens will result in an unbalanced ring; see http://wiki.apache.org/cassandra/Operations
[junit] ------------- ---------------- ---------------
[junit] Testsuite: org.apache.cassandra.service.CassandraServerTest
[junit] Tests run: 1, Failures: 0, Errors: 0, Time elapsed: 5.31 sec
[junit]
[junit] Testsuite: org.apache.cassandra.service.EmbeddedCassandraServiceTest
[junit] Tests run: 1, Failures: 0, Errors: 0, Time elapsed: 6.552 sec
[junit]
[junit] ------------- Standard Error -----------------
[junit] WARN 10:38:57,739 Unable to lock JVM memory (ENOMEM). This can result in part of the JVM being swapped out, especially with mmapped I/O enabled. Increase RLIMIT_MEMLOCK or run Cassandra as root.
[junit] WARN 10:38:58,297 No host ID found, created 526c8cac-b258-429a-b08a-2417d6a4d9b1 (Note: This should happen exactly once per node).
[junit] WARN 10:38:58,471 Generated random token [Token(bytes[7fd67637208a376b75081e3462695b82])]. Random tokens will result in an unbalanced ring; see http://wiki.apache.org/cassandra/Operations
[junit] ------------- ---------------- ---------------
[junit] Testsuite: org.apache.cassandra.service.InitClientTest
[junit] Tests run: 1, Failures: 0, Errors: 0, Time elapsed: 1.166 sec
[junit]
[junit] Testsuite: org.apache.cassandra.service.LeaveAndBootstrapTest
[junit] Tests run: 6, Failures: 0, Errors: 0, Time elapsed: 6.364 sec
[junit]
[junit] ------------- Standard Error -----------------
[junit] WARN 10:39:09,189 Node /127.0.0.3 'leaving' token mismatch. Long network partition?
[junit] ------------- ---------------- ---------------
[junit] Testsuite: org.apache.cassandra.service.MoveTest
[junit] Tests run: 3, Failures: 0, Errors: 0, Time elapsed: 6.061 sec
[junit]
[junit] Testsuite: org.apache.cassandra.service.RemoveTest
[junit] Tests run: 3, Failures: 0, Errors: 0, Time elapsed: 8.891 sec
[junit]
[junit] ------------- Standard Error -----------------
[junit] ERROR 10:39:23,748 Stream failed because /127.0.0.6 died or was restarted/removed (streams may still be active in background, but further streams won't be started)
[junit] WARN 10:39:23,749 Streaming from /127.0.0.6 failed
[junit] ERROR 10:39:23,749 Stream failed because /127.0.0.6 died or was restarted/removed (streams may still be active in background, but further streams won't be started)
[junit] WARN 10:39:23,750 Streaming from /127.0.0.6 failed
[junit] ERROR 10:39:23,750 Stream failed because /127.0.0.6 died or was restarted/removed (streams may still be active in background, but further streams won't be started)
[junit] WARN 10:39:23,750 Streaming from /127.0.0.6 failed
[junit] ERROR 10:39:23,750 Stream failed because /127.0.0.6 died or was restarted/removed (streams may still be active in background, but further streams won't be started)
[junit] WARN 10:39:23,750 Streaming from /127.0.0.6 failed
[junit] ERROR 10:39:23,750 Stream failed because /127.0.0.6 died or was restarted/removed (streams may still be active in background, but further streams won't be started)
[junit] WARN 10:39:23,751 Streaming from /127.0.0.6 failed
[junit] ERROR 10:39:23,751 Stream failed because /127.0.0.6 died or was restarted/removed (streams may still be active in background, but further streams won't be started)
[junit] WARN 10:39:23,751 Streaming from /127.0.0.6 failed
[junit] ------------- ---------------- ---------------
[junit] Testsuite: org.apache.cassandra.service.RowResolverTest
[junit] Tests run: 8, Failures: 0, Errors: 0, Time elapsed: 6.148 sec
[junit]
[junit] Testsuite: org.apache.cassandra.service.SerializationsTest
[junit] Tests run: 2, Failures: 0, Errors: 0, Time elapsed: 4.409 sec
[junit]
[junit] Testsuite: org.apache.cassandra.service.StorageProxyTest
[junit] Tests run: 4, Failures: 0, Errors: 0, Time elapsed: 5.925 sec
[junit]
[junit] Testsuite: org.apache.cassandra.service.StorageServiceClientTest
[junit] Tests run: 1, Failures: 0, Errors: 0, Time elapsed: 3.428 sec
[junit]
[junit] Testsuite: org.apache.cassandra.service.StorageServiceServerTest
[junit] Tests run: 4, Failures: 0, Errors: 0, Time elapsed: 3.735 sec
[junit]
[junit] ------------- Standard Error -----------------
[junit] WARN 10:39:52,917 No host ID found, created eb9311b3-d35f-4120-aae4-b16af7575115 (Note: This should happen exactly once per node).
[junit] WARN 10:39:53,237 Generated random token [Token(bytes[01a68deb93494455dbfed9b6edfacf7f])]. Random tokens will result in an unbalanced ring; see http://wiki.apache.org/cassandra/Operations
[junit] ------------- ---------------- ---------------
[junit] Testsuite: org.apache.cassandra.streaming.BootstrapTest
[junit] Tests run: 1, Failures: 0, Errors: 0, Time elapsed: 5.228 sec
[junit]
[junit] Testsuite: org.apache.cassandra.streaming.SerializationsTest
[junit] Tests run: 4, Failures: 0, Errors: 0, Time elapsed: 5.298 sec
[junit]
[junit] Testsuite: org.apache.cassandra.streaming.StreamingTransferTest
[junit] Tests run: 5, Failures: 0, Errors: 0, Time elapsed: 5.831 sec
[junit]
[junit] ------------- Standard Error -----------------
[junit] WARN 10:40:13,271 No host ID found, created e1845c4c-1400-40a8-bbfe-2608340688c6 (Note: This should happen exactly once per node).
[junit] WARN 10:40:13,471 Generated random token [Token(bytes[26df5903e805a63c1eb9a70995a30340])]. Random tokens will result in an unbalanced ring; see http://wiki.apache.org/cassandra/Operations
[junit] ------------- ---------------- ---------------
[junit] Testsuite: org.apache.cassandra.thrift.ThriftValidationTest
[junit] Tests run: 4, Failures: 0, Errors: 0, Time elapsed: 5.44 sec
[junit]
[junit] Testsuite: org.apache.cassandra.tools.SSTableExportTest
[junit] Tests run: 7, Failures: 0, Errors: 0, Time elapsed: 5.845 sec
[junit]
[junit] ------------- Standard Output ---------------
[junit] Importing 1 keys...
[junit] 1 keys imported successfully.
[junit] [{"columns":[["636f6c4e616d65","76616c",1345545627052],["636f6c4e616d6531","76616c31",1345545627052]],"key":"726f7741","metadata":{"deletionInfo":{"markedForDeleteAt":0,"localDeletionTime":0}}}]
[junit] ------------- ---------------- ---------------
[junit] Testsuite: org.apache.cassandra.tools.SSTableImportTest
[junit] Tests run: 7, Failures: 0, Errors: 0, Time elapsed: 5.509 sec
[junit]
[junit] ------------- Standard Output ---------------
[junit] Counting keys to import, please wait... (NOTE: to skip this use -n <num_keys>)
[junit] Importing 2 keys...
[junit] 2 keys imported successfully.
[junit] Counting keys to import, please wait... (NOTE: to skip this use -n <num_keys>)
[junit] Importing 2 keys...
[junit] 2 keys imported successfully.
[junit] Counting keys to import, please wait... (NOTE: to skip this use -n <num_keys>)
[junit] Importing 2 keys...
[junit] 2 keys imported successfully.
[junit] Importing 3 keys...
[junit] Importing 2 keys...
[junit] 2 keys imported successfully.
[junit] Counting keys to import, please wait... (NOTE: to skip this use -n <num_keys>)
[junit] Importing 2 keys...
[junit] 2 keys imported successfully.
[junit] Counting keys to import, please wait... (NOTE: to skip this use -n <num_keys>)
[junit] Importing 1 keys...
[junit] 1 keys imported successfully.
[junit] ------------- ---------------- ---------------
[junit] ------------- Standard Error -----------------
[junit] Line 2: Key null is greater than previous, collection is not sorted properly. Aborting import. You might need to delete SSTables manually.
[junit] ------------- ---------------- ---------------
[junit] Testsuite: org.apache.cassandra.utils.BloomFilterTest
[junit] Tests run: 7, Failures: 0, Errors: 0, Time elapsed: 0.512 sec
[junit]
[junit] Testsuite: org.apache.cassandra.utils.BoundedStatsDequeTest
[junit] Tests run: 1, Failures: 0, Errors: 0, Time elapsed: 0.042 sec
[junit]
[junit] Testsuite: org.apache.cassandra.utils.ByteBufferUtilTest
[junit] Tests run: 10, Failures: 0, Errors: 0, Time elapsed: 0.058 sec
[junit]
[junit] Testsuite: org.apache.cassandra.utils.BytesReadTrackerTest
[junit] Tests run: 4, Failures: 0, Errors: 0, Time elapsed: 0.044 sec
[junit]
[junit] Testsuite: org.apache.cassandra.utils.EncodedStreamsTest
[junit] Tests run: 4, Failures: 0, Errors: 0, Time elapsed: 5.181 sec
[junit]
[junit] Testsuite: org.apache.cassandra.utils.EstimatedHistogramTest
[junit] Tests run: 5, Failures: 0, Errors: 0, Time elapsed: 0.047 sec
[junit]
[junit] Testsuite: org.apache.cassandra.utils.FBUtilitiesTest
[junit] Tests run: 2, Failures: 0, Errors: 0, Time elapsed: 0.045 sec
[junit]
[junit] Testsuite: org.apache.cassandra.utils.HexTest
[junit] Tests run: 2, Failures: 0, Errors: 0, Time elapsed: 0.049 sec
[junit]
[junit] Testsuite: org.apache.cassandra.utils.IntervalTreeTest
[junit] Tests run: 3, Failures: 0, Errors: 0, Time elapsed: 0.213 sec
[junit]
[junit] Testsuite: org.apache.cassandra.utils.LegacyBloomFilterTest
[junit] Tests run: 6, Failures: 0, Errors: 0, Time elapsed: 0.361 sec
[junit]
[junit] Testsuite: org.apache.cassandra.utils.MergeIteratorTest
[junit] Tests run: 1, Failures: 0, Errors: 0, Time elapsed: 0.056 sec
[junit]
[junit] Testsuite: org.apache.cassandra.utils.MerkleTreeTest
[junit] Tests run: 12, Failures: 0, Errors: 0, Time elapsed: 0.811 sec
[junit]
[junit] Testsuite: org.apache.cassandra.utils.SemanticVersionTest
[junit] Tests run: 4, Failures: 0, Errors: 0, Time elapsed: 0.047 sec
[junit]
[junit] Testsuite: org.apache.cassandra.utils.SerializationsTest
[junit] Tests run: 4, Failures: 0, Errors: 0, Time elapsed: 6.477 sec
[junit]
[junit] Testsuite: org.apache.cassandra.utils.StreamingHistogramTest
[junit] Tests run: 2, Failures: 0, Errors: 0, Time elapsed: 0.047 sec
[junit]
BUILD SUCCESSFUL
Total time: 9 minutes 51 seconds
[TASKS] Scanning folder '<https://builds.apache.org/job/Cassandra-quick/ws/'> for files matching the pattern '**/*.java' - excludes:
[TASKS] Found 841 files to scan for tasks
[TASKS] Found 123 open tasks.
[TASKS] Computing warning deltas based on reference build #82
Recording test results
No test report files were found. Configuration error?
Build step 'Publish JUnit test result report' changed build result to FAILURE
Build failed in Jenkins: Cassandra-quick #1140
Posted by Apache Jenkins Server <je...@builds.apache.org>.
See <https://builds.apache.org/job/Cassandra-quick/1140/changes>
Changes:
[yukim] change cache write progress check to cache type basis; patch by yukim,
[jbellis] Make compaction, flush JBOD-aware
[jbellis] bump java7 stack size to 180; see #4457
------------------------------------------
[...truncated 387 lines...]
[junit]
[junit] Testsuite: org.apache.cassandra.io.BloomFilterTrackerTest
[junit] Tests run: 3, Failures: 0, Errors: 0, Time elapsed: 3.436 sec
[junit]
[junit] Testsuite: org.apache.cassandra.io.CompactSerializerTest
[junit] Tests run: 2, Failures: 0, Errors: 0, Time elapsed: 4.241 sec
[junit]
[junit] Testsuite: org.apache.cassandra.io.LazilyCompactedRowTest
[junit] Tests run: 7, Failures: 0, Errors: 0, Time elapsed: 4.486 sec
[junit]
[junit] Testsuite: org.apache.cassandra.io.compress.CompressedRandomAccessReaderTest
[junit] Tests run: 3, Failures: 0, Errors: 0, Time elapsed: 0.749 sec
[junit]
[junit] ------------- Standard Error -----------------
[junit] WARN 15:51:36,484 open(null, O_RDONLY) failed, errno (14).
[junit] ------------- ---------------- ---------------
[junit] Testsuite: org.apache.cassandra.io.sstable.DescriptorTest
[junit] Tests run: 3, Failures: 0, Errors: 0, Time elapsed: 0.044 sec
[junit]
[junit] Testsuite: org.apache.cassandra.io.sstable.IndexHelperTest
[junit] Tests run: 1, Failures: 0, Errors: 0, Time elapsed: 0.044 sec
[junit]
[junit] Testsuite: org.apache.cassandra.io.sstable.LegacySSTableTest
[junit] Tests run: 1, Failures: 0, Errors: 0, Time elapsed: 4.516 sec
[junit]
[junit] Testsuite: org.apache.cassandra.io.sstable.SSTableMetadataSerializerTest
[junit] Tests run: 1, Failures: 0, Errors: 0, Time elapsed: 0.099 sec
[junit]
[junit] Testsuite: org.apache.cassandra.io.sstable.SSTableReaderTest
[junit] Tests run: 8, Failures: 0, Errors: 0, Time elapsed: 3.902 sec
[junit]
[junit] ------------- Standard Error -----------------
[junit] WARN 15:51:47,607 setting live ratio to maximum of 64.0 instead of 87.30666666666667
[junit] WARN 15:51:47,803 setting live ratio to maximum of 64.0 instead of 67.11272727272727
[junit] ------------- ---------------- ---------------
[junit] Testsuite: org.apache.cassandra.io.sstable.SSTableSimpleWriterTest
[junit] Tests run: 1, Failures: 0, Errors: 0, Time elapsed: 3.786 sec
[junit]
[junit] Testsuite: org.apache.cassandra.io.sstable.SSTableTest
[junit] Tests run: 2, Failures: 0, Errors: 0, Time elapsed: 3.79 sec
[junit]
[junit] Testsuite: org.apache.cassandra.io.util.BufferedRandomAccessFileTest
[junit] Tests run: 18, Failures: 0, Errors: 0, Time elapsed: 0.861 sec
[junit]
[junit] Testsuite: org.apache.cassandra.locator.DynamicEndpointSnitchTest
[junit] Tests run: 1, Failures: 0, Errors: 0, Time elapsed: 1.66 sec
[junit]
[junit] Testsuite: org.apache.cassandra.locator.EC2SnitchTest
[junit] Tests run: 2, Failures: 0, Errors: 0, Time elapsed: 0.686 sec
[junit]
[junit] Testsuite: org.apache.cassandra.locator.NetworkTopologyStrategyTest
[junit] Tests run: 3, Failures: 0, Errors: 0, Time elapsed: 0.87 sec
[junit]
[junit] Testsuite: org.apache.cassandra.locator.OldNetworkTopologyStrategyTest
[junit] Tests run: 8, Failures: 0, Errors: 0, Time elapsed: 3.634 sec
[junit]
[junit] ------------- Standard Output ---------------
[junit] toStream : [(158873535527910577765226390751398592512,0], (0,34028236692093846346337460743176821145]]
[junit] toFetch : [(127605887595351923798765477786913079296,148873535527910577765226390751398592512]]
[junit] toStreamExpected : [(158873535527910577765226390751398592512,0], (0,34028236692093846346337460743176821145]]
[junit] toFetchExpected : [(127605887595351923798765477786913079296,148873535527910577765226390751398592512]]
[junit] ------------- ---------------- ---------------
[junit] Testsuite: org.apache.cassandra.locator.ReplicationStrategyEndpointCacheTest
[junit] Tests run: 2, Failures: 0, Errors: 0, Time elapsed: 3.543 sec
[junit]
[junit] Testsuite: org.apache.cassandra.locator.SimpleStrategyTest
[junit] Tests run: 4, Failures: 0, Errors: 0, Time elapsed: 3.862 sec
[junit]
[junit] Testsuite: org.apache.cassandra.locator.TokenMetadataTest
[junit] Tests run: 3, Failures: 0, Errors: 0, Time elapsed: 0.703 sec
[junit]
[junit] Testsuite: org.apache.cassandra.service.AntiEntropyServiceCounterTest
[junit] Tests run: 6, Failures: 0, Errors: 0, Time elapsed: 4.116 sec
[junit]
[junit] ------------- Standard Error -----------------
[junit] WARN 15:52:24,054 No host ID found, created c7f5c96c-6eb4-4624-a6bd-71622431be11 (Note: This should happen exactly once per node).
[junit] WARN 15:52:24,135 Generated random token [Token(bytes[5acb2bc3d54c7332f6f7ca70c3822613])]. Random tokens will result in an unbalanced ring; see http://wiki.apache.org/cassandra/Operations
[junit] ------------- ---------------- ---------------
[junit] Testsuite: org.apache.cassandra.service.AntiEntropyServiceStandardTest
[junit] Tests run: 6, Failures: 0, Errors: 0, Time elapsed: 4.143 sec
[junit]
[junit] ------------- Standard Error -----------------
[junit] WARN 15:52:29,179 No host ID found, created cebce7b2-f9c0-45f2-bfcb-e79e25320b4b (Note: This should happen exactly once per node).
[junit] WARN 15:52:29,259 Generated random token [Token(bytes[4ae71de5858ab2c2a8cb0129ef683692])]. Random tokens will result in an unbalanced ring; see http://wiki.apache.org/cassandra/Operations
[junit] ------------- ---------------- ---------------
[junit] Testsuite: org.apache.cassandra.service.CassandraServerTest
[junit] Tests run: 1, Failures: 0, Errors: 0, Time elapsed: 3.521 sec
[junit]
[junit] Testsuite: org.apache.cassandra.service.EmbeddedCassandraServiceTest
[junit] Tests run: 1, Failures: 0, Errors: 0, Time elapsed: 4.073 sec
[junit]
[junit] ------------- Standard Error -----------------
[junit] WARN 15:52:38,774 Unable to lock JVM memory (ENOMEM). This can result in part of the JVM being swapped out, especially with mmapped I/O enabled. Increase RLIMIT_MEMLOCK or run Cassandra as root.
[junit] WARN 15:52:39,080 No host ID found, created d58f1d77-c241-4d57-83d9-6c9bbf8f78d7 (Note: This should happen exactly once per node).
[junit] WARN 15:52:39,171 Generated random token [Token(bytes[f580238a0749f07adc823fd580eb4ab4])]. Random tokens will result in an unbalanced ring; see http://wiki.apache.org/cassandra/Operations
[junit] ------------- ---------------- ---------------
[junit] Testsuite: org.apache.cassandra.service.InitClientTest
[junit] Tests run: 1, Failures: 0, Errors: 0, Time elapsed: 0.889 sec
[junit]
[junit] Testsuite: org.apache.cassandra.service.LeaveAndBootstrapTest
[junit] Tests run: 6, Failures: 0, Errors: 0, Time elapsed: 5.364 sec
[junit]
[junit] ------------- Standard Error -----------------
[junit] WARN 15:52:48,445 Node /127.0.0.3 'leaving' token mismatch. Long network partition?
[junit] ------------- ---------------- ---------------
[junit] Testsuite: org.apache.cassandra.service.MoveTest
[junit] Tests run: 3, Failures: 0, Errors: 0, Time elapsed: 4.656 sec
[junit]
[junit] Testsuite: org.apache.cassandra.service.RemoveTest
[junit] Tests run: 3, Failures: 0, Errors: 0, Time elapsed: 7.321 sec
[junit]
[junit] ------------- Standard Error -----------------
[junit] ERROR 15:53:00,221 Stream failed because /127.0.0.6 died or was restarted/removed (streams may still be active in background, but further streams won't be started)
[junit] WARN 15:53:00,223 Streaming from /127.0.0.6 failed
[junit] ERROR 15:53:00,223 Stream failed because /127.0.0.6 died or was restarted/removed (streams may still be active in background, but further streams won't be started)
[junit] WARN 15:53:00,224 Streaming from /127.0.0.6 failed
[junit] ERROR 15:53:00,224 Stream failed because /127.0.0.6 died or was restarted/removed (streams may still be active in background, but further streams won't be started)
[junit] WARN 15:53:00,225 Streaming from /127.0.0.6 failed
[junit] ERROR 15:53:00,225 Stream failed because /127.0.0.6 died or was restarted/removed (streams may still be active in background, but further streams won't be started)
[junit] WARN 15:53:00,225 Streaming from /127.0.0.6 failed
[junit] ERROR 15:53:00,226 Stream failed because /127.0.0.6 died or was restarted/removed (streams may still be active in background, but further streams won't be started)
[junit] WARN 15:53:00,226 Streaming from /127.0.0.6 failed
[junit] ERROR 15:53:00,226 Stream failed because /127.0.0.6 died or was restarted/removed (streams may still be active in background, but further streams won't be started)
[junit] WARN 15:53:00,227 Streaming from /127.0.0.6 failed
[junit] ------------- ---------------- ---------------
[junit] Testsuite: org.apache.cassandra.service.RowResolverTest
[junit] Tests run: 8, Failures: 0, Errors: 0, Time elapsed: 3.641 sec
[junit]
[junit] Testsuite: org.apache.cassandra.service.SerializationsTest
[junit] Tests run: 2, Failures: 0, Errors: 0, Time elapsed: 3.011 sec
[junit]
[junit] Testsuite: org.apache.cassandra.service.StorageProxyTest
[junit] Tests run: 4, Failures: 0, Errors: 0, Time elapsed: 3.519 sec
[junit]
[junit] Testsuite: org.apache.cassandra.service.StorageServiceClientTest
[junit] Tests run: 1, Failures: 0, Errors: 0, Time elapsed: 2.848 sec
[junit]
[junit] Testsuite: org.apache.cassandra.service.StorageServiceServerTest
[junit] Tests run: 4, Failures: 0, Errors: 0, Time elapsed: 3.294 sec
[junit]
[junit] ------------- Standard Error -----------------
[junit] WARN 15:53:22,045 No host ID found, created 6c1ca6c8-de6c-46e2-a9fc-e750e34f8c68 (Note: This should happen exactly once per node).
[junit] WARN 15:53:22,401 Generated random token [Token(bytes[3f0de59c0c247bb60886d5b399af0501])]. Random tokens will result in an unbalanced ring; see http://wiki.apache.org/cassandra/Operations
[junit] ------------- ---------------- ---------------
[junit] Testsuite: org.apache.cassandra.streaming.BootstrapTest
[junit] Tests run: 1, Failures: 0, Errors: 0, Time elapsed: 3.619 sec
[junit]
[junit] Testsuite: org.apache.cassandra.streaming.SerializationsTest
[junit] Tests run: 4, Failures: 0, Errors: 0, Time elapsed: 3.532 sec
[junit]
[junit] Testsuite: org.apache.cassandra.streaming.StreamingTransferTest
[junit] Tests run: 5, Failures: 0, Errors: 0, Time elapsed: 3.702 sec
[junit]
[junit] ------------- Standard Error -----------------
[junit] WARN 15:53:36,840 No host ID found, created 3a87a2f4-60e4-4c34-94a3-27c38e4c48eb (Note: This should happen exactly once per node).
[junit] WARN 15:53:36,957 Generated random token [Token(bytes[207d939931e8bd446e4f442e1a49161b])]. Random tokens will result in an unbalanced ring; see http://wiki.apache.org/cassandra/Operations
[junit] ------------- ---------------- ---------------
[junit] Testsuite: org.apache.cassandra.thrift.ThriftValidationTest
[junit] Tests run: 4, Failures: 0, Errors: 0, Time elapsed: 3.646 sec
[junit]
[junit] Testsuite: org.apache.cassandra.tools.SSTableExportTest
[junit] Tests run: 7, Failures: 0, Errors: 0, Time elapsed: 3.636 sec
[junit]
[junit] ------------- Standard Output ---------------
[junit] Importing 1 keys...
[junit] 1 keys imported successfully.
[junit] [{"columns":[["636f6c4e616d65","76616c",1345650826625],["636f6c4e616d6531","76616c31",1345650826625]],"key":"726f7741","metadata":{"deletionInfo":{"markedForDeleteAt":0,"localDeletionTime":0}}}]
[junit] ------------- ---------------- ---------------
[junit] Testsuite: org.apache.cassandra.tools.SSTableImportTest
[junit] Tests run: 7, Failures: 0, Errors: 0, Time elapsed: 3.573 sec
[junit]
[junit] ------------- Standard Output ---------------
[junit] Counting keys to import, please wait... (NOTE: to skip this use -n <num_keys>)
[junit] Importing 2 keys...
[junit] 2 keys imported successfully.
[junit] Counting keys to import, please wait... (NOTE: to skip this use -n <num_keys>)
[junit] Importing 2 keys...
[junit] 2 keys imported successfully.
[junit] Counting keys to import, please wait... (NOTE: to skip this use -n <num_keys>)
[junit] Importing 2 keys...
[junit] 2 keys imported successfully.
[junit] Importing 3 keys...
[junit] Importing 2 keys...
[junit] 2 keys imported successfully.
[junit] Counting keys to import, please wait... (NOTE: to skip this use -n <num_keys>)
[junit] Importing 2 keys...
[junit] 2 keys imported successfully.
[junit] Counting keys to import, please wait... (NOTE: to skip this use -n <num_keys>)
[junit] Importing 1 keys...
[junit] 1 keys imported successfully.
[junit] ------------- ---------------- ---------------
[junit] ------------- Standard Error -----------------
[junit] Line 2: Key null is greater than previous, collection is not sorted properly. Aborting import. You might need to delete SSTables manually.
[junit] ------------- ---------------- ---------------
[junit] Testsuite: org.apache.cassandra.utils.BloomFilterTest
[junit] Tests run: 7, Failures: 0, Errors: 0, Time elapsed: 0.469 sec
[junit]
[junit] Testsuite: org.apache.cassandra.utils.BoundedStatsDequeTest
[junit] Tests run: 1, Failures: 0, Errors: 0, Time elapsed: 0.041 sec
[junit]
[junit] Testsuite: org.apache.cassandra.utils.ByteBufferUtilTest
[junit] Tests run: 10, Failures: 0, Errors: 0, Time elapsed: 0.056 sec
[junit]
[junit] Testsuite: org.apache.cassandra.utils.BytesReadTrackerTest
[junit] Tests run: 4, Failures: 0, Errors: 0, Time elapsed: 0.043 sec
[junit]
[junit] Testsuite: org.apache.cassandra.utils.EncodedStreamsTest
[junit] Tests run: 4, Failures: 0, Errors: 0, Time elapsed: 3.541 sec
[junit]
[junit] Testsuite: org.apache.cassandra.utils.EstimatedHistogramTest
[junit] Tests run: 5, Failures: 0, Errors: 0, Time elapsed: 0.044 sec
[junit]
[junit] Testsuite: org.apache.cassandra.utils.FBUtilitiesTest
[junit] Tests run: 2, Failures: 0, Errors: 0, Time elapsed: 0.043 sec
[junit]
[junit] Testsuite: org.apache.cassandra.utils.HexTest
[junit] Tests run: 2, Failures: 0, Errors: 0, Time elapsed: 0.044 sec
[junit]
[junit] Testsuite: org.apache.cassandra.utils.IntervalTreeTest
[junit] Tests run: 3, Failures: 0, Errors: 0, Time elapsed: 0.124 sec
[junit]
[junit] Testsuite: org.apache.cassandra.utils.LegacyBloomFilterTest
[junit] Tests run: 6, Failures: 0, Errors: 0, Time elapsed: 0.363 sec
[junit]
[junit] Testsuite: org.apache.cassandra.utils.MergeIteratorTest
[junit] Tests run: 1, Failures: 0, Errors: 0, Time elapsed: 0.054 sec
[junit]
[junit] Testsuite: org.apache.cassandra.utils.MerkleTreeTest
[junit] Tests run: 12, Failures: 0, Errors: 0, Time elapsed: 0.792 sec
[junit]
[junit] Testsuite: org.apache.cassandra.utils.SemanticVersionTest
[junit] Tests run: 4, Failures: 0, Errors: 0, Time elapsed: 0.044 sec
[junit]
[junit] Testsuite: org.apache.cassandra.utils.SerializationsTest
[junit] Tests run: 4, Failures: 0, Errors: 0, Time elapsed: 4.726 sec
[junit]
[junit] Testsuite: org.apache.cassandra.utils.StreamingHistogramTest
[junit] Tests run: 2, Failures: 0, Errors: 0, Time elapsed: 0.044 sec
[junit]
BUILD SUCCESSFUL
Total time: 7 minutes 42 seconds
[TASKS] Scanning folder '<https://builds.apache.org/job/Cassandra-quick/ws/'> for files matching the pattern '**/*.java' - excludes:
[TASKS] Found 844 files to scan for tasks
[TASKS] Found 123 open tasks.
[TASKS] Computing warning deltas based on reference build #82
Recording test results
No test report files were found. Configuration error?
Build step 'Publish JUnit test result report' changed build result to FAILURE
Build failed in Jenkins: Cassandra-quick #1139
Posted by Apache Jenkins Server <je...@builds.apache.org>.
See <https://builds.apache.org/job/Cassandra-quick/1139/>
------------------------------------------
[...truncated 387 lines...]
[junit]
[junit] Testsuite: org.apache.cassandra.io.BloomFilterTrackerTest
[junit] Tests run: 3, Failures: 0, Errors: 0, Time elapsed: 5.273 sec
[junit]
[junit] Testsuite: org.apache.cassandra.io.CompactSerializerTest
[junit] Tests run: 2, Failures: 0, Errors: 0, Time elapsed: 6.138 sec
[junit]
[junit] Testsuite: org.apache.cassandra.io.LazilyCompactedRowTest
[junit] Tests run: 7, Failures: 0, Errors: 0, Time elapsed: 6.288 sec
[junit]
[junit] Testsuite: org.apache.cassandra.io.compress.CompressedRandomAccessReaderTest
[junit] Tests run: 3, Failures: 0, Errors: 0, Time elapsed: 0.768 sec
[junit]
[junit] ------------- Standard Error -----------------
[junit] WARN 13:27:27,372 open(null, O_RDONLY) failed, errno (14).
[junit] ------------- ---------------- ---------------
[junit] Testsuite: org.apache.cassandra.io.sstable.DescriptorTest
[junit] Tests run: 3, Failures: 0, Errors: 0, Time elapsed: 0.046 sec
[junit]
[junit] Testsuite: org.apache.cassandra.io.sstable.IndexHelperTest
[junit] Tests run: 1, Failures: 0, Errors: 0, Time elapsed: 0.043 sec
[junit]
[junit] Testsuite: org.apache.cassandra.io.sstable.LegacySSTableTest
[junit] Tests run: 1, Failures: 0, Errors: 0, Time elapsed: 5.724 sec
[junit]
[junit] Testsuite: org.apache.cassandra.io.sstable.SSTableMetadataSerializerTest
[junit] Tests run: 1, Failures: 0, Errors: 0, Time elapsed: 0.1 sec
[junit]
[junit] Testsuite: org.apache.cassandra.io.sstable.SSTableReaderTest
[junit] Tests run: 8, Failures: 0, Errors: 0, Time elapsed: 5.719 sec
[junit]
[junit] ------------- Standard Error -----------------
[junit] WARN 13:27:41,502 setting live ratio to maximum of 64.0 instead of 87.92888888888889
[junit] WARN 13:27:41,682 setting live ratio to maximum of 64.0 instead of 66.15584415584415
[junit] ------------- ---------------- ---------------
[junit] Testsuite: org.apache.cassandra.io.sstable.SSTableSimpleWriterTest
[junit] Tests run: 1, Failures: 0, Errors: 0, Time elapsed: 5.481 sec
[junit]
[junit] Testsuite: org.apache.cassandra.io.sstable.SSTableTest
[junit] Tests run: 2, Failures: 0, Errors: 0, Time elapsed: 5.384 sec
[junit]
[junit] Testsuite: org.apache.cassandra.io.util.BufferedRandomAccessFileTest
[junit] Tests run: 18, Failures: 0, Errors: 0, Time elapsed: 0.86 sec
[junit]
[junit] Testsuite: org.apache.cassandra.locator.DynamicEndpointSnitchTest
[junit] Tests run: 1, Failures: 0, Errors: 0, Time elapsed: 2.009 sec
[junit]
[junit] Testsuite: org.apache.cassandra.locator.EC2SnitchTest
[junit] Tests run: 2, Failures: 0, Errors: 0, Time elapsed: 0.675 sec
[junit]
[junit] Testsuite: org.apache.cassandra.locator.NetworkTopologyStrategyTest
[junit] Tests run: 3, Failures: 0, Errors: 0, Time elapsed: 0.867 sec
[junit]
[junit] Testsuite: org.apache.cassandra.locator.OldNetworkTopologyStrategyTest
[junit] Tests run: 8, Failures: 0, Errors: 0, Time elapsed: 5.317 sec
[junit]
[junit] ------------- Standard Output ---------------
[junit] toStream : [(158873535527910577765226390751398592512,0], (0,34028236692093846346337460743176821145]]
[junit] toFetch : [(127605887595351923798765477786913079296,148873535527910577765226390751398592512]]
[junit] toStreamExpected : [(158873535527910577765226390751398592512,0], (0,34028236692093846346337460743176821145]]
[junit] toFetchExpected : [(127605887595351923798765477786913079296,148873535527910577765226390751398592512]]
[junit] ------------- ---------------- ---------------
[junit] Testsuite: org.apache.cassandra.locator.ReplicationStrategyEndpointCacheTest
[junit] Tests run: 2, Failures: 0, Errors: 0, Time elapsed: 5.18 sec
[junit]
[junit] Testsuite: org.apache.cassandra.locator.SimpleStrategyTest
[junit] Tests run: 4, Failures: 0, Errors: 0, Time elapsed: 5.255 sec
[junit]
[junit] Testsuite: org.apache.cassandra.locator.TokenMetadataTest
[junit] Tests run: 3, Failures: 0, Errors: 0, Time elapsed: 0.676 sec
[junit]
[junit] Testsuite: org.apache.cassandra.service.AntiEntropyServiceCounterTest
[junit] Tests run: 6, Failures: 0, Errors: 0, Time elapsed: 6.775 sec
[junit]
[junit] ------------- Standard Error -----------------
[junit] WARN 13:28:27,777 No host ID found, created e2d1889a-4765-4ecb-a7ad-b4d8e3a57126 (Note: This should happen exactly once per node).
[junit] WARN 13:28:28,049 Generated random token [Token(bytes[b9165717f5635a84edd0ff522fb984d3])]. Random tokens will result in an unbalanced ring; see http://wiki.apache.org/cassandra/Operations
[junit] ------------- ---------------- ---------------
[junit] Testsuite: org.apache.cassandra.service.AntiEntropyServiceStandardTest
[junit] Tests run: 6, Failures: 0, Errors: 0, Time elapsed: 6.593 sec
[junit]
[junit] ------------- Standard Error -----------------
[junit] WARN 13:28:35,703 No host ID found, created a2dd7216-1cc2-44d2-bd4c-7df244980054 (Note: This should happen exactly once per node).
[junit] WARN 13:28:35,944 Generated random token [Token(bytes[24095b7121af25fb9171764ccc55439f])]. Random tokens will result in an unbalanced ring; see http://wiki.apache.org/cassandra/Operations
[junit] ------------- ---------------- ---------------
[junit] Testsuite: org.apache.cassandra.service.CassandraServerTest
[junit] Tests run: 1, Failures: 0, Errors: 0, Time elapsed: 5.177 sec
[junit]
[junit] Testsuite: org.apache.cassandra.service.EmbeddedCassandraServiceTest
[junit] Tests run: 1, Failures: 0, Errors: 0, Time elapsed: 5.997 sec
[junit]
[junit] ------------- Standard Error -----------------
[junit] WARN 13:28:49,523 Unable to lock JVM memory (ENOMEM). This can result in part of the JVM being swapped out, especially with mmapped I/O enabled. Increase RLIMIT_MEMLOCK or run Cassandra as root.
[junit] WARN 13:28:49,883 No host ID found, created 1aef6701-a228-4df0-baf9-61c3fcabdeec (Note: This should happen exactly once per node).
[junit] WARN 13:28:50,044 Generated random token [Token(bytes[f0e5ef4d1eb4c7ccc20273226a0df9c3])]. Random tokens will result in an unbalanced ring; see http://wiki.apache.org/cassandra/Operations
[junit] ------------- ---------------- ---------------
[junit] Testsuite: org.apache.cassandra.service.InitClientTest
[junit] Tests run: 1, Failures: 0, Errors: 0, Time elapsed: 1.341 sec
[junit]
[junit] Testsuite: org.apache.cassandra.service.LeaveAndBootstrapTest
[junit] Tests run: 6, Failures: 0, Errors: 0, Time elapsed: 6.897 sec
[junit]
[junit] ------------- Standard Error -----------------
[junit] WARN 13:29:01,358 Node /127.0.0.3 'leaving' token mismatch. Long network partition?
[junit] ------------- ---------------- ---------------
[junit] Testsuite: org.apache.cassandra.service.MoveTest
[junit] Tests run: 3, Failures: 0, Errors: 0, Time elapsed: 6.042 sec
[junit]
[junit] Testsuite: org.apache.cassandra.service.RemoveTest
[junit] Tests run: 3, Failures: 0, Errors: 0, Time elapsed: 9.185 sec
[junit]
[junit] ------------- Standard Error -----------------
[junit] ERROR 13:29:16,362 Stream failed because /127.0.0.6 died or was restarted/removed (streams may still be active in background, but further streams won't be started)
[junit] WARN 13:29:16,364 Streaming from /127.0.0.6 failed
[junit] ERROR 13:29:16,364 Stream failed because /127.0.0.6 died or was restarted/removed (streams may still be active in background, but further streams won't be started)
[junit] WARN 13:29:16,365 Streaming from /127.0.0.6 failed
[junit] ERROR 13:29:16,365 Stream failed because /127.0.0.6 died or was restarted/removed (streams may still be active in background, but further streams won't be started)
[junit] WARN 13:29:16,366 Streaming from /127.0.0.6 failed
[junit] ERROR 13:29:16,366 Stream failed because /127.0.0.6 died or was restarted/removed (streams may still be active in background, but further streams won't be started)
[junit] WARN 13:29:16,367 Streaming from /127.0.0.6 failed
[junit] ERROR 13:29:16,367 Stream failed because /127.0.0.6 died or was restarted/removed (streams may still be active in background, but further streams won't be started)
[junit] WARN 13:29:16,367 Streaming from /127.0.0.6 failed
[junit] ERROR 13:29:16,368 Stream failed because /127.0.0.6 died or was restarted/removed (streams may still be active in background, but further streams won't be started)
[junit] WARN 13:29:16,368 Streaming from /127.0.0.6 failed
[junit] ------------- ---------------- ---------------
[junit] Testsuite: org.apache.cassandra.service.RowResolverTest
[junit] Tests run: 8, Failures: 0, Errors: 0, Time elapsed: 5.449 sec
[junit]
[junit] Testsuite: org.apache.cassandra.service.SerializationsTest
[junit] Tests run: 2, Failures: 0, Errors: 0, Time elapsed: 4.509 sec
[junit]
[junit] Testsuite: org.apache.cassandra.service.StorageProxyTest
[junit] Tests run: 4, Failures: 0, Errors: 0, Time elapsed: 5.229 sec
[junit]
[junit] Testsuite: org.apache.cassandra.service.StorageServiceClientTest
[junit] Tests run: 1, Failures: 0, Errors: 0, Time elapsed: 2.851 sec
[junit]
[junit] Testsuite: org.apache.cassandra.service.StorageServiceServerTest
[junit] Tests run: 4, Failures: 0, Errors: 0, Time elapsed: 3.312 sec
[junit]
[junit] ------------- Standard Error -----------------
[junit] WARN 13:29:43,184 No host ID found, created d0114243-c9ee-4d82-89e2-6b1169323255 (Note: This should happen exactly once per node).
[junit] WARN 13:29:43,533 Generated random token [Token(bytes[94abaa424af8e5751e72661416fc158b])]. Random tokens will result in an unbalanced ring; see http://wiki.apache.org/cassandra/Operations
[junit] ------------- ---------------- ---------------
[junit] Testsuite: org.apache.cassandra.streaming.BootstrapTest
[junit] Tests run: 1, Failures: 0, Errors: 0, Time elapsed: 4.907 sec
[junit]
[junit] Testsuite: org.apache.cassandra.streaming.SerializationsTest
[junit] Tests run: 4, Failures: 0, Errors: 0, Time elapsed: 5.181 sec
[junit]
[junit] Testsuite: org.apache.cassandra.streaming.StreamingTransferTest
[junit] Tests run: 5, Failures: 0, Errors: 0, Time elapsed: 5.42 sec
[junit]
[junit] ------------- Standard Error -----------------
[junit] WARN 13:30:02,521 No host ID found, created c6cf3a55-00ce-400f-9f1a-0dc491342954 (Note: This should happen exactly once per node).
[junit] WARN 13:30:02,781 Generated random token [Token(bytes[a21375401ec457a06ccfdfd710a29aac])]. Random tokens will result in an unbalanced ring; see http://wiki.apache.org/cassandra/Operations
[junit] ------------- ---------------- ---------------
[junit] Testsuite: org.apache.cassandra.thrift.ThriftValidationTest
[junit] Tests run: 4, Failures: 0, Errors: 0, Time elapsed: 5.355 sec
[junit]
[junit] Testsuite: org.apache.cassandra.tools.SSTableExportTest
[junit] Tests run: 7, Failures: 0, Errors: 0, Time elapsed: 5.277 sec
[junit]
[junit] ------------- Standard Output ---------------
[junit] Importing 1 keys...
[junit] 1 keys imported successfully.
[junit] [{"columns":[["636f6c4e616d65","76616c",1345642215752],["636f6c4e616d6531","76616c31",1345642215752]],"key":"726f7741","metadata":{"deletionInfo":{"markedForDeleteAt":0,"localDeletionTime":0}}}]
[junit] ------------- ---------------- ---------------
[junit] Testsuite: org.apache.cassandra.tools.SSTableImportTest
[junit] Tests run: 7, Failures: 0, Errors: 0, Time elapsed: 5.422 sec
[junit]
[junit] ------------- Standard Output ---------------
[junit] Counting keys to import, please wait... (NOTE: to skip this use -n <num_keys>)
[junit] Importing 2 keys...
[junit] 2 keys imported successfully.
[junit] Counting keys to import, please wait... (NOTE: to skip this use -n <num_keys>)
[junit] Importing 2 keys...
[junit] 2 keys imported successfully.
[junit] Counting keys to import, please wait... (NOTE: to skip this use -n <num_keys>)
[junit] Importing 2 keys...
[junit] 2 keys imported successfully.
[junit] Importing 3 keys...
[junit] Importing 2 keys...
[junit] 2 keys imported successfully.
[junit] Counting keys to import, please wait... (NOTE: to skip this use -n <num_keys>)
[junit] Importing 2 keys...
[junit] 2 keys imported successfully.
[junit] Counting keys to import, please wait... (NOTE: to skip this use -n <num_keys>)
[junit] Importing 1 keys...
[junit] 1 keys imported successfully.
[junit] ------------- ---------------- ---------------
[junit] ------------- Standard Error -----------------
[junit] Line 2: Key null is greater than previous, collection is not sorted properly. Aborting import. You might need to delete SSTables manually.
[junit] ------------- ---------------- ---------------
[junit] Testsuite: org.apache.cassandra.utils.BloomFilterTest
[junit] Tests run: 7, Failures: 0, Errors: 0, Time elapsed: 0.413 sec
[junit]
[junit] Testsuite: org.apache.cassandra.utils.BoundedStatsDequeTest
[junit] Tests run: 1, Failures: 0, Errors: 0, Time elapsed: 0.04 sec
[junit]
[junit] Testsuite: org.apache.cassandra.utils.ByteBufferUtilTest
[junit] Tests run: 10, Failures: 0, Errors: 0, Time elapsed: 0.055 sec
[junit]
[junit] Testsuite: org.apache.cassandra.utils.BytesReadTrackerTest
[junit] Tests run: 4, Failures: 0, Errors: 0, Time elapsed: 0.043 sec
[junit]
[junit] Testsuite: org.apache.cassandra.utils.EncodedStreamsTest
[junit] Tests run: 4, Failures: 0, Errors: 0, Time elapsed: 5.345 sec
[junit]
[junit] Testsuite: org.apache.cassandra.utils.EstimatedHistogramTest
[junit] Tests run: 5, Failures: 0, Errors: 0, Time elapsed: 0.044 sec
[junit]
[junit] Testsuite: org.apache.cassandra.utils.FBUtilitiesTest
[junit] Tests run: 2, Failures: 0, Errors: 0, Time elapsed: 0.043 sec
[junit]
[junit] Testsuite: org.apache.cassandra.utils.HexTest
[junit] Tests run: 2, Failures: 0, Errors: 0, Time elapsed: 0.044 sec
[junit]
[junit] Testsuite: org.apache.cassandra.utils.IntervalTreeTest
[junit] Tests run: 3, Failures: 0, Errors: 0, Time elapsed: 0.124 sec
[junit]
[junit] Testsuite: org.apache.cassandra.utils.LegacyBloomFilterTest
[junit] Tests run: 6, Failures: 0, Errors: 0, Time elapsed: 0.358 sec
[junit]
[junit] Testsuite: org.apache.cassandra.utils.MergeIteratorTest
[junit] Tests run: 1, Failures: 0, Errors: 0, Time elapsed: 0.054 sec
[junit]
[junit] Testsuite: org.apache.cassandra.utils.MerkleTreeTest
[junit] Tests run: 12, Failures: 0, Errors: 0, Time elapsed: 0.739 sec
[junit]
[junit] Testsuite: org.apache.cassandra.utils.SemanticVersionTest
[junit] Tests run: 4, Failures: 0, Errors: 0, Time elapsed: 0.043 sec
[junit]
[junit] Testsuite: org.apache.cassandra.utils.SerializationsTest
[junit] Tests run: 4, Failures: 0, Errors: 0, Time elapsed: 6.365 sec
[junit]
[junit] Testsuite: org.apache.cassandra.utils.StreamingHistogramTest
[junit] Tests run: 2, Failures: 0, Errors: 0, Time elapsed: 0.044 sec
[junit]
BUILD SUCCESSFUL
Total time: 9 minutes 51 seconds
[TASKS] Scanning folder '<https://builds.apache.org/job/Cassandra-quick/ws/'> for files matching the pattern '**/*.java' - excludes:
[TASKS] Found 843 files to scan for tasks
[TASKS] Found 123 open tasks.
[TASKS] Computing warning deltas based on reference build #82
Recording test results
No test report files were found. Configuration error?
Build step 'Publish JUnit test result report' changed build result to FAILURE
Build failed in Jenkins: Cassandra-quick #1138
Posted by Apache Jenkins Server <je...@builds.apache.org>.
See <https://builds.apache.org/job/Cassandra-quick/1138/>
------------------------------------------
Started by an SCM change
Building remotely on ubuntu4 in workspace <https://builds.apache.org/job/Cassandra-quick/ws/>
Checkout:Cassandra-quick / <https://builds.apache.org/job/Cassandra-quick/ws/> - hudson.remoting.Channel@5a64083a:ubuntu4
Using strategy: Default
Last Built Revision: Revision 0f52874ab5fa857e8f8ead1a52fbb5f0ff27027f (origin/trunk)
Fetching changes from 1 remote Git repository
Fetching upstream changes from https://git-wip-us.apache.org/repos/asf/cassandra.git
Commencing build of Revision 0f52874ab5fa857e8f8ead1a52fbb5f0ff27027f (origin/trunk)
Checking out Revision 0f52874ab5fa857e8f8ead1a52fbb5f0ff27027f (origin/trunk)
FATAL: Could not apply tag jenkins-Cassandra-quick-1138
hudson.plugins.git.GitException: Could not apply tag jenkins-Cassandra-quick-1138
at hudson.plugins.git.GitAPI.tag(GitAPI.java:751)
at hudson.plugins.git.GitSCM$4.invoke(GitSCM.java:1321)
at hudson.plugins.git.GitSCM$4.invoke(GitSCM.java:1269)
at hudson.FilePath$FileCallableWrapper.call(FilePath.java:2196)
at hudson.remoting.UserRequest.perform(UserRequest.java:118)
at hudson.remoting.UserRequest.perform(UserRequest.java:48)
at hudson.remoting.Request$2.run(Request.java:326)
at hudson.remoting.InterceptingExecutorService$1.call(InterceptingExecutorService.java:72)
at java.util.concurrent.FutureTask$Sync.innerRun(FutureTask.java:334)
at java.util.concurrent.FutureTask.run(FutureTask.java:166)
at java.util.concurrent.ThreadPoolExecutor.runWorker(ThreadPoolExecutor.java:1110)
at java.util.concurrent.ThreadPoolExecutor$Worker.run(ThreadPoolExecutor.java:603)
at java.lang.Thread.run(Thread.java:679)
Caused by: hudson.plugins.git.GitException: Command "git tag -a -f -m Jenkins Build #1138 jenkins-Cassandra-quick-1138" returned status code 128:
stdout:
stderr:
*** Please tell me who you are.
Run
git config --global user.email "you@example.com"
git config --global user.name "Your Name"
to set your account's default identity.
Omit --global to set the identity only in this repository.
fatal: empty ident <jenkins@janus.apache.org
> not allowed
at hudson.plugins.git.GitAPI.launchCommandIn(GitAPI.java:818)
at hudson.plugins.git.GitAPI.launchCommand(GitAPI.java:780)
at hudson.plugins.git.GitAPI.launchCommand(GitAPI.java:790)
at hudson.plugins.git.GitAPI.tag(GitAPI.java:749)
... 12 more
Build failed in Jenkins: Cassandra-quick #1137
Posted by Apache Jenkins Server <je...@builds.apache.org>.
See <https://builds.apache.org/job/Cassandra-quick/1137/changes>
Changes:
[dbrosius] remove dead assignment
------------------------------------------
[...truncated 393 lines...]
[junit] Tests run: 1, Failures: 0, Errors: 0, Time elapsed: 0.222 sec
[junit]
[junit] Testsuite: org.apache.cassandra.io.BloomFilterTrackerTest
[junit] Tests run: 3, Failures: 0, Errors: 0, Time elapsed: 5.286 sec
[junit]
[junit] Testsuite: org.apache.cassandra.io.CompactSerializerTest
[junit] Tests run: 2, Failures: 0, Errors: 0, Time elapsed: 6.159 sec
[junit]
[junit] Testsuite: org.apache.cassandra.io.LazilyCompactedRowTest
[junit] Tests run: 7, Failures: 0, Errors: 0, Time elapsed: 6.324 sec
[junit]
[junit] Testsuite: org.apache.cassandra.io.compress.CompressedRandomAccessReaderTest
[junit] Tests run: 3, Failures: 0, Errors: 0, Time elapsed: 0.77 sec
[junit]
[junit] ------------- Standard Error -----------------
[junit] WARN 04:20:00,598 open(null, O_RDONLY) failed, errno (14).
[junit] ------------- ---------------- ---------------
[junit] Testsuite: org.apache.cassandra.io.sstable.DescriptorTest
[junit] Tests run: 3, Failures: 0, Errors: 0, Time elapsed: 0.045 sec
[junit]
[junit] Testsuite: org.apache.cassandra.io.sstable.IndexHelperTest
[junit] Tests run: 1, Failures: 0, Errors: 0, Time elapsed: 0.043 sec
[junit]
[junit] Testsuite: org.apache.cassandra.io.sstable.LegacySSTableTest
[junit] Tests run: 1, Failures: 0, Errors: 0, Time elapsed: 5.768 sec
[junit]
[junit] Testsuite: org.apache.cassandra.io.sstable.SSTableMetadataSerializerTest
[junit] Tests run: 1, Failures: 0, Errors: 0, Time elapsed: 0.099 sec
[junit]
[junit] Testsuite: org.apache.cassandra.io.sstable.SSTableReaderTest
[junit] Tests run: 8, Failures: 0, Errors: 0, Time elapsed: 5.887 sec
[junit]
[junit] ------------- Standard Error -----------------
[junit] WARN 04:20:14,879 setting live ratio to maximum of 64.0 instead of 88.69333333333333
[junit] WARN 04:20:15,081 setting live ratio to maximum of 64.0 instead of 67.44497607655502
[junit] ------------- ---------------- ---------------
[junit] Testsuite: org.apache.cassandra.io.sstable.SSTableSimpleWriterTest
[junit] Tests run: 1, Failures: 0, Errors: 0, Time elapsed: 5.324 sec
[junit]
[junit] Testsuite: org.apache.cassandra.io.sstable.SSTableTest
[junit] Tests run: 2, Failures: 0, Errors: 0, Time elapsed: 5.56 sec
[junit]
[junit] Testsuite: org.apache.cassandra.io.util.BufferedRandomAccessFileTest
[junit] Tests run: 18, Failures: 0, Errors: 0, Time elapsed: 0.854 sec
[junit]
[junit] Testsuite: org.apache.cassandra.locator.DynamicEndpointSnitchTest
[junit] Tests run: 1, Failures: 0, Errors: 0, Time elapsed: 2.035 sec
[junit]
[junit] Testsuite: org.apache.cassandra.locator.EC2SnitchTest
[junit] Tests run: 2, Failures: 0, Errors: 0, Time elapsed: 0.68 sec
[junit]
[junit] Testsuite: org.apache.cassandra.locator.NetworkTopologyStrategyTest
[junit] Tests run: 3, Failures: 0, Errors: 0, Time elapsed: 0.884 sec
[junit]
[junit] Testsuite: org.apache.cassandra.locator.OldNetworkTopologyStrategyTest
[junit] Tests run: 8, Failures: 0, Errors: 0, Time elapsed: 5.744 sec
[junit]
[junit] ------------- Standard Output ---------------
[junit] toStream : [(158873535527910577765226390751398592512,0], (0,34028236692093846346337460743176821145]]
[junit] toFetch : [(127605887595351923798765477786913079296,148873535527910577765226390751398592512]]
[junit] toStreamExpected : [(158873535527910577765226390751398592512,0], (0,34028236692093846346337460743176821145]]
[junit] toFetchExpected : [(127605887595351923798765477786913079296,148873535527910577765226390751398592512]]
[junit] ------------- ---------------- ---------------
[junit] Testsuite: org.apache.cassandra.locator.ReplicationStrategyEndpointCacheTest
[junit] Tests run: 2, Failures: 0, Errors: 0, Time elapsed: 5.178 sec
[junit]
[junit] Testsuite: org.apache.cassandra.locator.SimpleStrategyTest
[junit] Tests run: 4, Failures: 0, Errors: 0, Time elapsed: 5.382 sec
[junit]
[junit] Testsuite: org.apache.cassandra.locator.TokenMetadataTest
[junit] Tests run: 3, Failures: 0, Errors: 0, Time elapsed: 0.685 sec
[junit]
[junit] Testsuite: org.apache.cassandra.service.AntiEntropyServiceCounterTest
[junit] Tests run: 6, Failures: 0, Errors: 0, Time elapsed: 6.3 sec
[junit]
[junit] ------------- Standard Error -----------------
[junit] WARN 04:21:02,010 No host ID found, created 7878a900-4148-42d4-a335-a6d7e16c12d8 (Note: This should happen exactly once per node).
[junit] WARN 04:21:02,282 Generated random token [Token(bytes[1d26276bb00a5609b65a16f8507f6fc3])]. Random tokens will result in an unbalanced ring; see http://wiki.apache.org/cassandra/Operations
[junit] ------------- ---------------- ---------------
[junit] Testsuite: org.apache.cassandra.service.AntiEntropyServiceStandardTest
[junit] Tests run: 6, Failures: 0, Errors: 0, Time elapsed: 6.313 sec
[junit]
[junit] ------------- Standard Error -----------------
[junit] WARN 04:21:09,250 No host ID found, created 146c860b-b0cd-421f-adc5-b74bb952b8ce (Note: This should happen exactly once per node).
[junit] WARN 04:21:09,522 Generated random token [Token(bytes[2dd768482f6db3585c9dabb1a8ecaa67])]. Random tokens will result in an unbalanced ring; see http://wiki.apache.org/cassandra/Operations
[junit] ------------- ---------------- ---------------
[junit] Testsuite: org.apache.cassandra.service.CassandraServerTest
[junit] Tests run: 1, Failures: 0, Errors: 0, Time elapsed: 5.073 sec
[junit]
[junit] Testsuite: org.apache.cassandra.service.EmbeddedCassandraServiceTest
[junit] Tests run: 1, Failures: 0, Errors: 0, Time elapsed: 6.394 sec
[junit]
[junit] ------------- Standard Error -----------------
[junit] WARN 04:21:23,060 Unable to lock JVM memory (ENOMEM). This can result in part of the JVM being swapped out, especially with mmapped I/O enabled. Increase RLIMIT_MEMLOCK or run Cassandra as root.
[junit] WARN 04:21:23,474 No host ID found, created 337420aa-c802-490a-81b0-a788cece2c6d (Note: This should happen exactly once per node).
[junit] WARN 04:21:23,693 Generated random token [Token(bytes[58e13d98341357278ee2e8caf433ba1c])]. Random tokens will result in an unbalanced ring; see http://wiki.apache.org/cassandra/Operations
[junit] ------------- ---------------- ---------------
[junit] Testsuite: org.apache.cassandra.service.InitClientTest
[junit] Tests run: 1, Failures: 0, Errors: 0, Time elapsed: 1.395 sec
[junit]
[junit] Testsuite: org.apache.cassandra.service.LeaveAndBootstrapTest
[junit] Tests run: 6, Failures: 0, Errors: 0, Time elapsed: 6.759 sec
[junit]
[junit] ------------- Standard Error -----------------
[junit] WARN 04:21:34,996 Node /127.0.0.3 'leaving' token mismatch. Long network partition?
[junit] ------------- ---------------- ---------------
[junit] Testsuite: org.apache.cassandra.service.MoveTest
[junit] Tests run: 3, Failures: 0, Errors: 0, Time elapsed: 6.232 sec
[junit]
[junit] Testsuite: org.apache.cassandra.service.RemoveTest
[junit] Tests run: 3, Failures: 0, Errors: 0, Time elapsed: 8.771 sec
[junit]
[junit] ------------- Standard Error -----------------
[junit] ERROR 04:21:49,799 Stream failed because /127.0.0.6 died or was restarted/removed (streams may still be active in background, but further streams won't be started)
[junit] WARN 04:21:49,801 Streaming from /127.0.0.6 failed
[junit] ERROR 04:21:49,801 Stream failed because /127.0.0.6 died or was restarted/removed (streams may still be active in background, but further streams won't be started)
[junit] WARN 04:21:49,801 Streaming from /127.0.0.6 failed
[junit] ERROR 04:21:49,802 Stream failed because /127.0.0.6 died or was restarted/removed (streams may still be active in background, but further streams won't be started)
[junit] WARN 04:21:49,802 Streaming from /127.0.0.6 failed
[junit] ERROR 04:21:49,802 Stream failed because /127.0.0.6 died or was restarted/removed (streams may still be active in background, but further streams won't be started)
[junit] WARN 04:21:49,803 Streaming from /127.0.0.6 failed
[junit] ERROR 04:21:49,807 Stream failed because /127.0.0.6 died or was restarted/removed (streams may still be active in background, but further streams won't be started)
[junit] WARN 04:21:49,811 Streaming from /127.0.0.6 failed
[junit] ERROR 04:21:49,811 Stream failed because /127.0.0.6 died or was restarted/removed (streams may still be active in background, but further streams won't be started)
[junit] WARN 04:21:49,814 Streaming from /127.0.0.6 failed
[junit] ------------- ---------------- ---------------
[junit] Testsuite: org.apache.cassandra.service.RowResolverTest
[junit] Tests run: 8, Failures: 0, Errors: 0, Time elapsed: 5.59 sec
[junit]
[junit] Testsuite: org.apache.cassandra.service.SerializationsTest
[junit] Tests run: 2, Failures: 0, Errors: 0, Time elapsed: 4.738 sec
[junit]
[junit] Testsuite: org.apache.cassandra.service.StorageProxyTest
[junit] Tests run: 4, Failures: 0, Errors: 0, Time elapsed: 5.086 sec
[junit]
[junit] Testsuite: org.apache.cassandra.service.StorageServiceClientTest
[junit] Tests run: 1, Failures: 0, Errors: 0, Time elapsed: 2.853 sec
[junit]
[junit] Testsuite: org.apache.cassandra.service.StorageServiceServerTest
[junit] Tests run: 4, Failures: 0, Errors: 0, Time elapsed: 3.316 sec
[junit]
[junit] ------------- Standard Error -----------------
[junit] WARN 04:22:16,926 No host ID found, created f27fc932-cb64-4260-a2ff-a03c283f0304 (Note: This should happen exactly once per node).
[junit] WARN 04:22:17,283 Generated random token [Token(bytes[cc6fad573f58600633723bde4ba957ce])]. Random tokens will result in an unbalanced ring; see http://wiki.apache.org/cassandra/Operations
[junit] ------------- ---------------- ---------------
[junit] Testsuite: org.apache.cassandra.streaming.BootstrapTest
[junit] Tests run: 1, Failures: 0, Errors: 0, Time elapsed: 5.202 sec
[junit]
[junit] Testsuite: org.apache.cassandra.streaming.SerializationsTest
[junit] Tests run: 4, Failures: 0, Errors: 0, Time elapsed: 5.279 sec
[junit]
[junit] Testsuite: org.apache.cassandra.streaming.StreamingTransferTest
[junit] Tests run: 5, Failures: 0, Errors: 0, Time elapsed: 5.473 sec
[junit]
[junit] ------------- Standard Error -----------------
[junit] WARN 04:22:36,824 No host ID found, created c4bad576-31e2-4fa8-8e5c-6d46f4f30212 (Note: This should happen exactly once per node).
[junit] WARN 04:22:37,050 Generated random token [Token(bytes[21ee4cc00b24c88d9496a81c47789a04])]. Random tokens will result in an unbalanced ring; see http://wiki.apache.org/cassandra/Operations
[junit] ------------- ---------------- ---------------
[junit] Testsuite: org.apache.cassandra.thrift.ThriftValidationTest
[junit] Tests run: 4, Failures: 0, Errors: 0, Time elapsed: 5.478 sec
[junit]
[junit] Testsuite: org.apache.cassandra.tools.SSTableExportTest
[junit] Tests run: 7, Failures: 0, Errors: 0, Time elapsed: 5.456 sec
[junit]
[junit] ------------- Standard Output ---------------
[junit] Importing 1 keys...
[junit] 1 keys imported successfully.
[junit] [{"columns":[["636f6c4e616d65","76616c",1345609370334],["636f6c4e616d6531","76616c31",1345609370334]],"key":"726f7741","metadata":{"deletionInfo":{"markedForDeleteAt":0,"localDeletionTime":0}}}]
[junit] ------------- ---------------- ---------------
[junit] Testsuite: org.apache.cassandra.tools.SSTableImportTest
[junit] Tests run: 7, Failures: 0, Errors: 0, Time elapsed: 5.289 sec
[junit]
[junit] ------------- Standard Output ---------------
[junit] Counting keys to import, please wait... (NOTE: to skip this use -n <num_keys>)
[junit] Importing 2 keys...
[junit] 2 keys imported successfully.
[junit] Counting keys to import, please wait... (NOTE: to skip this use -n <num_keys>)
[junit] Importing 2 keys...
[junit] 2 keys imported successfully.
[junit] Counting keys to import, please wait... (NOTE: to skip this use -n <num_keys>)
[junit] Importing 2 keys...
[junit] 2 keys imported successfully.
[junit] Importing 3 keys...
[junit] Importing 2 keys...
[junit] 2 keys imported successfully.
[junit] Counting keys to import, please wait... (NOTE: to skip this use -n <num_keys>)
[junit] Importing 2 keys...
[junit] 2 keys imported successfully.
[junit] Counting keys to import, please wait... (NOTE: to skip this use -n <num_keys>)
[junit] Importing 1 keys...
[junit] 1 keys imported successfully.
[junit] ------------- ---------------- ---------------
[junit] ------------- Standard Error -----------------
[junit] Line 2: Key null is greater than previous, collection is not sorted properly. Aborting import. You might need to delete SSTables manually.
[junit] ------------- ---------------- ---------------
[junit] Testsuite: org.apache.cassandra.utils.BloomFilterTest
[junit] Tests run: 7, Failures: 0, Errors: 0, Time elapsed: 0.519 sec
[junit]
[junit] Testsuite: org.apache.cassandra.utils.BoundedStatsDequeTest
[junit] Tests run: 1, Failures: 0, Errors: 0, Time elapsed: 0.041 sec
[junit]
[junit] Testsuite: org.apache.cassandra.utils.ByteBufferUtilTest
[junit] Tests run: 10, Failures: 0, Errors: 0, Time elapsed: 0.056 sec
[junit]
[junit] Testsuite: org.apache.cassandra.utils.BytesReadTrackerTest
[junit] Tests run: 4, Failures: 0, Errors: 0, Time elapsed: 0.043 sec
[junit]
[junit] Testsuite: org.apache.cassandra.utils.EncodedStreamsTest
[junit] Tests run: 4, Failures: 0, Errors: 0, Time elapsed: 5.132 sec
[junit]
[junit] Testsuite: org.apache.cassandra.utils.EstimatedHistogramTest
[junit] Tests run: 5, Failures: 0, Errors: 0, Time elapsed: 0.063 sec
[junit]
[junit] Testsuite: org.apache.cassandra.utils.FBUtilitiesTest
[junit] Tests run: 2, Failures: 0, Errors: 0, Time elapsed: 0.043 sec
[junit]
[junit] Testsuite: org.apache.cassandra.utils.HexTest
[junit] Tests run: 2, Failures: 0, Errors: 0, Time elapsed: 0.05 sec
[junit]
[junit] Testsuite: org.apache.cassandra.utils.IntervalTreeTest
[junit] Tests run: 3, Failures: 0, Errors: 0, Time elapsed: 0.124 sec
[junit]
[junit] Testsuite: org.apache.cassandra.utils.LegacyBloomFilterTest
[junit] Tests run: 6, Failures: 0, Errors: 0, Time elapsed: 0.358 sec
[junit]
[junit] Testsuite: org.apache.cassandra.utils.MergeIteratorTest
[junit] Tests run: 1, Failures: 0, Errors: 0, Time elapsed: 0.054 sec
[junit]
[junit] Testsuite: org.apache.cassandra.utils.MerkleTreeTest
[junit] Tests run: 12, Failures: 0, Errors: 0, Time elapsed: 0.802 sec
[junit]
[junit] Testsuite: org.apache.cassandra.utils.SemanticVersionTest
[junit] Tests run: 4, Failures: 0, Errors: 0, Time elapsed: 0.043 sec
[junit]
[junit] Testsuite: org.apache.cassandra.utils.SerializationsTest
[junit] Tests run: 4, Failures: 0, Errors: 0, Time elapsed: 6.546 sec
[junit]
[junit] Testsuite: org.apache.cassandra.utils.StreamingHistogramTest
[junit] Tests run: 2, Failures: 0, Errors: 0, Time elapsed: 0.045 sec
[junit]
BUILD FAILED
/x1/jenkins/jenkins-slave/workspace/Cassandra-quick/build.xml:1094: The following error occurred while executing this line:
/x1/jenkins/jenkins-slave/workspace/Cassandra-quick/build.xml:1056: Some unit test(s) failed.
Total time: 9 minutes 55 seconds
Build step 'Invoke Ant' marked build as failure
[TASKS] Skipping publisher since build result is FAILURE
Recording test results
Build failed in Jenkins: Cassandra-quick #1136
Posted by Apache Jenkins Server <je...@builds.apache.org>.
See <https://builds.apache.org/job/Cassandra-quick/1136/>
------------------------------------------
Started by an SCM change
Building remotely on ubuntu4 in workspace <https://builds.apache.org/job/Cassandra-quick/ws/>
Checkout:Cassandra-quick / <https://builds.apache.org/job/Cassandra-quick/ws/> - hudson.remoting.Channel@699a1ac8:ubuntu4
Using strategy: Default
Last Built Revision: Revision f41684fdef7a9e8628cb40f66c13a88fcf7502e3 (origin/trunk)
Fetching changes from 1 remote Git repository
Fetching upstream changes from https://git-wip-us.apache.org/repos/asf/cassandra.git
Commencing build of Revision 0f52874ab5fa857e8f8ead1a52fbb5f0ff27027f (origin/trunk)
Checking out Revision 0f52874ab5fa857e8f8ead1a52fbb5f0ff27027f (origin/trunk)
FATAL: Could not apply tag jenkins-Cassandra-quick-1136
hudson.plugins.git.GitException: Could not apply tag jenkins-Cassandra-quick-1136
at hudson.plugins.git.GitAPI.tag(GitAPI.java:751)
at hudson.plugins.git.GitSCM$4.invoke(GitSCM.java:1321)
at hudson.plugins.git.GitSCM$4.invoke(GitSCM.java:1269)
at hudson.FilePath$FileCallableWrapper.call(FilePath.java:2196)
at hudson.remoting.UserRequest.perform(UserRequest.java:118)
at hudson.remoting.UserRequest.perform(UserRequest.java:48)
at hudson.remoting.Request$2.run(Request.java:326)
at hudson.remoting.InterceptingExecutorService$1.call(InterceptingExecutorService.java:72)
at java.util.concurrent.FutureTask$Sync.innerRun(FutureTask.java:334)
at java.util.concurrent.FutureTask.run(FutureTask.java:166)
at java.util.concurrent.ThreadPoolExecutor.runWorker(ThreadPoolExecutor.java:1110)
at java.util.concurrent.ThreadPoolExecutor$Worker.run(ThreadPoolExecutor.java:603)
at java.lang.Thread.run(Thread.java:679)
Caused by: hudson.plugins.git.GitException: Command "git tag -a -f -m Jenkins Build #1136 jenkins-Cassandra-quick-1136" returned status code 128:
stdout:
stderr:
*** Please tell me who you are.
Run
git config --global user.email "you@example.com"
git config --global user.name "Your Name"
to set your account's default identity.
Omit --global to set the identity only in this repository.
fatal: empty ident <jenkins@janus.apache.org
> not allowed
at hudson.plugins.git.GitAPI.launchCommandIn(GitAPI.java:818)
at hudson.plugins.git.GitAPI.launchCommand(GitAPI.java:780)
at hudson.plugins.git.GitAPI.launchCommand(GitAPI.java:790)
at hudson.plugins.git.GitAPI.tag(GitAPI.java:749)
... 12 more
Build failed in Jenkins: Cassandra-quick #1135
Posted by Apache Jenkins Server <je...@builds.apache.org>.
See <https://builds.apache.org/job/Cassandra-quick/1135/>
------------------------------------------
Started by an SCM change
Started by an SCM change
Building remotely on ubuntu2 in workspace <https://builds.apache.org/job/Cassandra-quick/ws/>
Checkout:Cassandra-quick / <https://builds.apache.org/job/Cassandra-quick/ws/> - hudson.remoting.Channel@1b0288fe:ubuntu2
Using strategy: Default
Last Built Revision: Revision f41684fdef7a9e8628cb40f66c13a88fcf7502e3 (origin/trunk)
Fetching changes from 1 remote Git repository
Fetching upstream changes from https://git-wip-us.apache.org/repos/asf/cassandra.git
ERROR: Problem fetching from origin / origin - could be unavailable. Continuing anyway
hudson.plugins.git.GitException: Command "git fetch -t https://git-wip-us.apache.org/repos/asf/cassandra.git +refs/heads/*:refs/remotes/origin/*" returned status code 128:
stdout:
stderr: error: gnutls_handshake() failed: Error in the push function. (curl_result = 35, http_code = 0, sha1 = 58e4efd6056acfdf327327d1be14f49865b46b8b)
error: Unable to find 58e4efd6056acfdf327327d1be14f49865b46b8b under https://git-wip-us.apache.org/repos/asf/cassandra.git
Cannot obtain needed tree 58e4efd6056acfdf327327d1be14f49865b46b8b
while processing commit f41684fdef7a9e8628cb40f66c13a88fcf7502e3.
error: Fetch failed.
at hudson.plugins.git.GitAPI.launchCommandIn(GitAPI.java:818)
at hudson.plugins.git.GitAPI.launchCommand(GitAPI.java:780)
at hudson.plugins.git.GitAPI.fetch(GitAPI.java:196)
at hudson.plugins.git.GitAPI.fetch(GitAPI.java:1026)
at hudson.plugins.git.GitSCM.fetchFrom(GitSCM.java:812)
at hudson.plugins.git.GitSCM.access$100(GitSCM.java:90)
at hudson.plugins.git.GitSCM$2.invoke(GitSCM.java:1096)
at hudson.plugins.git.GitSCM$2.invoke(GitSCM.java:1064)
at hudson.FilePath$FileCallableWrapper.call(FilePath.java:2196)
at hudson.remoting.UserRequest.perform(UserRequest.java:118)
at hudson.remoting.UserRequest.perform(UserRequest.java:48)
at hudson.remoting.Request$2.run(Request.java:326)
at hudson.remoting.InterceptingExecutorService$1.call(InterceptingExecutorService.java:72)
at java.util.concurrent.FutureTask$Sync.innerRun(FutureTask.java:334)
at java.util.concurrent.FutureTask.run(FutureTask.java:166)
at java.util.concurrent.ThreadPoolExecutor.runWorker(ThreadPoolExecutor.java:1110)
at java.util.concurrent.ThreadPoolExecutor$Worker.run(ThreadPoolExecutor.java:603)
at java.lang.Thread.run(Thread.java:679)
ERROR: Could not fetch from any repository
FATAL: Could not fetch from any repository
hudson.plugins.git.GitException: Could not fetch from any repository
at hudson.plugins.git.GitSCM$2.invoke(GitSCM.java:1103)
at hudson.plugins.git.GitSCM$2.invoke(GitSCM.java:1064)
at hudson.FilePath$FileCallableWrapper.call(FilePath.java:2196)
at hudson.remoting.UserRequest.perform(UserRequest.java:118)
at hudson.remoting.UserRequest.perform(UserRequest.java:48)
at hudson.remoting.Request$2.run(Request.java:326)
at hudson.remoting.InterceptingExecutorService$1.call(InterceptingExecutorService.java:72)
at java.util.concurrent.FutureTask$Sync.innerRun(FutureTask.java:334)
at java.util.concurrent.FutureTask.run(FutureTask.java:166)
at java.util.concurrent.ThreadPoolExecutor.runWorker(ThreadPoolExecutor.java:1110)
at java.util.concurrent.ThreadPoolExecutor$Worker.run(ThreadPoolExecutor.java:603)
at java.lang.Thread.run(Thread.java:679)
Build failed in Jenkins: Cassandra-quick #1134
Posted by Apache Jenkins Server <je...@builds.apache.org>.
See <https://builds.apache.org/job/Cassandra-quick/1134/>
------------------------------------------
[...truncated 387 lines...]
[junit]
[junit] Testsuite: org.apache.cassandra.io.BloomFilterTrackerTest
[junit] Tests run: 3, Failures: 0, Errors: 0, Time elapsed: 5.371 sec
[junit]
[junit] Testsuite: org.apache.cassandra.io.CompactSerializerTest
[junit] Tests run: 2, Failures: 0, Errors: 0, Time elapsed: 5.739 sec
[junit]
[junit] Testsuite: org.apache.cassandra.io.LazilyCompactedRowTest
[junit] Tests run: 7, Failures: 0, Errors: 0, Time elapsed: 6.344 sec
[junit]
[junit] Testsuite: org.apache.cassandra.io.compress.CompressedRandomAccessReaderTest
[junit] Tests run: 3, Failures: 0, Errors: 0, Time elapsed: 0.755 sec
[junit]
[junit] ------------- Standard Error -----------------
[junit] WARN 21:22:29,648 open(null, O_RDONLY) failed, errno (14).
[junit] ------------- ---------------- ---------------
[junit] Testsuite: org.apache.cassandra.io.sstable.DescriptorTest
[junit] Tests run: 3, Failures: 0, Errors: 0, Time elapsed: 0.046 sec
[junit]
[junit] Testsuite: org.apache.cassandra.io.sstable.IndexHelperTest
[junit] Tests run: 1, Failures: 0, Errors: 0, Time elapsed: 0.045 sec
[junit]
[junit] Testsuite: org.apache.cassandra.io.sstable.LegacySSTableTest
[junit] Tests run: 1, Failures: 0, Errors: 0, Time elapsed: 5.428 sec
[junit]
[junit] Testsuite: org.apache.cassandra.io.sstable.SSTableMetadataSerializerTest
[junit] Tests run: 1, Failures: 0, Errors: 0, Time elapsed: 0.098 sec
[junit]
[junit] Testsuite: org.apache.cassandra.io.sstable.SSTableReaderTest
[junit] Tests run: 8, Failures: 0, Errors: 0, Time elapsed: 5.351 sec
[junit]
[junit] ------------- Standard Error -----------------
[junit] WARN 21:22:42,972 setting live ratio to maximum of 64.0 instead of 87.69777777777777
[junit] WARN 21:22:43,071 setting live ratio to maximum of 64.0 instead of 65.71636363636364
[junit] ------------- ---------------- ---------------
[junit] Testsuite: org.apache.cassandra.io.sstable.SSTableSimpleWriterTest
[junit] Tests run: 1, Failures: 0, Errors: 0, Time elapsed: 4.933 sec
[junit]
[junit] Testsuite: org.apache.cassandra.io.sstable.SSTableTest
[junit] Tests run: 2, Failures: 0, Errors: 0, Time elapsed: 4.921 sec
[junit]
[junit] Testsuite: org.apache.cassandra.io.util.BufferedRandomAccessFileTest
[junit] Tests run: 18, Failures: 0, Errors: 0, Time elapsed: 0.823 sec
[junit]
[junit] Testsuite: org.apache.cassandra.locator.DynamicEndpointSnitchTest
[junit] Tests run: 1, Failures: 0, Errors: 0, Time elapsed: 1.977 sec
[junit]
[junit] Testsuite: org.apache.cassandra.locator.EC2SnitchTest
[junit] Tests run: 2, Failures: 0, Errors: 0, Time elapsed: 0.691 sec
[junit]
[junit] Testsuite: org.apache.cassandra.locator.NetworkTopologyStrategyTest
[junit] Tests run: 3, Failures: 0, Errors: 0, Time elapsed: 0.886 sec
[junit]
[junit] Testsuite: org.apache.cassandra.locator.OldNetworkTopologyStrategyTest
[junit] Tests run: 8, Failures: 0, Errors: 0, Time elapsed: 5.196 sec
[junit]
[junit] ------------- Standard Output ---------------
[junit] toStream : [(158873535527910577765226390751398592512,0], (0,34028236692093846346337460743176821145]]
[junit] toFetch : [(127605887595351923798765477786913079296,148873535527910577765226390751398592512]]
[junit] toStreamExpected : [(158873535527910577765226390751398592512,0], (0,34028236692093846346337460743176821145]]
[junit] toFetchExpected : [(127605887595351923798765477786913079296,148873535527910577765226390751398592512]]
[junit] ------------- ---------------- ---------------
[junit] Testsuite: org.apache.cassandra.locator.ReplicationStrategyEndpointCacheTest
[junit] Tests run: 2, Failures: 0, Errors: 0, Time elapsed: 5.203 sec
[junit]
[junit] Testsuite: org.apache.cassandra.locator.SimpleStrategyTest
[junit] Tests run: 4, Failures: 0, Errors: 0, Time elapsed: 5.115 sec
[junit]
[junit] Testsuite: org.apache.cassandra.locator.TokenMetadataTest
[junit] Tests run: 3, Failures: 0, Errors: 0, Time elapsed: 0.681 sec
[junit]
[junit] Testsuite: org.apache.cassandra.service.AntiEntropyServiceCounterTest
[junit] Tests run: 6, Failures: 0, Errors: 0, Time elapsed: 6.726 sec
[junit]
[junit] ------------- Standard Error -----------------
[junit] WARN 21:23:27,316 No host ID found, created f5df888e-3bf1-4eba-8222-dafabbf26b82 (Note: This should happen exactly once per node).
[junit] WARN 21:23:27,516 Generated random token [Token(bytes[39ef767ce5099e249cb6ea45da59a742])]. Random tokens will result in an unbalanced ring; see http://wiki.apache.org/cassandra/Operations
[junit] ------------- ---------------- ---------------
[junit] Testsuite: org.apache.cassandra.service.AntiEntropyServiceStandardTest
[junit] Tests run: 6, Failures: 0, Errors: 0, Time elapsed: 5.986 sec
[junit]
[junit] ------------- Standard Error -----------------
[junit] WARN 21:23:35,191 No host ID found, created 3dccc7e8-5572-4985-85ca-77790f5307b6 (Note: This should happen exactly once per node).
[junit] WARN 21:23:35,356 Generated random token [Token(bytes[1ae7ab9183231a1ef10b4188ef6b7313])]. Random tokens will result in an unbalanced ring; see http://wiki.apache.org/cassandra/Operations
[junit] ------------- ---------------- ---------------
[junit] Testsuite: org.apache.cassandra.service.CassandraServerTest
[junit] Tests run: 1, Failures: 0, Errors: 0, Time elapsed: 4.826 sec
[junit]
[junit] Testsuite: org.apache.cassandra.service.EmbeddedCassandraServiceTest
[junit] Tests run: 1, Failures: 0, Errors: 0, Time elapsed: 5.694 sec
[junit]
[junit] ------------- Standard Error -----------------
[junit] WARN 21:23:47,891 Unable to lock JVM memory (ENOMEM). This can result in part of the JVM being swapped out, especially with mmapped I/O enabled. Increase RLIMIT_MEMLOCK or run Cassandra as root.
[junit] WARN 21:23:48,277 No host ID found, created e056cf61-ceee-4286-b071-f35679cb74cc (Note: This should happen exactly once per node).
[junit] WARN 21:23:48,446 Generated random token [Token(bytes[3a20ca58a8c2f22cdaa1b72c3c0d1b8a])]. Random tokens will result in an unbalanced ring; see http://wiki.apache.org/cassandra/Operations
[junit] ------------- ---------------- ---------------
[junit] Testsuite: org.apache.cassandra.service.InitClientTest
[junit] Tests run: 1, Failures: 0, Errors: 0, Time elapsed: 1.235 sec
[junit]
[junit] Testsuite: org.apache.cassandra.service.LeaveAndBootstrapTest
[junit] Tests run: 6, Failures: 0, Errors: 0, Time elapsed: 6.709 sec
[junit]
[junit] ------------- Standard Error -----------------
[junit] WARN 21:23:59,390 Node /127.0.0.3 'leaving' token mismatch. Long network partition?
[junit] ------------- ---------------- ---------------
[junit] Testsuite: org.apache.cassandra.service.MoveTest
[junit] Tests run: 3, Failures: 0, Errors: 0, Time elapsed: 6.08 sec
[junit]
[junit] Testsuite: org.apache.cassandra.service.RemoveTest
[junit] Tests run: 3, Failures: 0, Errors: 0, Time elapsed: 8.482 sec
[junit]
[junit] ------------- Standard Error -----------------
[junit] ERROR 21:24:13,492 Stream failed because /127.0.0.6 died or was restarted/removed (streams may still be active in background, but further streams won't be started)
[junit] WARN 21:24:13,493 Streaming from /127.0.0.6 failed
[junit] ERROR 21:24:13,493 Stream failed because /127.0.0.6 died or was restarted/removed (streams may still be active in background, but further streams won't be started)
[junit] WARN 21:24:13,494 Streaming from /127.0.0.6 failed
[junit] ERROR 21:24:13,494 Stream failed because /127.0.0.6 died or was restarted/removed (streams may still be active in background, but further streams won't be started)
[junit] WARN 21:24:13,495 Streaming from /127.0.0.6 failed
[junit] ERROR 21:24:13,495 Stream failed because /127.0.0.6 died or was restarted/removed (streams may still be active in background, but further streams won't be started)
[junit] WARN 21:24:13,495 Streaming from /127.0.0.6 failed
[junit] ERROR 21:24:13,496 Stream failed because /127.0.0.6 died or was restarted/removed (streams may still be active in background, but further streams won't be started)
[junit] WARN 21:24:13,496 Streaming from /127.0.0.6 failed
[junit] ERROR 21:24:13,496 Stream failed because /127.0.0.6 died or was restarted/removed (streams may still be active in background, but further streams won't be started)
[junit] WARN 21:24:13,496 Streaming from /127.0.0.6 failed
[junit] ------------- ---------------- ---------------
[junit] Testsuite: org.apache.cassandra.service.RowResolverTest
[junit] Tests run: 8, Failures: 0, Errors: 0, Time elapsed: 4.91 sec
[junit]
[junit] Testsuite: org.apache.cassandra.service.SerializationsTest
[junit] Tests run: 2, Failures: 0, Errors: 0, Time elapsed: 4.447 sec
[junit]
[junit] Testsuite: org.apache.cassandra.service.StorageProxyTest
[junit] Tests run: 4, Failures: 0, Errors: 0, Time elapsed: 5.195 sec
[junit]
[junit] Testsuite: org.apache.cassandra.service.StorageServiceClientTest
[junit] Tests run: 1, Failures: 0, Errors: 0, Time elapsed: 2.889 sec
[junit]
[junit] Testsuite: org.apache.cassandra.service.StorageServiceServerTest
[junit] Tests run: 4, Failures: 0, Errors: 0, Time elapsed: 3.313 sec
[junit]
[junit] ------------- Standard Error -----------------
[junit] WARN 21:24:39,530 No host ID found, created ec84c963-68be-4d92-9902-5bf83539dae0 (Note: This should happen exactly once per node).
[junit] WARN 21:24:39,884 Generated random token [Token(bytes[542bc143b5b52cf51d65c1e6e152dacd])]. Random tokens will result in an unbalanced ring; see http://wiki.apache.org/cassandra/Operations
[junit] ------------- ---------------- ---------------
[junit] Testsuite: org.apache.cassandra.streaming.BootstrapTest
[junit] Tests run: 1, Failures: 0, Errors: 0, Time elapsed: 5.007 sec
[junit]
[junit] Testsuite: org.apache.cassandra.streaming.SerializationsTest
[junit] Tests run: 4, Failures: 0, Errors: 0, Time elapsed: 5.193 sec
[junit]
[junit] Testsuite: org.apache.cassandra.streaming.StreamingTransferTest
[junit] Tests run: 5, Failures: 0, Errors: 0, Time elapsed: 5.315 sec
[junit]
[junit] ------------- Standard Error -----------------
[junit] WARN 21:24:58,829 No host ID found, created d47c820c-7438-434a-b769-852edcc4ec10 (Note: This should happen exactly once per node).
[junit] WARN 21:24:59,045 Generated random token [Token(bytes[36cd9689c1f8579891ce808218d0149a])]. Random tokens will result in an unbalanced ring; see http://wiki.apache.org/cassandra/Operations
[junit] ------------- ---------------- ---------------
[junit] Testsuite: org.apache.cassandra.thrift.ThriftValidationTest
[junit] Tests run: 4, Failures: 0, Errors: 0, Time elapsed: 5.135 sec
[junit]
[junit] Testsuite: org.apache.cassandra.tools.SSTableExportTest
[junit] Tests run: 7, Failures: 0, Errors: 0, Time elapsed: 5.223 sec
[junit]
[junit] ------------- Standard Output ---------------
[junit] Importing 1 keys...
[junit] 1 keys imported successfully.
[junit] [{"columns":[["636f6c4e616d65","76616c",1345584311729],["636f6c4e616d6531","76616c31",1345584311729]],"key":"726f7741","metadata":{"deletionInfo":{"markedForDeleteAt":0,"localDeletionTime":0}}}]
[junit] ------------- ---------------- ---------------
[junit] Testsuite: org.apache.cassandra.tools.SSTableImportTest
[junit] Tests run: 7, Failures: 0, Errors: 0, Time elapsed: 4.983 sec
[junit]
[junit] ------------- Standard Output ---------------
[junit] Counting keys to import, please wait... (NOTE: to skip this use -n <num_keys>)
[junit] Importing 2 keys...
[junit] 2 keys imported successfully.
[junit] Counting keys to import, please wait... (NOTE: to skip this use -n <num_keys>)
[junit] Importing 2 keys...
[junit] 2 keys imported successfully.
[junit] Counting keys to import, please wait... (NOTE: to skip this use -n <num_keys>)
[junit] Importing 2 keys...
[junit] 2 keys imported successfully.
[junit] Importing 3 keys...
[junit] Importing 2 keys...
[junit] 2 keys imported successfully.
[junit] Counting keys to import, please wait... (NOTE: to skip this use -n <num_keys>)
[junit] Importing 2 keys...
[junit] 2 keys imported successfully.
[junit] Counting keys to import, please wait... (NOTE: to skip this use -n <num_keys>)
[junit] Importing 1 keys...
[junit] 1 keys imported successfully.
[junit] ------------- ---------------- ---------------
[junit] ------------- Standard Error -----------------
[junit] Line 2: Key null is greater than previous, collection is not sorted properly. Aborting import. You might need to delete SSTables manually.
[junit] ------------- ---------------- ---------------
[junit] Testsuite: org.apache.cassandra.utils.BloomFilterTest
[junit] Tests run: 7, Failures: 0, Errors: 0, Time elapsed: 0.454 sec
[junit]
[junit] Testsuite: org.apache.cassandra.utils.BoundedStatsDequeTest
[junit] Tests run: 1, Failures: 0, Errors: 0, Time elapsed: 0.042 sec
[junit]
[junit] Testsuite: org.apache.cassandra.utils.ByteBufferUtilTest
[junit] Tests run: 10, Failures: 0, Errors: 0, Time elapsed: 0.057 sec
[junit]
[junit] Testsuite: org.apache.cassandra.utils.BytesReadTrackerTest
[junit] Tests run: 4, Failures: 0, Errors: 0, Time elapsed: 0.043 sec
[junit]
[junit] Testsuite: org.apache.cassandra.utils.EncodedStreamsTest
[junit] Tests run: 4, Failures: 0, Errors: 0, Time elapsed: 5.146 sec
[junit]
[junit] Testsuite: org.apache.cassandra.utils.EstimatedHistogramTest
[junit] Tests run: 5, Failures: 0, Errors: 0, Time elapsed: 0.044 sec
[junit]
[junit] Testsuite: org.apache.cassandra.utils.FBUtilitiesTest
[junit] Tests run: 2, Failures: 0, Errors: 0, Time elapsed: 0.046 sec
[junit]
[junit] Testsuite: org.apache.cassandra.utils.HexTest
[junit] Tests run: 2, Failures: 0, Errors: 0, Time elapsed: 0.045 sec
[junit]
[junit] Testsuite: org.apache.cassandra.utils.IntervalTreeTest
[junit] Tests run: 3, Failures: 0, Errors: 0, Time elapsed: 0.142 sec
[junit]
[junit] Testsuite: org.apache.cassandra.utils.LegacyBloomFilterTest
[junit] Tests run: 6, Failures: 0, Errors: 0, Time elapsed: 0.33 sec
[junit]
[junit] Testsuite: org.apache.cassandra.utils.MergeIteratorTest
[junit] Tests run: 1, Failures: 0, Errors: 0, Time elapsed: 0.059 sec
[junit]
[junit] Testsuite: org.apache.cassandra.utils.MerkleTreeTest
[junit] Tests run: 12, Failures: 0, Errors: 0, Time elapsed: 0.788 sec
[junit]
[junit] Testsuite: org.apache.cassandra.utils.SemanticVersionTest
[junit] Tests run: 4, Failures: 0, Errors: 0, Time elapsed: 0.045 sec
[junit]
[junit] Testsuite: org.apache.cassandra.utils.SerializationsTest
[junit] Tests run: 4, Failures: 0, Errors: 0, Time elapsed: 6.591 sec
[junit]
[junit] Testsuite: org.apache.cassandra.utils.StreamingHistogramTest
[junit] Tests run: 2, Failures: 0, Errors: 0, Time elapsed: 0.045 sec
[junit]
BUILD SUCCESSFUL
Total time: 9 minutes 34 seconds
[TASKS] Scanning folder '<https://builds.apache.org/job/Cassandra-quick/ws/'> for files matching the pattern '**/*.java' - excludes:
[TASKS] Found 843 files to scan for tasks
[TASKS] Found 123 open tasks.
[TASKS] Computing warning deltas based on reference build #82
Recording test results
No test report files were found. Configuration error?
Build step 'Publish JUnit test result report' changed build result to FAILURE
Build failed in Jenkins: Cassandra-quick #1133
Posted by Apache Jenkins Server <je...@builds.apache.org>.
See <https://builds.apache.org/job/Cassandra-quick/1133/changes>
Changes:
[xedin] add Murmur3Partitioner and make it default for new installations
------------------------------------------
[...truncated 390 lines...]
[junit]
[junit] Testsuite: org.apache.cassandra.io.CompactSerializerTest
[junit] Tests run: 2, Failures: 0, Errors: 0, Time elapsed: 7.442 sec
[junit]
[junit] Testsuite: org.apache.cassandra.io.LazilyCompactedRowTest
[junit] Tests run: 7, Failures: 0, Errors: 0, Time elapsed: 8.302 sec
[junit]
[junit] ------------- Standard Error -----------------
[junit] WARN 20:54:10,347 setting live ratio to maximum of 64.0 instead of 90.66666666666667
[junit] ------------- ---------------- ---------------
[junit] Testsuite: org.apache.cassandra.io.compress.CompressedRandomAccessReaderTest
[junit] Tests run: 3, Failures: 0, Errors: 0, Time elapsed: 1.078 sec
[junit]
[junit] ------------- Standard Error -----------------
[junit] WARN 20:54:14,279 open(null, O_RDONLY) failed, errno (14).
[junit] ------------- ---------------- ---------------
[junit] Testsuite: org.apache.cassandra.io.sstable.DescriptorTest
[junit] Tests run: 3, Failures: 0, Errors: 0, Time elapsed: 0.06 sec
[junit]
[junit] Testsuite: org.apache.cassandra.io.sstable.IndexHelperTest
[junit] Tests run: 1, Failures: 0, Errors: 0, Time elapsed: 0.064 sec
[junit]
[junit] Testsuite: org.apache.cassandra.io.sstable.LegacySSTableTest
[junit] Tests run: 1, Failures: 0, Errors: 0, Time elapsed: 6.828 sec
[junit]
[junit] Testsuite: org.apache.cassandra.io.sstable.SSTableMetadataSerializerTest
[junit] Tests run: 1, Failures: 0, Errors: 0, Time elapsed: 0.136 sec
[junit]
[junit] Testsuite: org.apache.cassandra.io.sstable.SSTableReaderTest
[junit] Tests run: 8, Failures: 0, Errors: 0, Time elapsed: 8.316 sec
[junit]
[junit] ------------- Standard Error -----------------
[junit] WARN 20:54:31,680 setting live ratio to maximum of 64.0 instead of 85.62962962962963
[junit] WARN 20:54:32,281 setting live ratio to maximum of 64.0 instead of 67.60059612518629
[junit] ------------- ---------------- ---------------
[junit] Testsuite: org.apache.cassandra.io.sstable.SSTableSimpleWriterTest
[junit] Tests run: 1, Failures: 0, Errors: 0, Time elapsed: 6.145 sec
[junit]
[junit] Testsuite: org.apache.cassandra.io.sstable.SSTableTest
[junit] Tests run: 2, Failures: 0, Errors: 0, Time elapsed: 6.23 sec
[junit]
[junit] Testsuite: org.apache.cassandra.io.util.BufferedRandomAccessFileTest
[junit] Tests run: 18, Failures: 0, Errors: 0, Time elapsed: 1.215 sec
[junit]
[junit] Testsuite: org.apache.cassandra.locator.DynamicEndpointSnitchTest
[junit] Tests run: 1, Failures: 0, Errors: 0, Time elapsed: 2.266 sec
[junit]
[junit] Testsuite: org.apache.cassandra.locator.EC2SnitchTest
[junit] Tests run: 2, Failures: 0, Errors: 0, Time elapsed: 0.922 sec
[junit]
[junit] Testsuite: org.apache.cassandra.locator.NetworkTopologyStrategyTest
[junit] Tests run: 3, Failures: 0, Errors: 0, Time elapsed: 1.155 sec
[junit]
[junit] Testsuite: org.apache.cassandra.locator.OldNetworkTopologyStrategyTest
[junit] Tests run: 8, Failures: 0, Errors: 0, Time elapsed: 6.14 sec
[junit]
[junit] ------------- Standard Output ---------------
[junit] toStream : [(158873535527910577765226390751398592512,0], (0,34028236692093846346337460743176821145]]
[junit] toFetch : [(127605887595351923798765477786913079296,148873535527910577765226390751398592512]]
[junit] toStreamExpected : [(158873535527910577765226390751398592512,0], (0,34028236692093846346337460743176821145]]
[junit] toFetchExpected : [(127605887595351923798765477786913079296,148873535527910577765226390751398592512]]
[junit] ------------- ---------------- ---------------
[junit] Testsuite: org.apache.cassandra.locator.ReplicationStrategyEndpointCacheTest
[junit] Tests run: 2, Failures: 0, Errors: 0, Time elapsed: 6.443 sec
[junit]
[junit] Testsuite: org.apache.cassandra.locator.SimpleStrategyTest
[junit] Tests run: 4, Failures: 0, Errors: 0, Time elapsed: 6.285 sec
[junit]
[junit] Testsuite: org.apache.cassandra.locator.TokenMetadataTest
[junit] Tests run: 3, Failures: 0, Errors: 0, Time elapsed: 0.927 sec
[junit]
[junit] Testsuite: org.apache.cassandra.service.AntiEntropyServiceCounterTest
[junit] Tests run: 6, Failures: 0, Errors: 0, Time elapsed: 7.326 sec
[junit]
[junit] ------------- Standard Error -----------------
[junit] WARN 20:55:25,199 No host ID found, created 580774e7-1204-4619-86bc-50371b318588 (Note: This should happen exactly once per node).
[junit] WARN 20:55:25,425 Generated random token [Token(bytes[cf338baccd783c4ee63d1f787cefdf1d])]. Random tokens will result in an unbalanced ring; see http://wiki.apache.org/cassandra/Operations
[junit] ------------- ---------------- ---------------
[junit] Testsuite: org.apache.cassandra.service.AntiEntropyServiceStandardTest
[junit] Tests run: 6, Failures: 0, Errors: 0, Time elapsed: 7.074 sec
[junit]
[junit] ------------- Standard Error -----------------
[junit] WARN 20:55:33,562 No host ID found, created 15d41932-18d8-4761-af94-8337f3a9c8b9 (Note: This should happen exactly once per node).
[junit] WARN 20:55:33,786 Generated random token [Token(bytes[963a6b1477cff9255ec48712c0730eb9])]. Random tokens will result in an unbalanced ring; see http://wiki.apache.org/cassandra/Operations
[junit] ------------- ---------------- ---------------
[junit] Testsuite: org.apache.cassandra.service.CassandraServerTest
[junit] Tests run: 1, Failures: 0, Errors: 0, Time elapsed: 7.121 sec
[junit]
[junit] Testsuite: org.apache.cassandra.service.EmbeddedCassandraServiceTest
[junit] Tests run: 1, Failures: 0, Errors: 0, Time elapsed: 6.998 sec
[junit]
[junit] ------------- Standard Error -----------------
[junit] WARN 20:55:49,733 Unable to lock JVM memory (ENOMEM). This can result in part of the JVM being swapped out, especially with mmapped I/O enabled. Increase RLIMIT_MEMLOCK or run Cassandra as root.
[junit] WARN 20:55:50,196 No host ID found, created d4fbccdd-1c2a-43d1-975a-c373760769b5 (Note: This should happen exactly once per node).
[junit] WARN 20:55:50,412 Generated random token [Token(bytes[f39c76328757aa38218962a30f56ba4a])]. Random tokens will result in an unbalanced ring; see http://wiki.apache.org/cassandra/Operations
[junit] ------------- ---------------- ---------------
[junit] Testsuite: org.apache.cassandra.service.InitClientTest
[junit] Tests run: 1, Failures: 0, Errors: 0, Time elapsed: 1.482 sec
[junit]
[junit] Testsuite: org.apache.cassandra.service.LeaveAndBootstrapTest
[junit] Tests run: 6, Failures: 0, Errors: 0, Time elapsed: 8.641 sec
[junit]
[junit] ------------- Standard Error -----------------
[junit] WARN 20:56:03,332 Node /127.0.0.3 'leaving' token mismatch. Long network partition?
[junit] ------------- ---------------- ---------------
[junit] Testsuite: org.apache.cassandra.service.MoveTest
[junit] Tests run: 3, Failures: 0, Errors: 0, Time elapsed: 7.588 sec
[junit]
[junit] Testsuite: org.apache.cassandra.service.RemoveTest
[junit] Tests run: 3, Failures: 0, Errors: 0, Time elapsed: 10.883 sec
[junit]
[junit] ------------- Standard Error -----------------
[junit] ERROR 20:56:21,644 Stream failed because /127.0.0.6 died or was restarted/removed (streams may still be active in background, but further streams won't be started)
[junit] WARN 20:56:21,645 Streaming from /127.0.0.6 failed
[junit] ERROR 20:56:21,645 Stream failed because /127.0.0.6 died or was restarted/removed (streams may still be active in background, but further streams won't be started)
[junit] WARN 20:56:21,645 Streaming from /127.0.0.6 failed
[junit] ERROR 20:56:21,645 Stream failed because /127.0.0.6 died or was restarted/removed (streams may still be active in background, but further streams won't be started)
[junit] WARN 20:56:21,646 Streaming from /127.0.0.6 failed
[junit] ERROR 20:56:21,646 Stream failed because /127.0.0.6 died or was restarted/removed (streams may still be active in background, but further streams won't be started)
[junit] WARN 20:56:21,646 Streaming from /127.0.0.6 failed
[junit] ERROR 20:56:21,646 Stream failed because /127.0.0.6 died or was restarted/removed (streams may still be active in background, but further streams won't be started)
[junit] WARN 20:56:21,646 Streaming from /127.0.0.6 failed
[junit] ERROR 20:56:21,646 Stream failed because /127.0.0.6 died or was restarted/removed (streams may still be active in background, but further streams won't be started)
[junit] WARN 20:56:21,646 Streaming from /127.0.0.6 failed
[junit] ------------- ---------------- ---------------
[junit] Testsuite: org.apache.cassandra.service.RowResolverTest
[junit] Tests run: 8, Failures: 0, Errors: 0, Time elapsed: 6.096 sec
[junit]
[junit] Testsuite: org.apache.cassandra.service.SerializationsTest
[junit] Tests run: 2, Failures: 0, Errors: 0, Time elapsed: 5.404 sec
[junit]
[junit] Testsuite: org.apache.cassandra.service.StorageProxyTest
[junit] Tests run: 4, Failures: 0, Errors: 0, Time elapsed: 6.219 sec
[junit]
[junit] Testsuite: org.apache.cassandra.service.StorageServiceClientTest
[junit] Tests run: 1, Failures: 0, Errors: 0, Time elapsed: 3.104 sec
[junit]
[junit] Testsuite: org.apache.cassandra.service.StorageServiceServerTest
[junit] Tests run: 4, Failures: 0, Errors: 0, Time elapsed: 3.643 sec
[junit]
[junit] ------------- Standard Error -----------------
[junit] WARN 20:56:51,677 No host ID found, created 353b2103-cd2a-490f-8ac4-72707dae5200 (Note: This should happen exactly once per node).
[junit] WARN 20:56:52,110 Generated random token [Token(bytes[dfd8fe0f40bef9ea90eafdb56e5c06a3])]. Random tokens will result in an unbalanced ring; see http://wiki.apache.org/cassandra/Operations
[junit] ------------- ---------------- ---------------
[junit] Testsuite: org.apache.cassandra.streaming.BootstrapTest
[junit] Tests run: 1, Failures: 0, Errors: 0, Time elapsed: 6.214 sec
[junit]
[junit] Testsuite: org.apache.cassandra.streaming.SerializationsTest
[junit] Tests run: 4, Failures: 0, Errors: 0, Time elapsed: 6.324 sec
[junit]
[junit] Testsuite: org.apache.cassandra.streaming.StreamingTransferTest
[junit] Tests run: 5, Failures: 0, Errors: 0, Time elapsed: 7.167 sec
[junit]
[junit] ------------- Standard Error -----------------
[junit] WARN 20:57:14,537 No host ID found, created e32d0f19-ac1e-4269-a4c2-ec152ef89f6b (Note: This should happen exactly once per node).
[junit] WARN 20:57:14,737 Generated random token [Token(bytes[cdacebfc9fd93b2f10ffe51bd9877da7])]. Random tokens will result in an unbalanced ring; see http://wiki.apache.org/cassandra/Operations
[junit] ------------- ---------------- ---------------
[junit] Testsuite: org.apache.cassandra.thrift.ThriftValidationTest
[junit] Tests run: 4, Failures: 0, Errors: 0, Time elapsed: 7.451 sec
[junit]
[junit] Testsuite: org.apache.cassandra.tools.SSTableExportTest
[junit] Tests run: 7, Failures: 0, Errors: 0, Time elapsed: 7.583 sec
[junit]
[junit] ------------- Standard Output ---------------
[junit] Importing 1 keys...
[junit] 1 keys imported successfully.
[junit] [{"columns":[["636f6c4e616d65","76616c",1345582656253],["636f6c4e616d6531","76616c31",1345582656253]],"key":"726f7741","metadata":{"deletionInfo":{"markedForDeleteAt":0,"localDeletionTime":0}}}]
[junit] ------------- ---------------- ---------------
[junit] Testsuite: org.apache.cassandra.tools.SSTableImportTest
[junit] Tests run: 7, Failures: 0, Errors: 0, Time elapsed: 7.997 sec
[junit]
[junit] ------------- Standard Output ---------------
[junit] Counting keys to import, please wait... (NOTE: to skip this use -n <num_keys>)
[junit] Importing 2 keys...
[junit] 2 keys imported successfully.
[junit] Counting keys to import, please wait... (NOTE: to skip this use -n <num_keys>)
[junit] Importing 2 keys...
[junit] 2 keys imported successfully.
[junit] Counting keys to import, please wait... (NOTE: to skip this use -n <num_keys>)
[junit] Importing 2 keys...
[junit] 2 keys imported successfully.
[junit] Importing 3 keys...
[junit] Importing 2 keys...
[junit] 2 keys imported successfully.
[junit] Counting keys to import, please wait... (NOTE: to skip this use -n <num_keys>)
[junit] Importing 2 keys...
[junit] 2 keys imported successfully.
[junit] Counting keys to import, please wait... (NOTE: to skip this use -n <num_keys>)
[junit] Importing 1 keys...
[junit] 1 keys imported successfully.
[junit] ------------- ---------------- ---------------
[junit] ------------- Standard Error -----------------
[junit] Line 2: Key null is greater than previous, collection is not sorted properly. Aborting import. You might need to delete SSTables manually.
[junit] ------------- ---------------- ---------------
[junit] Testsuite: org.apache.cassandra.utils.BloomFilterTest
[junit] Tests run: 7, Failures: 0, Errors: 0, Time elapsed: 0.53 sec
[junit]
[junit] Testsuite: org.apache.cassandra.utils.BoundedStatsDequeTest
[junit] Tests run: 1, Failures: 0, Errors: 0, Time elapsed: 0.057 sec
[junit]
[junit] Testsuite: org.apache.cassandra.utils.ByteBufferUtilTest
[junit] Tests run: 10, Failures: 0, Errors: 0, Time elapsed: 0.075 sec
[junit]
[junit] Testsuite: org.apache.cassandra.utils.BytesReadTrackerTest
[junit] Tests run: 4, Failures: 0, Errors: 0, Time elapsed: 0.058 sec
[junit]
[junit] Testsuite: org.apache.cassandra.utils.EncodedStreamsTest
[junit] Tests run: 4, Failures: 0, Errors: 0, Time elapsed: 7.385 sec
[junit]
[junit] Testsuite: org.apache.cassandra.utils.EstimatedHistogramTest
[junit] Tests run: 5, Failures: 0, Errors: 0, Time elapsed: 0.06 sec
[junit]
[junit] Testsuite: org.apache.cassandra.utils.FBUtilitiesTest
[junit] Tests run: 2, Failures: 0, Errors: 0, Time elapsed: 0.06 sec
[junit]
[junit] Testsuite: org.apache.cassandra.utils.HexTest
[junit] Tests run: 2, Failures: 0, Errors: 0, Time elapsed: 0.061 sec
[junit]
[junit] Testsuite: org.apache.cassandra.utils.IntervalTreeTest
[junit] Tests run: 3, Failures: 0, Errors: 0, Time elapsed: 0.169 sec
[junit]
[junit] Testsuite: org.apache.cassandra.utils.LegacyBloomFilterTest
[junit] Tests run: 6, Failures: 0, Errors: 0, Time elapsed: 0.461 sec
[junit]
[junit] Testsuite: org.apache.cassandra.utils.MergeIteratorTest
[junit] Tests run: 1, Failures: 0, Errors: 0, Time elapsed: 0.074 sec
[junit]
[junit] Testsuite: org.apache.cassandra.utils.MerkleTreeTest
[junit] Tests run: 12, Failures: 0, Errors: 0, Time elapsed: 1.007 sec
[junit]
[junit] Testsuite: org.apache.cassandra.utils.SemanticVersionTest
[junit] Tests run: 4, Failures: 0, Errors: 0, Time elapsed: 0.063 sec
[junit]
[junit] Testsuite: org.apache.cassandra.utils.SerializationsTest
[junit] Tests run: 4, Failures: 0, Errors: 0, Time elapsed: 23.53 sec
[junit]
[junit] Testsuite: org.apache.cassandra.utils.StreamingHistogramTest
[junit] Tests run: 2, Failures: 0, Errors: 0, Time elapsed: 0.06 sec
[junit]
BUILD SUCCESSFUL
Total time: 12 minutes 18 seconds
[TASKS] Scanning folder '<https://builds.apache.org/job/Cassandra-quick/ws/'> for files matching the pattern '**/*.java' - excludes:
[TASKS] Found 843 files to scan for tasks
[TASKS] Found 123 open tasks.
[TASKS] Computing warning deltas based on reference build #82
Recording test results
No test report files were found. Configuration error?
Build step 'Publish JUnit test result report' changed build result to FAILURE
Build failed in Jenkins: Cassandra-quick #1132
Posted by Apache Jenkins Server <je...@builds.apache.org>.
See <https://builds.apache.org/job/Cassandra-quick/1132/>
------------------------------------------
Started by an SCM change
Building remotely on ubuntu4 in workspace <https://builds.apache.org/job/Cassandra-quick/ws/>
Checkout:Cassandra-quick / <https://builds.apache.org/job/Cassandra-quick/ws/> - hudson.remoting.Channel@7b8d7ccb:ubuntu4
Using strategy: Default
Last Built Revision: Revision dafcaeb06103eb6e86ada1798ef6ce5cc4e87dac (origin/trunk)
Fetching changes from 1 remote Git repository
Fetching upstream changes from https://git-wip-us.apache.org/repos/asf/cassandra.git
Commencing build of Revision dafcaeb06103eb6e86ada1798ef6ce5cc4e87dac (origin/trunk)
Checking out Revision dafcaeb06103eb6e86ada1798ef6ce5cc4e87dac (origin/trunk)
FATAL: Could not apply tag jenkins-Cassandra-quick-1132
hudson.plugins.git.GitException: Could not apply tag jenkins-Cassandra-quick-1132
at hudson.plugins.git.GitAPI.tag(GitAPI.java:751)
at hudson.plugins.git.GitSCM$4.invoke(GitSCM.java:1321)
at hudson.plugins.git.GitSCM$4.invoke(GitSCM.java:1269)
at hudson.FilePath$FileCallableWrapper.call(FilePath.java:2196)
at hudson.remoting.UserRequest.perform(UserRequest.java:118)
at hudson.remoting.UserRequest.perform(UserRequest.java:48)
at hudson.remoting.Request$2.run(Request.java:326)
at hudson.remoting.InterceptingExecutorService$1.call(InterceptingExecutorService.java:72)
at java.util.concurrent.FutureTask$Sync.innerRun(FutureTask.java:334)
at java.util.concurrent.FutureTask.run(FutureTask.java:166)
at java.util.concurrent.ThreadPoolExecutor.runWorker(ThreadPoolExecutor.java:1110)
at java.util.concurrent.ThreadPoolExecutor$Worker.run(ThreadPoolExecutor.java:603)
at java.lang.Thread.run(Thread.java:679)
Caused by: hudson.plugins.git.GitException: Command "git tag -a -f -m Jenkins Build #1132 jenkins-Cassandra-quick-1132" returned status code 128:
stdout:
stderr:
*** Please tell me who you are.
Run
git config --global user.email "you@example.com"
git config --global user.name "Your Name"
to set your account's default identity.
Omit --global to set the identity only in this repository.
fatal: empty ident <jenkins@janus.apache.org
> not allowed
at hudson.plugins.git.GitAPI.launchCommandIn(GitAPI.java:818)
at hudson.plugins.git.GitAPI.launchCommand(GitAPI.java:780)
at hudson.plugins.git.GitAPI.launchCommand(GitAPI.java:790)
at hudson.plugins.git.GitAPI.tag(GitAPI.java:749)
... 12 more
Build failed in Jenkins: Cassandra-quick #1131
Posted by Apache Jenkins Server <je...@builds.apache.org>.
See <https://builds.apache.org/job/Cassandra-quick/1131/>
------------------------------------------
[...truncated 396 lines...]
[junit] Tests run: 3, Failures: 0, Errors: 0, Time elapsed: 13.286 sec
[junit]
[junit] Testsuite: org.apache.cassandra.io.CompactSerializerTest
[junit] Tests run: 2, Failures: 0, Errors: 0, Time elapsed: 14.349 sec
[junit]
[junit] Testsuite: org.apache.cassandra.io.LazilyCompactedRowTest
[junit] Tests run: 7, Failures: 0, Errors: 0, Time elapsed: 27.209 sec
[junit]
[junit] ------------- Standard Error -----------------
[junit] WARN 19:00:43,790 setting live ratio to maximum of 64.0 instead of 90.66666666666667
[junit] ------------- ---------------- ---------------
[junit] Testsuite: org.apache.cassandra.io.compress.CompressedRandomAccessReaderTest
[junit] Tests run: 3, Failures: 0, Errors: 0, Time elapsed: 1.481 sec
[junit]
[junit] ------------- Standard Error -----------------
[junit] WARN 19:00:56,239 open(null, O_RDONLY) failed, errno (14).
[junit] ------------- ---------------- ---------------
[junit] Testsuite: org.apache.cassandra.io.sstable.DescriptorTest
[junit] Tests run: 3, Failures: 0, Errors: 0, Time elapsed: 0.061 sec
[junit]
[junit] Testsuite: org.apache.cassandra.io.sstable.IndexHelperTest
[junit] Tests run: 1, Failures: 0, Errors: 0, Time elapsed: 0.06 sec
[junit]
[junit] Testsuite: org.apache.cassandra.io.sstable.LegacySSTableTest
[junit] Tests run: 1, Failures: 0, Errors: 0, Time elapsed: 13.79 sec
[junit]
[junit] Testsuite: org.apache.cassandra.io.sstable.SSTableMetadataSerializerTest
[junit] Tests run: 1, Failures: 0, Errors: 0, Time elapsed: 0.138 sec
[junit]
[junit] Testsuite: org.apache.cassandra.io.sstable.SSTableReaderTest
[junit] Tests run: 8, Failures: 0, Errors: 0, Time elapsed: 20.499 sec
[junit]
[junit] ------------- Standard Error -----------------
[junit] WARN 19:01:28,758 setting live ratio to maximum of 64.0 instead of 85.71428571428571
[junit] WARN 19:01:31,718 setting live ratio to maximum of 64.0 instead of 67.63636363636364
[junit] ------------- ---------------- ---------------
[junit] Testsuite: org.apache.cassandra.io.sstable.SSTableSimpleWriterTest
[junit] Tests run: 1, Failures: 0, Errors: 0, Time elapsed: 15.458 sec
[junit]
[junit] Testsuite: org.apache.cassandra.io.sstable.SSTableTest
[junit] Tests run: 2, Failures: 0, Errors: 0, Time elapsed: 15.072 sec
[junit]
[junit] Testsuite: org.apache.cassandra.io.util.BufferedRandomAccessFileTest
[junit] Tests run: 18, Failures: 0, Errors: 0, Time elapsed: 4.594 sec
[junit]
[junit] Testsuite: org.apache.cassandra.locator.DynamicEndpointSnitchTest
[junit] Tests run: 1, Failures: 0, Errors: 0, Time elapsed: 2.232 sec
[junit]
[junit] Testsuite: org.apache.cassandra.locator.EC2SnitchTest
[junit] Tests run: 2, Failures: 0, Errors: 0, Time elapsed: 0.933 sec
[junit]
[junit] Testsuite: org.apache.cassandra.locator.NetworkTopologyStrategyTest
[junit] Tests run: 3, Failures: 0, Errors: 0, Time elapsed: 1.102 sec
[junit]
[junit] Testsuite: org.apache.cassandra.locator.OldNetworkTopologyStrategyTest
[junit] Tests run: 8, Failures: 0, Errors: 0, Time elapsed: 18.536 sec
[junit]
[junit] ------------- Standard Output ---------------
[junit] toStream : [(158873535527910577765226390751398592512,0], (0,34028236692093846346337460743176821145]]
[junit] toFetch : [(127605887595351923798765477786913079296,148873535527910577765226390751398592512]]
[junit] toStreamExpected : [(158873535527910577765226390751398592512,0], (0,34028236692093846346337460743176821145]]
[junit] toFetchExpected : [(127605887595351923798765477786913079296,148873535527910577765226390751398592512]]
[junit] ------------- ---------------- ---------------
[junit] Testsuite: org.apache.cassandra.locator.ReplicationStrategyEndpointCacheTest
[junit] Tests run: 2, Failures: 0, Errors: 0, Time elapsed: 17.302 sec
[junit]
[junit] Testsuite: org.apache.cassandra.locator.SimpleStrategyTest
[junit] Tests run: 4, Failures: 0, Errors: 0, Time elapsed: 11.837 sec
[junit]
[junit] Testsuite: org.apache.cassandra.locator.TokenMetadataTest
[junit] Tests run: 3, Failures: 0, Errors: 0, Time elapsed: 0.926 sec
[junit]
[junit] Testsuite: org.apache.cassandra.service.AntiEntropyServiceCounterTest
[junit] Tests run: 6, Failures: 0, Errors: 0, Time elapsed: 16.676 sec
[junit]
[junit] ------------- Standard Error -----------------
[junit] WARN 19:03:23,299 No host ID found, created e70fc540-a7c1-4b7b-88b5-0b0df97c9b9e (Note: This should happen exactly once per node).
[junit] WARN 19:03:23,851 Generated random token [Token(bytes[2b9d5f8c17f0f3a2766fa7d71d67ea70])]. Random tokens will result in an unbalanced ring; see http://wiki.apache.org/cassandra/Operations
[junit] ------------- ---------------- ---------------
[junit] Testsuite: org.apache.cassandra.service.AntiEntropyServiceStandardTest
[junit] Tests run: 6, Failures: 0, Errors: 0, Time elapsed: 16.602 sec
[junit]
[junit] ------------- Standard Error -----------------
[junit] WARN 19:03:41,171 No host ID found, created fb82e9b9-947b-4a64-ad72-ff304e2cb63e (Note: This should happen exactly once per node).
[junit] WARN 19:03:41,810 Generated random token [Token(bytes[9d249e3ab61565af96ad92ad4a46c822])]. Random tokens will result in an unbalanced ring; see http://wiki.apache.org/cassandra/Operations
[junit] ------------- ---------------- ---------------
[junit] Testsuite: org.apache.cassandra.service.CassandraServerTest
[junit] Tests run: 1, Failures: 0, Errors: 0, Time elapsed: 14.332 sec
[junit]
[junit] Testsuite: org.apache.cassandra.service.EmbeddedCassandraServiceTest
[junit] Tests run: 1, Failures: 0, Errors: 0, Time elapsed: 15.041 sec
[junit]
[junit] ------------- Standard Error -----------------
[junit] WARN 19:04:14,528 Unable to lock JVM memory (ENOMEM). This can result in part of the JVM being swapped out, especially with mmapped I/O enabled. Increase RLIMIT_MEMLOCK or run Cassandra as root.
[junit] WARN 19:04:15,389 No host ID found, created c3c0ce1e-ae40-415c-912f-fce1bfbb03bc (Note: This should happen exactly once per node).
[junit] WARN 19:04:15,815 Generated random token [Token(bytes[3564d7f4d5897badb5febc52c2c4698c])]. Random tokens will result in an unbalanced ring; see http://wiki.apache.org/cassandra/Operations
[junit] ------------- ---------------- ---------------
[junit] Testsuite: org.apache.cassandra.service.InitClientTest
[junit] Tests run: 1, Failures: 0, Errors: 0, Time elapsed: 1.488 sec
[junit]
[junit] Testsuite: org.apache.cassandra.service.LeaveAndBootstrapTest
[junit] Tests run: 6, Failures: 0, Errors: 0, Time elapsed: 32.511 sec
[junit]
[junit] ------------- Standard Error -----------------
[junit] WARN 19:04:49,626 Node /127.0.0.3 'leaving' token mismatch. Long network partition?
[junit] ------------- ---------------- ---------------
[junit] Testsuite: org.apache.cassandra.service.MoveTest
[junit] Tests run: 3, Failures: 0, Errors: 0, Time elapsed: 22.468 sec
[junit]
[junit] Testsuite: org.apache.cassandra.service.RemoveTest
[junit] Tests run: 3, Failures: 0, Errors: 0, Time elapsed: 20.852 sec
[junit]
[junit] ------------- Standard Error -----------------
[junit] ERROR 19:05:35,829 Stream failed because /127.0.0.6 died or was restarted/removed (streams may still be active in background, but further streams won't be started)
[junit] WARN 19:05:35,830 Streaming from /127.0.0.6 failed
[junit] ERROR 19:05:35,830 Stream failed because /127.0.0.6 died or was restarted/removed (streams may still be active in background, but further streams won't be started)
[junit] WARN 19:05:35,831 Streaming from /127.0.0.6 failed
[junit] ERROR 19:05:35,831 Stream failed because /127.0.0.6 died or was restarted/removed (streams may still be active in background, but further streams won't be started)
[junit] WARN 19:05:35,831 Streaming from /127.0.0.6 failed
[junit] ERROR 19:05:35,831 Stream failed because /127.0.0.6 died or was restarted/removed (streams may still be active in background, but further streams won't be started)
[junit] WARN 19:05:35,831 Streaming from /127.0.0.6 failed
[junit] ERROR 19:05:35,831 Stream failed because /127.0.0.6 died or was restarted/removed (streams may still be active in background, but further streams won't be started)
[junit] WARN 19:05:35,832 Streaming from /127.0.0.6 failed
[junit] ERROR 19:05:35,832 Stream failed because /127.0.0.6 died or was restarted/removed (streams may still be active in background, but further streams won't be started)
[junit] WARN 19:05:35,832 Streaming from /127.0.0.6 failed
[junit] ------------- ---------------- ---------------
[junit] Testsuite: org.apache.cassandra.service.RowResolverTest
[junit] Tests run: 8, Failures: 0, Errors: 0, Time elapsed: 12.834 sec
[junit]
[junit] Testsuite: org.apache.cassandra.service.SerializationsTest
[junit] Tests run: 2, Failures: 0, Errors: 0, Time elapsed: 12.069 sec
[junit]
[junit] Testsuite: org.apache.cassandra.service.StorageProxyTest
[junit] Tests run: 4, Failures: 0, Errors: 0, Time elapsed: 17.822 sec
[junit]
[junit] Testsuite: org.apache.cassandra.service.StorageServiceClientTest
[junit] Tests run: 1, Failures: 0, Errors: 0, Time elapsed: 3.107 sec
[junit]
[junit] Testsuite: org.apache.cassandra.service.StorageServiceServerTest
[junit] Tests run: 4, Failures: 0, Errors: 0, Time elapsed: 4.234 sec
[junit]
[junit] ------------- Standard Error -----------------
[junit] WARN 19:06:31,247 No host ID found, created c0338f28-e6ed-4c8d-877e-5c62d6f3373c (Note: This should happen exactly once per node).
[junit] WARN 19:06:31,896 Generated random token [Token(bytes[c70306dcb27f10d0dc7ad53d8274cba7])]. Random tokens will result in an unbalanced ring; see http://wiki.apache.org/cassandra/Operations
[junit] ------------- ---------------- ---------------
[junit] Testsuite: org.apache.cassandra.streaming.BootstrapTest
[junit] Tests run: 1, Failures: 0, Errors: 0, Time elapsed: 13.749 sec
[junit]
[junit] Testsuite: org.apache.cassandra.streaming.SerializationsTest
[junit] Tests run: 4, Failures: 0, Errors: 0, Time elapsed: 14.477 sec
[junit]
[junit] Testsuite: org.apache.cassandra.streaming.StreamingTransferTest
[junit] Tests run: 5, Failures: 0, Errors: 0, Time elapsed: 21.787 sec
[junit]
[junit] ------------- Standard Error -----------------
[junit] WARN 19:07:18,544 No host ID found, created b39c9e64-6ac0-49a8-8340-c45dbdc46635 (Note: This should happen exactly once per node).
[junit] WARN 19:07:19,099 Generated random token [Token(bytes[a9187225bc45bbd3a6560d7883f8597c])]. Random tokens will result in an unbalanced ring; see http://wiki.apache.org/cassandra/Operations
[junit] ------------- ---------------- ---------------
[junit] Testsuite: org.apache.cassandra.thrift.ThriftValidationTest
[junit] Tests run: 4, Failures: 0, Errors: 0, Time elapsed: 14.596 sec
[junit]
[junit] Testsuite: org.apache.cassandra.tools.SSTableExportTest
[junit] Tests run: 7, Failures: 0, Errors: 0, Time elapsed: 16.318 sec
[junit]
[junit] ------------- Standard Output ---------------
[junit] Importing 1 keys...
[junit] 1 keys imported successfully.
[junit] [{"columns":[["636f6c4e616d65","76616c",1345576079076],["636f6c4e616d6531","76616c31",1345576079076]],"key":"726f7741","metadata":{"deletionInfo":{"markedForDeleteAt":0,"localDeletionTime":0}}}]
[junit] ------------- ---------------- ---------------
[junit] Testsuite: org.apache.cassandra.tools.SSTableImportTest
[junit] Tests run: 7, Failures: 0, Errors: 0, Time elapsed: 15.675 sec
[junit]
[junit] ------------- Standard Output ---------------
[junit] Counting keys to import, please wait... (NOTE: to skip this use -n <num_keys>)
[junit] Importing 2 keys...
[junit] 2 keys imported successfully.
[junit] Counting keys to import, please wait... (NOTE: to skip this use -n <num_keys>)
[junit] Importing 2 keys...
[junit] 2 keys imported successfully.
[junit] Counting keys to import, please wait... (NOTE: to skip this use -n <num_keys>)
[junit] Importing 2 keys...
[junit] 2 keys imported successfully.
[junit] Importing 3 keys...
[junit] Importing 2 keys...
[junit] 2 keys imported successfully.
[junit] Counting keys to import, please wait... (NOTE: to skip this use -n <num_keys>)
[junit] Importing 2 keys...
[junit] 2 keys imported successfully.
[junit] Counting keys to import, please wait... (NOTE: to skip this use -n <num_keys>)
[junit] Importing 1 keys...
[junit] 1 keys imported successfully.
[junit] ------------- ---------------- ---------------
[junit] ------------- Standard Error -----------------
[junit] Line 2: Key null is greater than previous, collection is not sorted properly. Aborting import. You might need to delete SSTables manually.
[junit] ------------- ---------------- ---------------
[junit] Testsuite: org.apache.cassandra.utils.BloomFilterTest
[junit] Tests run: 7, Failures: 0, Errors: 0, Time elapsed: 0.797 sec
[junit]
[junit] Testsuite: org.apache.cassandra.utils.BoundedStatsDequeTest
[junit] Tests run: 1, Failures: 0, Errors: 0, Time elapsed: 0.074 sec
[junit]
[junit] Testsuite: org.apache.cassandra.utils.ByteBufferUtilTest
[junit] Tests run: 10, Failures: 0, Errors: 0, Time elapsed: 0.077 sec
[junit]
[junit] Testsuite: org.apache.cassandra.utils.BytesReadTrackerTest
[junit] Tests run: 4, Failures: 0, Errors: 0, Time elapsed: 0.06 sec
[junit]
[junit] Testsuite: org.apache.cassandra.utils.EncodedStreamsTest
[junit] Tests run: 4, Failures: 0, Errors: 0, Time elapsed: 13.841 sec
[junit]
[junit] Testsuite: org.apache.cassandra.utils.EstimatedHistogramTest
[junit] Tests run: 5, Failures: 0, Errors: 0, Time elapsed: 0.062 sec
[junit]
[junit] Testsuite: org.apache.cassandra.utils.FBUtilitiesTest
[junit] Tests run: 2, Failures: 0, Errors: 0, Time elapsed: 0.06 sec
[junit]
[junit] Testsuite: org.apache.cassandra.utils.HexTest
[junit] Tests run: 2, Failures: 0, Errors: 0, Time elapsed: 0.062 sec
[junit]
[junit] Testsuite: org.apache.cassandra.utils.IntervalTreeTest
[junit] Tests run: 3, Failures: 0, Errors: 0, Time elapsed: 0.171 sec
[junit]
[junit] Testsuite: org.apache.cassandra.utils.LegacyBloomFilterTest
[junit] Tests run: 6, Failures: 0, Errors: 0, Time elapsed: 0.691 sec
[junit]
[junit] Testsuite: org.apache.cassandra.utils.MergeIteratorTest
[junit] Tests run: 1, Failures: 0, Errors: 0, Time elapsed: 0.074 sec
[junit]
[junit] Testsuite: org.apache.cassandra.utils.MerkleTreeTest
[junit] Tests run: 12, Failures: 0, Errors: 0, Time elapsed: 1.014 sec
[junit]
[junit] Testsuite: org.apache.cassandra.utils.SemanticVersionTest
[junit] Tests run: 4, Failures: 0, Errors: 0, Time elapsed: 0.061 sec
[junit]
[junit] Testsuite: org.apache.cassandra.utils.SerializationsTest
[junit] Tests run: 4, Failures: 0, Errors: 0, Time elapsed: 13.818 sec
[junit]
[junit] Testsuite: org.apache.cassandra.utils.StreamingHistogramTest
[junit] Tests run: 2, Failures: 0, Errors: 0, Time elapsed: 0.061 sec
[junit]
BUILD FAILED
<https://builds.apache.org/job/Cassandra-quick/ws/build.xml>:1094: The following error occurred while executing this line:
<https://builds.apache.org/job/Cassandra-quick/ws/build.xml>:1056: Some unit test(s) failed.
Total time: 22 minutes 3 seconds
Build step 'Invoke Ant' marked build as failure
[TASKS] Skipping publisher since build result is FAILURE
Recording test results
Build failed in Jenkins: Cassandra-quick #1130
Posted by Apache Jenkins Server <je...@builds.apache.org>.
See <https://builds.apache.org/job/Cassandra-quick/1130/changes>
Changes:
[jbellis] upgradesstables recommended for #4436
------------------------------------------
[...truncated 396 lines...]
[junit] Tests run: 3, Failures: 0, Errors: 0, Time elapsed: 24.418 sec
[junit]
[junit] Testsuite: org.apache.cassandra.io.CompactSerializerTest
[junit] Tests run: 2, Failures: 0, Errors: 0, Time elapsed: 14.205 sec
[junit]
[junit] Testsuite: org.apache.cassandra.io.LazilyCompactedRowTest
[junit] Tests run: 7, Failures: 0, Errors: 0, Time elapsed: 41.019 sec
[junit]
[junit] ------------- Standard Error -----------------
[junit] WARN 16:47:04,084 setting live ratio to maximum of 64.0 instead of 90.66666666666667
[junit] ------------- ---------------- ---------------
[junit] Testsuite: org.apache.cassandra.io.compress.CompressedRandomAccessReaderTest
[junit] Tests run: 3, Failures: 0, Errors: 0, Time elapsed: 1.626 sec
[junit]
[junit] ------------- Standard Error -----------------
[junit] WARN 16:47:18,914 open(null, O_RDONLY) failed, errno (14).
[junit] ------------- ---------------- ---------------
[junit] Testsuite: org.apache.cassandra.io.sstable.DescriptorTest
[junit] Tests run: 3, Failures: 0, Errors: 0, Time elapsed: 0.061 sec
[junit]
[junit] Testsuite: org.apache.cassandra.io.sstable.IndexHelperTest
[junit] Tests run: 1, Failures: 0, Errors: 0, Time elapsed: 0.063 sec
[junit]
[junit] Testsuite: org.apache.cassandra.io.sstable.LegacySSTableTest
[junit] Tests run: 1, Failures: 0, Errors: 0, Time elapsed: 16.288 sec
[junit]
[junit] Testsuite: org.apache.cassandra.io.sstable.SSTableMetadataSerializerTest
[junit] Tests run: 1, Failures: 0, Errors: 0, Time elapsed: 0.138 sec
[junit]
[junit] Testsuite: org.apache.cassandra.io.sstable.SSTableReaderTest
[junit] Tests run: 8, Failures: 0, Errors: 0, Time elapsed: 17.287 sec
[junit]
[junit] ------------- Standard Error -----------------
[junit] WARN 16:47:52,114 setting live ratio to maximum of 64.0 instead of 85.71428571428571
[junit] WARN 16:47:54,301 setting live ratio to maximum of 64.0 instead of 67.63636363636364
[junit] ------------- ---------------- ---------------
[junit] Testsuite: org.apache.cassandra.io.sstable.SSTableSimpleWriterTest
[junit] Tests run: 1, Failures: 0, Errors: 0, Time elapsed: 16.567 sec
[junit]
[junit] Testsuite: org.apache.cassandra.io.sstable.SSTableTest
[junit] Tests run: 2, Failures: 0, Errors: 0, Time elapsed: 24.107 sec
[junit]
[junit] Testsuite: org.apache.cassandra.io.util.BufferedRandomAccessFileTest
[junit] Tests run: 18, Failures: 0, Errors: 0, Time elapsed: 4.756 sec
[junit]
[junit] Testsuite: org.apache.cassandra.locator.DynamicEndpointSnitchTest
[junit] Tests run: 1, Failures: 0, Errors: 0, Time elapsed: 2.595 sec
[junit]
[junit] Testsuite: org.apache.cassandra.locator.EC2SnitchTest
[junit] Tests run: 2, Failures: 0, Errors: 0, Time elapsed: 1.012 sec
[junit]
[junit] Testsuite: org.apache.cassandra.locator.NetworkTopologyStrategyTest
[junit] Tests run: 3, Failures: 0, Errors: 0, Time elapsed: 1.299 sec
[junit]
[junit] Testsuite: org.apache.cassandra.locator.OldNetworkTopologyStrategyTest
[junit] Tests run: 8, Failures: 0, Errors: 0, Time elapsed: 14.365 sec
[junit]
[junit] ------------- Standard Output ---------------
[junit] toStream : [(158873535527910577765226390751398592512,0], (0,34028236692093846346337460743176821145]]
[junit] toFetch : [(127605887595351923798765477786913079296,148873535527910577765226390751398592512]]
[junit] toStreamExpected : [(158873535527910577765226390751398592512,0], (0,34028236692093846346337460743176821145]]
[junit] toFetchExpected : [(127605887595351923798765477786913079296,148873535527910577765226390751398592512]]
[junit] ------------- ---------------- ---------------
[junit] Testsuite: org.apache.cassandra.locator.ReplicationStrategyEndpointCacheTest
[junit] Tests run: 2, Failures: 0, Errors: 0, Time elapsed: 19.032 sec
[junit]
[junit] Testsuite: org.apache.cassandra.locator.SimpleStrategyTest
[junit] Tests run: 4, Failures: 0, Errors: 0, Time elapsed: 21.398 sec
[junit]
[junit] Testsuite: org.apache.cassandra.locator.TokenMetadataTest
[junit] Tests run: 3, Failures: 0, Errors: 0, Time elapsed: 0.956 sec
[junit]
[junit] Testsuite: org.apache.cassandra.service.AntiEntropyServiceCounterTest
[junit] Tests run: 6, Failures: 0, Errors: 0, Time elapsed: 18.936 sec
[junit]
[junit] ------------- Standard Error -----------------
[junit] WARN 16:50:05,131 No host ID found, created 59971bea-9a78-4027-b7d4-b73c31329db7 (Note: This should happen exactly once per node).
[junit] WARN 16:50:05,751 Generated random token [Token(bytes[809734b0a638dc753ae99eb768814368])]. Random tokens will result in an unbalanced ring; see http://wiki.apache.org/cassandra/Operations
[junit] ------------- ---------------- ---------------
[junit] Testsuite: org.apache.cassandra.service.AntiEntropyServiceStandardTest
[junit] Tests run: 6, Failures: 0, Errors: 0, Time elapsed: 22.596 sec
[junit]
[junit] ------------- Standard Error -----------------
[junit] WARN 16:50:26,529 No host ID found, created f68ba9a7-c782-4e1f-80e4-60e3f6d858f3 (Note: This should happen exactly once per node).
[junit] WARN 16:50:27,688 Generated random token [Token(bytes[8efe15206044fd8d7f26ee6cf9327798])]. Random tokens will result in an unbalanced ring; see http://wiki.apache.org/cassandra/Operations
[junit] ------------- ---------------- ---------------
[junit] Testsuite: org.apache.cassandra.service.CassandraServerTest
[junit] Tests run: 1, Failures: 0, Errors: 0, Time elapsed: 12.442 sec
[junit]
[junit] Testsuite: org.apache.cassandra.service.EmbeddedCassandraServiceTest
[junit] Tests run: 1, Failures: 0, Errors: 0, Time elapsed: 16.778 sec
[junit]
[junit] ------------- Standard Error -----------------
[junit] WARN 16:51:03,444 Unable to lock JVM memory (ENOMEM). This can result in part of the JVM being swapped out, especially with mmapped I/O enabled. Increase RLIMIT_MEMLOCK or run Cassandra as root.
[junit] WARN 16:51:04,205 No host ID found, created fc451a62-2e5a-435d-b614-daa71a79ab46 (Note: This should happen exactly once per node).
[junit] WARN 16:51:04,611 Generated random token [Token(bytes[afd524e431d168ad971d58eadac42f6a])]. Random tokens will result in an unbalanced ring; see http://wiki.apache.org/cassandra/Operations
[junit] ------------- ---------------- ---------------
[junit] Testsuite: org.apache.cassandra.service.InitClientTest
[junit] Tests run: 1, Failures: 0, Errors: 0, Time elapsed: 1.522 sec
[junit]
[junit] Testsuite: org.apache.cassandra.service.LeaveAndBootstrapTest
[junit] Tests run: 6, Failures: 0, Errors: 0, Time elapsed: 37.637 sec
[junit]
[junit] ------------- Standard Error -----------------
[junit] WARN 16:51:42,114 Node /127.0.0.3 'leaving' token mismatch. Long network partition?
[junit] ------------- ---------------- ---------------
[junit] Testsuite: org.apache.cassandra.service.MoveTest
[junit] Tests run: 3, Failures: 0, Errors: 0, Time elapsed: 23.757 sec
[junit]
[junit] Testsuite: org.apache.cassandra.service.RemoveTest
[junit] Tests run: 3, Failures: 0, Errors: 0, Time elapsed: 22.757 sec
[junit]
[junit] ------------- Standard Error -----------------
[junit] ERROR 16:52:33,265 Stream failed because /127.0.0.6 died or was restarted/removed (streams may still be active in background, but further streams won't be started)
[junit] WARN 16:52:33,266 Streaming from /127.0.0.6 failed
[junit] ERROR 16:52:33,267 Stream failed because /127.0.0.6 died or was restarted/removed (streams may still be active in background, but further streams won't be started)
[junit] WARN 16:52:33,267 Streaming from /127.0.0.6 failed
[junit] ERROR 16:52:33,267 Stream failed because /127.0.0.6 died or was restarted/removed (streams may still be active in background, but further streams won't be started)
[junit] WARN 16:52:33,267 Streaming from /127.0.0.6 failed
[junit] ERROR 16:52:33,267 Stream failed because /127.0.0.6 died or was restarted/removed (streams may still be active in background, but further streams won't be started)
[junit] WARN 16:52:33,268 Streaming from /127.0.0.6 failed
[junit] ERROR 16:52:33,268 Stream failed because /127.0.0.6 died or was restarted/removed (streams may still be active in background, but further streams won't be started)
[junit] WARN 16:52:33,268 Streaming from /127.0.0.6 failed
[junit] ERROR 16:52:33,268 Stream failed because /127.0.0.6 died or was restarted/removed (streams may still be active in background, but further streams won't be started)
[junit] WARN 16:52:33,268 Streaming from /127.0.0.6 failed
[junit] ------------- ---------------- ---------------
[junit] Testsuite: org.apache.cassandra.service.RowResolverTest
[junit] Tests run: 8, Failures: 0, Errors: 0, Time elapsed: 16.597 sec
[junit]
[junit] Testsuite: org.apache.cassandra.service.SerializationsTest
[junit] Tests run: 2, Failures: 0, Errors: 0, Time elapsed: 12.414 sec
[junit]
[junit] Testsuite: org.apache.cassandra.service.StorageProxyTest
[junit] Tests run: 4, Failures: 0, Errors: 0, Time elapsed: 14.888 sec
[junit]
[junit] Testsuite: org.apache.cassandra.service.StorageServiceClientTest
[junit] Tests run: 1, Failures: 0, Errors: 0, Time elapsed: 3.22 sec
[junit]
[junit] Testsuite: org.apache.cassandra.service.StorageServiceServerTest
[junit] Tests run: 4, Failures: 0, Errors: 0, Time elapsed: 4.279 sec
[junit]
[junit] ------------- Standard Error -----------------
[junit] WARN 16:53:30,647 No host ID found, created 68c3957a-dea7-4e74-9896-355c8bc2a002 (Note: This should happen exactly once per node).
[junit] WARN 16:53:31,157 Generated random token [Token(bytes[a5cc76fbddbc7fe85faaa0267344f06f])]. Random tokens will result in an unbalanced ring; see http://wiki.apache.org/cassandra/Operations
[junit] ------------- ---------------- ---------------
[junit] Testsuite: org.apache.cassandra.streaming.BootstrapTest
[junit] Tests run: 1, Failures: 0, Errors: 0, Time elapsed: 13.414 sec
[junit]
[junit] Testsuite: org.apache.cassandra.streaming.SerializationsTest
[junit] Tests run: 4, Failures: 0, Errors: 0, Time elapsed: 15.504 sec
[junit]
[junit] Testsuite: org.apache.cassandra.streaming.StreamingTransferTest
[junit] Tests run: 5, Failures: 0, Errors: 0, Time elapsed: 35.221 sec
[junit]
[junit] ------------- Standard Error -----------------
[junit] WARN 16:54:25,468 No host ID found, created 21575ed1-acc9-4696-a328-9497c1636d7a (Note: This should happen exactly once per node).
[junit] WARN 16:54:26,209 Generated random token [Token(bytes[e1b4b2b9bcf5197295337a9e0cc9fa2a])]. Random tokens will result in an unbalanced ring; see http://wiki.apache.org/cassandra/Operations
[junit] ------------- ---------------- ---------------
[junit] Testsuite: org.apache.cassandra.thrift.ThriftValidationTest
[junit] Tests run: 4, Failures: 0, Errors: 0, Time elapsed: 25.248 sec
[junit]
[junit] Testsuite: org.apache.cassandra.tools.SSTableExportTest
[junit] Tests run: 7, Failures: 0, Errors: 0, Time elapsed: 19.452 sec
[junit]
[junit] ------------- Standard Output ---------------
[junit] Importing 1 keys...
[junit] 1 keys imported successfully.
[junit] [{"columns":[["636f6c4e616d65","76616c",1345568128222],["636f6c4e616d6531","76616c31",1345568128222]],"key":"726f7741","metadata":{"deletionInfo":{"markedForDeleteAt":0,"localDeletionTime":0}}}]
[junit] ------------- ---------------- ---------------
[junit] Testsuite: org.apache.cassandra.tools.SSTableImportTest
[junit] Tests run: 7, Failures: 0, Errors: 0, Time elapsed: 22.001 sec
[junit]
[junit] ------------- Standard Output ---------------
[junit] Counting keys to import, please wait... (NOTE: to skip this use -n <num_keys>)
[junit] Importing 2 keys...
[junit] 2 keys imported successfully.
[junit] Counting keys to import, please wait... (NOTE: to skip this use -n <num_keys>)
[junit] Importing 2 keys...
[junit] 2 keys imported successfully.
[junit] Counting keys to import, please wait... (NOTE: to skip this use -n <num_keys>)
[junit] Importing 2 keys...
[junit] 2 keys imported successfully.
[junit] Importing 3 keys...
[junit] Importing 2 keys...
[junit] 2 keys imported successfully.
[junit] Counting keys to import, please wait... (NOTE: to skip this use -n <num_keys>)
[junit] Importing 2 keys...
[junit] 2 keys imported successfully.
[junit] Counting keys to import, please wait... (NOTE: to skip this use -n <num_keys>)
[junit] Importing 1 keys...
[junit] 1 keys imported successfully.
[junit] ------------- ---------------- ---------------
[junit] ------------- Standard Error -----------------
[junit] Line 2: Key null is greater than previous, collection is not sorted properly. Aborting import. You might need to delete SSTables manually.
[junit] ------------- ---------------- ---------------
[junit] Testsuite: org.apache.cassandra.utils.BloomFilterTest
[junit] Tests run: 7, Failures: 0, Errors: 0, Time elapsed: 0.856 sec
[junit]
[junit] Testsuite: org.apache.cassandra.utils.BoundedStatsDequeTest
[junit] Tests run: 1, Failures: 0, Errors: 0, Time elapsed: 0.056 sec
[junit]
[junit] Testsuite: org.apache.cassandra.utils.ByteBufferUtilTest
[junit] Tests run: 10, Failures: 0, Errors: 0, Time elapsed: 0.092 sec
[junit]
[junit] Testsuite: org.apache.cassandra.utils.BytesReadTrackerTest
[junit] Tests run: 4, Failures: 0, Errors: 0, Time elapsed: 0.058 sec
[junit]
[junit] Testsuite: org.apache.cassandra.utils.EncodedStreamsTest
[junit] Tests run: 4, Failures: 0, Errors: 0, Time elapsed: 12.334 sec
[junit]
[junit] Testsuite: org.apache.cassandra.utils.EstimatedHistogramTest
[junit] Tests run: 5, Failures: 0, Errors: 0, Time elapsed: 0.062 sec
[junit]
[junit] Testsuite: org.apache.cassandra.utils.FBUtilitiesTest
[junit] Tests run: 2, Failures: 0, Errors: 0, Time elapsed: 0.061 sec
[junit]
[junit] Testsuite: org.apache.cassandra.utils.HexTest
[junit] Tests run: 2, Failures: 0, Errors: 0, Time elapsed: 0.062 sec
[junit]
[junit] Testsuite: org.apache.cassandra.utils.IntervalTreeTest
[junit] Tests run: 3, Failures: 0, Errors: 0, Time elapsed: 0.169 sec
[junit]
[junit] Testsuite: org.apache.cassandra.utils.LegacyBloomFilterTest
[junit] Tests run: 6, Failures: 0, Errors: 0, Time elapsed: 0.698 sec
[junit]
[junit] Testsuite: org.apache.cassandra.utils.MergeIteratorTest
[junit] Tests run: 1, Failures: 0, Errors: 0, Time elapsed: 0.075 sec
[junit]
[junit] Testsuite: org.apache.cassandra.utils.MerkleTreeTest
[junit] Tests run: 12, Failures: 0, Errors: 0, Time elapsed: 1.003 sec
[junit]
[junit] Testsuite: org.apache.cassandra.utils.SemanticVersionTest
[junit] Tests run: 4, Failures: 0, Errors: 0, Time elapsed: 0.067 sec
[junit]
[junit] Testsuite: org.apache.cassandra.utils.SerializationsTest
[junit] Tests run: 4, Failures: 0, Errors: 0, Time elapsed: 13.625 sec
[junit]
[junit] Testsuite: org.apache.cassandra.utils.StreamingHistogramTest
[junit] Tests run: 2, Failures: 0, Errors: 0, Time elapsed: 0.061 sec
[junit]
BUILD FAILED
<https://builds.apache.org/job/Cassandra-quick/ws/build.xml>:1094: The following error occurred while executing this line:
<https://builds.apache.org/job/Cassandra-quick/ws/build.xml>:1056: Some unit test(s) failed.
Total time: 24 minutes 55 seconds
Build step 'Invoke Ant' marked build as failure
[TASKS] Skipping publisher since build result is FAILURE
Recording test results
Build failed in Jenkins: Cassandra-quick #1129
Posted by Apache Jenkins Server <je...@builds.apache.org>.
See <https://builds.apache.org/job/Cassandra-quick/1129/>
------------------------------------------
[...truncated 388 lines...]
[junit]
[junit] Testsuite: org.apache.cassandra.io.BloomFilterTrackerTest
[junit] Tests run: 3, Failures: 0, Errors: 0, Time elapsed: 5.611 sec
[junit]
[junit] Testsuite: org.apache.cassandra.io.CompactSerializerTest
[junit] Tests run: 2, Failures: 0, Errors: 0, Time elapsed: 6.439 sec
[junit]
[junit] Testsuite: org.apache.cassandra.io.LazilyCompactedRowTest
[junit] Tests run: 7, Failures: 0, Errors: 0, Time elapsed: 6.865 sec
[junit]
[junit] Testsuite: org.apache.cassandra.io.compress.CompressedRandomAccessReaderTest
[junit] Tests run: 3, Failures: 0, Errors: 0, Time elapsed: 1.031 sec
[junit]
[junit] ------------- Standard Error -----------------
[junit] WARN 12:09:33,215 open(null, O_RDONLY) failed, errno (14).
[junit] ------------- ---------------- ---------------
[junit] Testsuite: org.apache.cassandra.io.sstable.DescriptorTest
[junit] Tests run: 3, Failures: 0, Errors: 0, Time elapsed: 0.064 sec
[junit]
[junit] Testsuite: org.apache.cassandra.io.sstable.IndexHelperTest
[junit] Tests run: 1, Failures: 0, Errors: 0, Time elapsed: 0.063 sec
[junit]
[junit] Testsuite: org.apache.cassandra.io.sstable.LegacySSTableTest
[junit] Tests run: 1, Failures: 0, Errors: 0, Time elapsed: 6.162 sec
[junit]
[junit] Testsuite: org.apache.cassandra.io.sstable.SSTableMetadataSerializerTest
[junit] Tests run: 1, Failures: 0, Errors: 0, Time elapsed: 0.144 sec
[junit]
[junit] Testsuite: org.apache.cassandra.io.sstable.SSTableReaderTest
[junit] Tests run: 8, Failures: 0, Errors: 0, Time elapsed: 5.886 sec
[junit]
[junit] ------------- Standard Error -----------------
[junit] WARN 12:09:48,105 setting live ratio to maximum of 64.0 instead of 88.07111111111111
[junit] WARN 12:09:48,233 setting live ratio to maximum of 64.0 instead of 67.31313131313131
[junit] ------------- ---------------- ---------------
[junit] Testsuite: org.apache.cassandra.io.sstable.SSTableSimpleWriterTest
[junit] Tests run: 1, Failures: 0, Errors: 0, Time elapsed: 5.656 sec
[junit]
[junit] Testsuite: org.apache.cassandra.io.sstable.SSTableTest
[junit] Tests run: 2, Failures: 0, Errors: 0, Time elapsed: 5.844 sec
[junit]
[junit] Testsuite: org.apache.cassandra.io.util.BufferedRandomAccessFileTest
[junit] Tests run: 18, Failures: 0, Errors: 0, Time elapsed: 1.119 sec
[junit]
[junit] Testsuite: org.apache.cassandra.locator.DynamicEndpointSnitchTest
[junit] Tests run: 1, Failures: 0, Errors: 0, Time elapsed: 2.248 sec
[junit]
[junit] Testsuite: org.apache.cassandra.locator.EC2SnitchTest
[junit] Tests run: 2, Failures: 0, Errors: 0, Time elapsed: 0.949 sec
[junit]
[junit] Testsuite: org.apache.cassandra.locator.NetworkTopologyStrategyTest
[junit] Tests run: 3, Failures: 0, Errors: 0, Time elapsed: 1.116 sec
[junit]
[junit] Testsuite: org.apache.cassandra.locator.OldNetworkTopologyStrategyTest
[junit] Tests run: 8, Failures: 0, Errors: 0, Time elapsed: 5.612 sec
[junit]
[junit] ------------- Standard Output ---------------
[junit] toStream : [(158873535527910577765226390751398592512,0], (0,34028236692093846346337460743176821145]]
[junit] toFetch : [(127605887595351923798765477786913079296,148873535527910577765226390751398592512]]
[junit] toStreamExpected : [(158873535527910577765226390751398592512,0], (0,34028236692093846346337460743176821145]]
[junit] toFetchExpected : [(127605887595351923798765477786913079296,148873535527910577765226390751398592512]]
[junit] ------------- ---------------- ---------------
[junit] Testsuite: org.apache.cassandra.locator.ReplicationStrategyEndpointCacheTest
[junit] Tests run: 2, Failures: 0, Errors: 0, Time elapsed: 5.61 sec
[junit]
[junit] Testsuite: org.apache.cassandra.locator.SimpleStrategyTest
[junit] Tests run: 4, Failures: 0, Errors: 0, Time elapsed: 5.681 sec
[junit]
[junit] Testsuite: org.apache.cassandra.locator.TokenMetadataTest
[junit] Tests run: 3, Failures: 0, Errors: 0, Time elapsed: 0.949 sec
[junit]
[junit] Testsuite: org.apache.cassandra.service.AntiEntropyServiceCounterTest
[junit] Tests run: 6, Failures: 0, Errors: 0, Time elapsed: 6.85 sec
[junit]
[junit] ------------- Standard Error -----------------
[junit] WARN 12:10:37,636 No host ID found, created c824ce41-a50d-4fa4-a227-15b060ec1ee0 (Note: This should happen exactly once per node).
[junit] WARN 12:10:37,834 Generated random token [Token(bytes[6b13040192d87f4cec82a8b02bf0273d])]. Random tokens will result in an unbalanced ring; see http://wiki.apache.org/cassandra/Operations
[junit] ------------- ---------------- ---------------
[junit] Testsuite: org.apache.cassandra.service.AntiEntropyServiceStandardTest
[junit] Tests run: 6, Failures: 0, Errors: 0, Time elapsed: 6.737 sec
[junit]
[junit] ------------- Standard Error -----------------
[junit] WARN 12:10:45,587 No host ID found, created a97822f0-d5b1-4524-bb51-857787c9d6f5 (Note: This should happen exactly once per node).
[junit] WARN 12:10:45,776 Generated random token [Token(bytes[d1e12bfeade58a256ced20ab270503f6])]. Random tokens will result in an unbalanced ring; see http://wiki.apache.org/cassandra/Operations
[junit] ------------- ---------------- ---------------
[junit] Testsuite: org.apache.cassandra.service.CassandraServerTest
[junit] Tests run: 1, Failures: 0, Errors: 0, Time elapsed: 5.582 sec
[junit]
[junit] Testsuite: org.apache.cassandra.service.EmbeddedCassandraServiceTest
[junit] Tests run: 1, Failures: 0, Errors: 0, Time elapsed: 6.546 sec
[junit]
[junit] ------------- Standard Error -----------------
[junit] WARN 12:10:59,992 Unable to lock JVM memory (ENOMEM). This can result in part of the JVM being swapped out, especially with mmapped I/O enabled. Increase RLIMIT_MEMLOCK or run Cassandra as root.
[junit] WARN 12:11:00,444 No host ID found, created 1284439c-8bd6-4ed1-8add-e15902c80705 (Note: This should happen exactly once per node).
[junit] WARN 12:11:00,631 Generated random token [Token(bytes[c1aca2e150d783000e0957cc34d4073e])]. Random tokens will result in an unbalanced ring; see http://wiki.apache.org/cassandra/Operations
[junit] ------------- ---------------- ---------------
[junit] Testsuite: org.apache.cassandra.service.InitClientTest
[junit] Tests run: 1, Failures: 0, Errors: 0, Time elapsed: 1.496 sec
[junit]
[junit] Testsuite: org.apache.cassandra.service.LeaveAndBootstrapTest
[junit] Tests run: 6, Failures: 0, Errors: 0, Time elapsed: 6.902 sec
[junit]
[junit] ------------- Standard Error -----------------
[junit] WARN 12:11:12,176 Node /127.0.0.3 'leaving' token mismatch. Long network partition?
[junit] ------------- ---------------- ---------------
[junit] Testsuite: org.apache.cassandra.service.MoveTest
[junit] Tests run: 3, Failures: 0, Errors: 0, Time elapsed: 6.445 sec
[junit]
[junit] Testsuite: org.apache.cassandra.service.RemoveTest
[junit] Tests run: 3, Failures: 0, Errors: 0, Time elapsed: 9.125 sec
[junit]
[junit] ------------- Standard Error -----------------
[junit] ERROR 12:11:27,406 Stream failed because /127.0.0.6 died or was restarted/removed (streams may still be active in background, but further streams won't be started)
[junit] WARN 12:11:27,407 Streaming from /127.0.0.6 failed
[junit] ERROR 12:11:27,407 Stream failed because /127.0.0.6 died or was restarted/removed (streams may still be active in background, but further streams won't be started)
[junit] WARN 12:11:27,408 Streaming from /127.0.0.6 failed
[junit] ERROR 12:11:27,408 Stream failed because /127.0.0.6 died or was restarted/removed (streams may still be active in background, but further streams won't be started)
[junit] WARN 12:11:27,408 Streaming from /127.0.0.6 failed
[junit] ERROR 12:11:27,409 Stream failed because /127.0.0.6 died or was restarted/removed (streams may still be active in background, but further streams won't be started)
[junit] WARN 12:11:27,409 Streaming from /127.0.0.6 failed
[junit] ERROR 12:11:27,409 Stream failed because /127.0.0.6 died or was restarted/removed (streams may still be active in background, but further streams won't be started)
[junit] WARN 12:11:27,409 Streaming from /127.0.0.6 failed
[junit] ERROR 12:11:27,409 Stream failed because /127.0.0.6 died or was restarted/removed (streams may still be active in background, but further streams won't be started)
[junit] WARN 12:11:27,410 Streaming from /127.0.0.6 failed
[junit] ------------- ---------------- ---------------
[junit] Testsuite: org.apache.cassandra.service.RowResolverTest
[junit] Tests run: 8, Failures: 0, Errors: 0, Time elapsed: 5.609 sec
[junit]
[junit] Testsuite: org.apache.cassandra.service.SerializationsTest
[junit] Tests run: 2, Failures: 0, Errors: 0, Time elapsed: 4.819 sec
[junit]
[junit] Testsuite: org.apache.cassandra.service.StorageProxyTest
[junit] Tests run: 4, Failures: 0, Errors: 0, Time elapsed: 5.638 sec
[junit]
[junit] Testsuite: org.apache.cassandra.service.StorageServiceClientTest
[junit] Tests run: 1, Failures: 0, Errors: 0, Time elapsed: 3.142 sec
[junit]
[junit] Testsuite: org.apache.cassandra.service.StorageServiceServerTest
[junit] Tests run: 4, Failures: 0, Errors: 0, Time elapsed: 3.523 sec
[junit]
[junit] ------------- Standard Error -----------------
[junit] WARN 12:11:55,770 No host ID found, created de53239c-e95b-49de-9f3f-999d801bdeee (Note: This should happen exactly once per node).
[junit] WARN 12:11:56,062 Generated random token [Token(bytes[4cfb157a6da102b0801277858939640d])]. Random tokens will result in an unbalanced ring; see http://wiki.apache.org/cassandra/Operations
[junit] ------------- ---------------- ---------------
[junit] Testsuite: org.apache.cassandra.streaming.BootstrapTest
[junit] Tests run: 1, Failures: 0, Errors: 0, Time elapsed: 5.763 sec
[junit]
[junit] Testsuite: org.apache.cassandra.streaming.SerializationsTest
[junit] Tests run: 4, Failures: 0, Errors: 0, Time elapsed: 5.663 sec
[junit]
[junit] Testsuite: org.apache.cassandra.streaming.StreamingTransferTest
[junit] Tests run: 5, Failures: 0, Errors: 0, Time elapsed: 5.353 sec
[junit]
[junit] ------------- Standard Error -----------------
[junit] WARN 12:12:16,641 No host ID found, created d086b9b6-fa0d-4fb4-95dc-ec4f8f132999 (Note: This should happen exactly once per node).
[junit] WARN 12:12:16,824 Generated random token [Token(bytes[fda2278203cfdccf8bccde011b926b18])]. Random tokens will result in an unbalanced ring; see http://wiki.apache.org/cassandra/Operations
[junit] ------------- ---------------- ---------------
[junit] Testsuite: org.apache.cassandra.thrift.ThriftValidationTest
[junit] Tests run: 4, Failures: 0, Errors: 0, Time elapsed: 5.633 sec
[junit]
[junit] Testsuite: org.apache.cassandra.tools.SSTableExportTest
[junit] Tests run: 7, Failures: 0, Errors: 0, Time elapsed: 5.733 sec
[junit]
[junit] ------------- Standard Output ---------------
[junit] Importing 1 keys...
[junit] 1 keys imported successfully.
[junit] [{"columns":[["636f6c4e616d65","76616c",1345551150441],["636f6c4e616d6531","76616c31",1345551150441]],"key":"726f7741","metadata":{"deletionInfo":{"markedForDeleteAt":0,"localDeletionTime":0}}}]
[junit] ------------- ---------------- ---------------
[junit] Testsuite: org.apache.cassandra.tools.SSTableImportTest
[junit] Tests run: 7, Failures: 0, Errors: 0, Time elapsed: 5.721 sec
[junit]
[junit] ------------- Standard Output ---------------
[junit] Counting keys to import, please wait... (NOTE: to skip this use -n <num_keys>)
[junit] Importing 2 keys...
[junit] 2 keys imported successfully.
[junit] Counting keys to import, please wait... (NOTE: to skip this use -n <num_keys>)
[junit] Importing 2 keys...
[junit] 2 keys imported successfully.
[junit] Counting keys to import, please wait... (NOTE: to skip this use -n <num_keys>)
[junit] Importing 2 keys...
[junit] 2 keys imported successfully.
[junit] Importing 3 keys...
[junit] Importing 2 keys...
[junit] 2 keys imported successfully.
[junit] Counting keys to import, please wait... (NOTE: to skip this use -n <num_keys>)
[junit] Importing 2 keys...
[junit] 2 keys imported successfully.
[junit] Counting keys to import, please wait... (NOTE: to skip this use -n <num_keys>)
[junit] Importing 1 keys...
[junit] 1 keys imported successfully.
[junit] ------------- ---------------- ---------------
[junit] ------------- Standard Error -----------------
[junit] Line 2: Key null is greater than previous, collection is not sorted properly. Aborting import. You might need to delete SSTables manually.
[junit] ------------- ---------------- ---------------
[junit] Testsuite: org.apache.cassandra.utils.BloomFilterTest
[junit] Tests run: 7, Failures: 0, Errors: 0, Time elapsed: 0.532 sec
[junit]
[junit] Testsuite: org.apache.cassandra.utils.BoundedStatsDequeTest
[junit] Tests run: 1, Failures: 0, Errors: 0, Time elapsed: 0.06 sec
[junit]
[junit] Testsuite: org.apache.cassandra.utils.ByteBufferUtilTest
[junit] Tests run: 10, Failures: 0, Errors: 0, Time elapsed: 0.08 sec
[junit]
[junit] Testsuite: org.apache.cassandra.utils.BytesReadTrackerTest
[junit] Tests run: 4, Failures: 0, Errors: 0, Time elapsed: 0.062 sec
[junit]
[junit] Testsuite: org.apache.cassandra.utils.EncodedStreamsTest
[junit] Tests run: 4, Failures: 0, Errors: 0, Time elapsed: 5.628 sec
[junit]
[junit] Testsuite: org.apache.cassandra.utils.EstimatedHistogramTest
[junit] Tests run: 5, Failures: 0, Errors: 0, Time elapsed: 0.063 sec
[junit]
[junit] Testsuite: org.apache.cassandra.utils.FBUtilitiesTest
[junit] Tests run: 2, Failures: 0, Errors: 0, Time elapsed: 0.064 sec
[junit]
[junit] Testsuite: org.apache.cassandra.utils.HexTest
[junit] Tests run: 2, Failures: 0, Errors: 0, Time elapsed: 0.065 sec
[junit]
[junit] Testsuite: org.apache.cassandra.utils.IntervalTreeTest
[junit] Tests run: 3, Failures: 0, Errors: 0, Time elapsed: 0.176 sec
[junit]
[junit] Testsuite: org.apache.cassandra.utils.LegacyBloomFilterTest
[junit] Tests run: 6, Failures: 0, Errors: 0, Time elapsed: 0.45 sec
[junit]
[junit] Testsuite: org.apache.cassandra.utils.MergeIteratorTest
[junit] Tests run: 1, Failures: 0, Errors: 0, Time elapsed: 0.079 sec
[junit]
[junit] Testsuite: org.apache.cassandra.utils.MerkleTreeTest
[junit] Tests run: 12, Failures: 0, Errors: 0, Time elapsed: 1.033 sec
[junit]
[junit] Testsuite: org.apache.cassandra.utils.SemanticVersionTest
[junit] Tests run: 4, Failures: 0, Errors: 0, Time elapsed: 0.063 sec
[junit]
[junit] Testsuite: org.apache.cassandra.utils.SerializationsTest
[junit] Tests run: 4, Failures: 0, Errors: 0, Time elapsed: 7.322 sec
[junit]
[junit] Testsuite: org.apache.cassandra.utils.StreamingHistogramTest
[junit] Tests run: 2, Failures: 0, Errors: 0, Time elapsed: 0.064 sec
[junit]
BUILD SUCCESSFUL
Total time: 10 minutes 27 seconds
[TASKS] Scanning folder '<https://builds.apache.org/job/Cassandra-quick/ws/'> for files matching the pattern '**/*.java' - excludes:
[TASKS] Found 841 files to scan for tasks
[TASKS] Found 123 open tasks.
[TASKS] Computing warning deltas based on reference build #82
Recording test results
No test report files were found. Configuration error?
Build step 'Publish JUnit test result report' changed build result to FAILURE
Build failed in Jenkins: Cassandra-quick #1128
Posted by Apache Jenkins Server <je...@builds.apache.org>.
See <https://builds.apache.org/job/Cassandra-quick/1128/>
------------------------------------------
[...truncated 387 lines...]
[junit]
[junit] Testsuite: org.apache.cassandra.io.BloomFilterTrackerTest
[junit] Tests run: 3, Failures: 0, Errors: 0, Time elapsed: 5.561 sec
[junit]
[junit] Testsuite: org.apache.cassandra.io.CompactSerializerTest
[junit] Tests run: 2, Failures: 0, Errors: 0, Time elapsed: 6.43 sec
[junit]
[junit] Testsuite: org.apache.cassandra.io.LazilyCompactedRowTest
[junit] Tests run: 7, Failures: 0, Errors: 0, Time elapsed: 6.868 sec
[junit]
[junit] Testsuite: org.apache.cassandra.io.compress.CompressedRandomAccessReaderTest
[junit] Tests run: 3, Failures: 0, Errors: 0, Time elapsed: 1.032 sec
[junit]
[junit] ------------- Standard Error -----------------
[junit] WARN 11:10:38,984 open(null, O_RDONLY) failed, errno (14).
[junit] ------------- ---------------- ---------------
[junit] Testsuite: org.apache.cassandra.io.sstable.DescriptorTest
[junit] Tests run: 3, Failures: 0, Errors: 0, Time elapsed: 0.064 sec
[junit]
[junit] Testsuite: org.apache.cassandra.io.sstable.IndexHelperTest
[junit] Tests run: 1, Failures: 0, Errors: 0, Time elapsed: 0.063 sec
[junit]
[junit] Testsuite: org.apache.cassandra.io.sstable.LegacySSTableTest
[junit] Tests run: 1, Failures: 0, Errors: 0, Time elapsed: 6.133 sec
[junit]
[junit] Testsuite: org.apache.cassandra.io.sstable.SSTableMetadataSerializerTest
[junit] Tests run: 1, Failures: 0, Errors: 0, Time elapsed: 0.143 sec
[junit]
[junit] Testsuite: org.apache.cassandra.io.sstable.SSTableReaderTest
[junit] Tests run: 8, Failures: 0, Errors: 0, Time elapsed: 5.902 sec
[junit]
[junit] ------------- Standard Error -----------------
[junit] WARN 11:10:53,852 setting live ratio to maximum of 64.0 instead of 87.68
[junit] WARN 11:10:53,975 setting live ratio to maximum of 64.0 instead of 67.35867768595041
[junit] ------------- ---------------- ---------------
[junit] Testsuite: org.apache.cassandra.io.sstable.SSTableSimpleWriterTest
[junit] Tests run: 1, Failures: 0, Errors: 0, Time elapsed: 5.651 sec
[junit]
[junit] Testsuite: org.apache.cassandra.io.sstable.SSTableTest
[junit] Tests run: 2, Failures: 0, Errors: 0, Time elapsed: 5.728 sec
[junit]
[junit] Testsuite: org.apache.cassandra.io.util.BufferedRandomAccessFileTest
[junit] Tests run: 18, Failures: 0, Errors: 0, Time elapsed: 1.11 sec
[junit]
[junit] Testsuite: org.apache.cassandra.locator.DynamicEndpointSnitchTest
[junit] Tests run: 1, Failures: 0, Errors: 0, Time elapsed: 2.249 sec
[junit]
[junit] Testsuite: org.apache.cassandra.locator.EC2SnitchTest
[junit] Tests run: 2, Failures: 0, Errors: 0, Time elapsed: 0.948 sec
[junit]
[junit] Testsuite: org.apache.cassandra.locator.NetworkTopologyStrategyTest
[junit] Tests run: 3, Failures: 0, Errors: 0, Time elapsed: 1.115 sec
[junit]
[junit] Testsuite: org.apache.cassandra.locator.OldNetworkTopologyStrategyTest
[junit] Tests run: 8, Failures: 0, Errors: 0, Time elapsed: 5.607 sec
[junit]
[junit] ------------- Standard Output ---------------
[junit] toStream : [(158873535527910577765226390751398592512,0], (0,34028236692093846346337460743176821145]]
[junit] toFetch : [(127605887595351923798765477786913079296,148873535527910577765226390751398592512]]
[junit] toStreamExpected : [(158873535527910577765226390751398592512,0], (0,34028236692093846346337460743176821145]]
[junit] toFetchExpected : [(127605887595351923798765477786913079296,148873535527910577765226390751398592512]]
[junit] ------------- ---------------- ---------------
[junit] Testsuite: org.apache.cassandra.locator.ReplicationStrategyEndpointCacheTest
[junit] Tests run: 2, Failures: 0, Errors: 0, Time elapsed: 5.58 sec
[junit]
[junit] Testsuite: org.apache.cassandra.locator.SimpleStrategyTest
[junit] Tests run: 4, Failures: 0, Errors: 0, Time elapsed: 5.685 sec
[junit]
[junit] Testsuite: org.apache.cassandra.locator.TokenMetadataTest
[junit] Tests run: 3, Failures: 0, Errors: 0, Time elapsed: 0.945 sec
[junit]
[junit] Testsuite: org.apache.cassandra.service.AntiEntropyServiceCounterTest
[junit] Tests run: 6, Failures: 0, Errors: 0, Time elapsed: 6.775 sec
[junit]
[junit] ------------- Standard Error -----------------
[junit] WARN 11:11:43,122 No host ID found, created 7f10a685-fa7b-4ad6-b289-eb9d1df155a3 (Note: This should happen exactly once per node).
[junit] WARN 11:11:43,325 Generated random token [Token(bytes[158734350f089782669edaf033930ea6])]. Random tokens will result in an unbalanced ring; see http://wiki.apache.org/cassandra/Operations
[junit] ------------- ---------------- ---------------
[junit] Testsuite: org.apache.cassandra.service.AntiEntropyServiceStandardTest
[junit] Tests run: 6, Failures: 0, Errors: 0, Time elapsed: 7.266 sec
[junit]
[junit] ------------- Standard Error -----------------
[junit] WARN 11:11:51,064 No host ID found, created 4900b017-7670-4bfd-9531-b14ab7836ef6 (Note: This should happen exactly once per node).
[junit] WARN 11:11:51,264 Generated random token [Token(bytes[6eef27d3ce0dd620d1919a1dd909e733])]. Random tokens will result in an unbalanced ring; see http://wiki.apache.org/cassandra/Operations
[junit] ------------- ---------------- ---------------
[junit] Testsuite: org.apache.cassandra.service.CassandraServerTest
[junit] Tests run: 1, Failures: 0, Errors: 0, Time elapsed: 5.593 sec
[junit]
[junit] Testsuite: org.apache.cassandra.service.EmbeddedCassandraServiceTest
[junit] Tests run: 1, Failures: 0, Errors: 0, Time elapsed: 6.466 sec
[junit]
[junit] ------------- Standard Error -----------------
[junit] WARN 11:12:05,937 Unable to lock JVM memory (ENOMEM). This can result in part of the JVM being swapped out, especially with mmapped I/O enabled. Increase RLIMIT_MEMLOCK or run Cassandra as root.
[junit] WARN 11:12:06,384 No host ID found, created 1f76bf6a-bb06-4f8c-8ec7-e967a73af8e6 (Note: This should happen exactly once per node).
[junit] WARN 11:12:06,570 Generated random token [Token(bytes[2c66227b5276002ab5ec9b71db07ed2f])]. Random tokens will result in an unbalanced ring; see http://wiki.apache.org/cassandra/Operations
[junit] ------------- ---------------- ---------------
[junit] Testsuite: org.apache.cassandra.service.InitClientTest
[junit] Tests run: 1, Failures: 0, Errors: 0, Time elapsed: 1.52 sec
[junit]
[junit] Testsuite: org.apache.cassandra.service.LeaveAndBootstrapTest
[junit] Tests run: 6, Failures: 0, Errors: 0, Time elapsed: 6.89 sec
[junit]
[junit] ------------- Standard Error -----------------
[junit] WARN 11:12:18,111 Node /127.0.0.3 'leaving' token mismatch. Long network partition?
[junit] ------------- ---------------- ---------------
[junit] Testsuite: org.apache.cassandra.service.MoveTest
[junit] Tests run: 3, Failures: 0, Errors: 0, Time elapsed: 6.421 sec
[junit]
[junit] Testsuite: org.apache.cassandra.service.RemoveTest
[junit] Tests run: 3, Failures: 0, Errors: 0, Time elapsed: 9.114 sec
[junit]
[junit] ------------- Standard Error -----------------
[junit] ERROR 11:12:33,291 Stream failed because /127.0.0.6 died or was restarted/removed (streams may still be active in background, but further streams won't be started)
[junit] WARN 11:12:33,292 Streaming from /127.0.0.6 failed
[junit] ERROR 11:12:33,292 Stream failed because /127.0.0.6 died or was restarted/removed (streams may still be active in background, but further streams won't be started)
[junit] WARN 11:12:33,293 Streaming from /127.0.0.6 failed
[junit] ERROR 11:12:33,293 Stream failed because /127.0.0.6 died or was restarted/removed (streams may still be active in background, but further streams won't be started)
[junit] WARN 11:12:33,293 Streaming from /127.0.0.6 failed
[junit] ERROR 11:12:33,293 Stream failed because /127.0.0.6 died or was restarted/removed (streams may still be active in background, but further streams won't be started)
[junit] WARN 11:12:33,294 Streaming from /127.0.0.6 failed
[junit] ERROR 11:12:33,294 Stream failed because /127.0.0.6 died or was restarted/removed (streams may still be active in background, but further streams won't be started)
[junit] WARN 11:12:33,294 Streaming from /127.0.0.6 failed
[junit] ERROR 11:12:33,295 Stream failed because /127.0.0.6 died or was restarted/removed (streams may still be active in background, but further streams won't be started)
[junit] WARN 11:12:33,295 Streaming from /127.0.0.6 failed
[junit] ------------- ---------------- ---------------
[junit] Testsuite: org.apache.cassandra.service.RowResolverTest
[junit] Tests run: 8, Failures: 0, Errors: 0, Time elapsed: 5.622 sec
[junit]
[junit] Testsuite: org.apache.cassandra.service.SerializationsTest
[junit] Tests run: 2, Failures: 0, Errors: 0, Time elapsed: 4.801 sec
[junit]
[junit] Testsuite: org.apache.cassandra.service.StorageProxyTest
[junit] Tests run: 4, Failures: 0, Errors: 0, Time elapsed: 5.645 sec
[junit]
[junit] Testsuite: org.apache.cassandra.service.StorageServiceClientTest
[junit] Tests run: 1, Failures: 0, Errors: 0, Time elapsed: 3.127 sec
[junit]
[junit] Testsuite: org.apache.cassandra.service.StorageServiceServerTest
[junit] Tests run: 4, Failures: 0, Errors: 0, Time elapsed: 3.491 sec
[junit]
[junit] ------------- Standard Error -----------------
[junit] WARN 11:13:01,655 No host ID found, created 72ed25ff-4410-4703-bcdd-8dab9f10e6db (Note: This should happen exactly once per node).
[junit] WARN 11:13:01,949 Generated random token [Token(bytes[855f18644107b45c46ab029fbc22c465])]. Random tokens will result in an unbalanced ring; see http://wiki.apache.org/cassandra/Operations
[junit] ------------- ---------------- ---------------
[junit] Testsuite: org.apache.cassandra.streaming.BootstrapTest
[junit] Tests run: 1, Failures: 0, Errors: 0, Time elapsed: 5.558 sec
[junit]
[junit] Testsuite: org.apache.cassandra.streaming.SerializationsTest
[junit] Tests run: 4, Failures: 0, Errors: 0, Time elapsed: 5.637 sec
[junit]
[junit] Testsuite: org.apache.cassandra.streaming.StreamingTransferTest
[junit] Tests run: 5, Failures: 0, Errors: 0, Time elapsed: 5.339 sec
[junit]
[junit] ------------- Standard Error -----------------
[junit] WARN 11:13:22,262 No host ID found, created 996adeb4-27e1-47f3-8e7a-d63c03c381d4 (Note: This should happen exactly once per node).
[junit] WARN 11:13:22,444 Generated random token [Token(bytes[964c7f517e937792ba73da498ffa011d])]. Random tokens will result in an unbalanced ring; see http://wiki.apache.org/cassandra/Operations
[junit] ------------- ---------------- ---------------
[junit] Testsuite: org.apache.cassandra.thrift.ThriftValidationTest
[junit] Tests run: 4, Failures: 0, Errors: 0, Time elapsed: 5.643 sec
[junit]
[junit] Testsuite: org.apache.cassandra.tools.SSTableExportTest
[junit] Tests run: 7, Failures: 0, Errors: 0, Time elapsed: 5.732 sec
[junit]
[junit] ------------- Standard Output ---------------
[junit] Importing 1 keys...
[junit] 1 keys imported successfully.
[junit] [{"columns":[["636f6c4e616d65","76616c",1345547616091],["636f6c4e616d6531","76616c31",1345547616091]],"key":"726f7741","metadata":{"deletionInfo":{"markedForDeleteAt":0,"localDeletionTime":0}}}]
[junit] ------------- ---------------- ---------------
[junit] Testsuite: org.apache.cassandra.tools.SSTableImportTest
[junit] Tests run: 7, Failures: 0, Errors: 0, Time elapsed: 5.688 sec
[junit]
[junit] ------------- Standard Output ---------------
[junit] Counting keys to import, please wait... (NOTE: to skip this use -n <num_keys>)
[junit] Importing 2 keys...
[junit] 2 keys imported successfully.
[junit] Counting keys to import, please wait... (NOTE: to skip this use -n <num_keys>)
[junit] Importing 2 keys...
[junit] 2 keys imported successfully.
[junit] Counting keys to import, please wait... (NOTE: to skip this use -n <num_keys>)
[junit] Importing 2 keys...
[junit] 2 keys imported successfully.
[junit] Importing 3 keys...
[junit] Importing 2 keys...
[junit] 2 keys imported successfully.
[junit] Counting keys to import, please wait... (NOTE: to skip this use -n <num_keys>)
[junit] Importing 2 keys...
[junit] 2 keys imported successfully.
[junit] Counting keys to import, please wait... (NOTE: to skip this use -n <num_keys>)
[junit] Importing 1 keys...
[junit] 1 keys imported successfully.
[junit] ------------- ---------------- ---------------
[junit] ------------- Standard Error -----------------
[junit] Line 2: Key null is greater than previous, collection is not sorted properly. Aborting import. You might need to delete SSTables manually.
[junit] ------------- ---------------- ---------------
[junit] Testsuite: org.apache.cassandra.utils.BloomFilterTest
[junit] Tests run: 7, Failures: 0, Errors: 0, Time elapsed: 0.545 sec
[junit]
[junit] Testsuite: org.apache.cassandra.utils.BoundedStatsDequeTest
[junit] Tests run: 1, Failures: 0, Errors: 0, Time elapsed: 0.06 sec
[junit]
[junit] Testsuite: org.apache.cassandra.utils.ByteBufferUtilTest
[junit] Tests run: 10, Failures: 0, Errors: 0, Time elapsed: 0.085 sec
[junit]
[junit] Testsuite: org.apache.cassandra.utils.BytesReadTrackerTest
[junit] Tests run: 4, Failures: 0, Errors: 0, Time elapsed: 0.061 sec
[junit]
[junit] Testsuite: org.apache.cassandra.utils.EncodedStreamsTest
[junit] Tests run: 4, Failures: 0, Errors: 0, Time elapsed: 5.642 sec
[junit]
[junit] Testsuite: org.apache.cassandra.utils.EstimatedHistogramTest
[junit] Tests run: 5, Failures: 0, Errors: 0, Time elapsed: 0.064 sec
[junit]
[junit] Testsuite: org.apache.cassandra.utils.FBUtilitiesTest
[junit] Tests run: 2, Failures: 0, Errors: 0, Time elapsed: 0.064 sec
[junit]
[junit] Testsuite: org.apache.cassandra.utils.HexTest
[junit] Tests run: 2, Failures: 0, Errors: 0, Time elapsed: 0.065 sec
[junit]
[junit] Testsuite: org.apache.cassandra.utils.IntervalTreeTest
[junit] Tests run: 3, Failures: 0, Errors: 0, Time elapsed: 0.177 sec
[junit]
[junit] Testsuite: org.apache.cassandra.utils.LegacyBloomFilterTest
[junit] Tests run: 6, Failures: 0, Errors: 0, Time elapsed: 0.463 sec
[junit]
[junit] Testsuite: org.apache.cassandra.utils.MergeIteratorTest
[junit] Tests run: 1, Failures: 0, Errors: 0, Time elapsed: 0.08 sec
[junit]
[junit] Testsuite: org.apache.cassandra.utils.MerkleTreeTest
[junit] Tests run: 12, Failures: 0, Errors: 0, Time elapsed: 1.033 sec
[junit]
[junit] Testsuite: org.apache.cassandra.utils.SemanticVersionTest
[junit] Tests run: 4, Failures: 0, Errors: 0, Time elapsed: 0.065 sec
[junit]
[junit] Testsuite: org.apache.cassandra.utils.SerializationsTest
[junit] Tests run: 4, Failures: 0, Errors: 0, Time elapsed: 7.413 sec
[junit]
[junit] Testsuite: org.apache.cassandra.utils.StreamingHistogramTest
[junit] Tests run: 2, Failures: 0, Errors: 0, Time elapsed: 0.064 sec
[junit]
BUILD SUCCESSFUL
Total time: 10 minutes 23 seconds
[TASKS] Scanning folder '<https://builds.apache.org/job/Cassandra-quick/ws/'> for files matching the pattern '**/*.java' - excludes:
[TASKS] Found 841 files to scan for tasks
[TASKS] Found 123 open tasks.
[TASKS] Computing warning deltas based on reference build #82
Recording test results
No test report files were found. Configuration error?
Build step 'Publish JUnit test result report' changed build result to FAILURE