You are viewing a plain text version of this content. The canonical link for it is here.
Posted to commits@olingo.apache.org by Apache Jenkins Server <je...@builds.apache.org> on 2023/10/23 02:27:24 UTC
Build failed in Jenkins: Olingo » olingo-odata4-all-profiles #32
See <https://ci-builds.apache.org/job/Olingo/job/olingo-odata4-all-profiles/32/display/redirect?page=changes>
Changes:
[Michael Bolz] [OLINGO-1603] Set version to 4.10.0-RC01
[Michael Bolz] [OLINGO-1603] Set version to 4.10.0
------------------------------------------
[...truncated 694.92 KB...]
[INFO] --- site:3.12.1:attach-descriptor (attach-descriptor) @ odata-server-osgi-sample ---
[INFO] Skipping because packaging 'bundle' is not pom.
[INFO]
[INFO] --- failsafe:3.1.2:integration-test (integration-test) @ odata-server-osgi-sample ---
[INFO]
[INFO] --- source:3.3.0:jar-no-fork (attach-sources) @ odata-server-osgi-sample ---
[INFO] Building jar: <https://ci-builds.apache.org/job/Olingo/job/olingo-odata4-all-profiles/ws/samples/osgi/server/target/odata-server-osgi-sample-4.10.0-sources.jar>
[INFO]
[INFO] --- failsafe:3.1.2:verify (integration-test) @ odata-server-osgi-sample ---
[WARNING] Parameter 'encoding' (user property 'encoding') is deprecated: since of 2.20.1
[INFO]
[INFO] --- checkstyle:3.1.0:check (checkstyle) @ odata-server-osgi-sample ---
[INFO] Starting audit...
Audit done.
[INFO]
[INFO] --- install:3.1.1:install (default-install) @ odata-server-osgi-sample ---
[INFO] Installing <https://ci-builds.apache.org/job/Olingo/job/olingo-odata4-all-profiles/ws/samples/osgi/server/pom.xml> to /home/jenkins/.m2/repository/org/apache/olingo/odata-server-osgi-sample/4.10.0/odata-server-osgi-sample-4.10.0.pom
[INFO] Installing <https://ci-builds.apache.org/job/Olingo/job/olingo-odata4-all-profiles/ws/samples/osgi/server/target/odata-server-osgi-sample-4.10.0.jar> to /home/jenkins/.m2/repository/org/apache/olingo/odata-server-osgi-sample/4.10.0/odata-server-osgi-sample-4.10.0.jar
[INFO] Installing <https://ci-builds.apache.org/job/Olingo/job/olingo-odata4-all-profiles/ws/samples/osgi/server/target/odata-server-osgi-sample-4.10.0-sources.jar> to /home/jenkins/.m2/repository/org/apache/olingo/odata-server-osgi-sample/4.10.0/odata-server-osgi-sample-4.10.0-sources.jar
[INFO]
[INFO] --- bundle:5.1.9:install (default-install) @ odata-server-osgi-sample ---
[INFO] Installing org/apache/olingo/odata-server-osgi-sample/4.10.0/odata-server-osgi-sample-4.10.0.jar
[INFO] Writing OBR metadata
[INFO]
[INFO] --- apache-rat:0.15:check (rat-check) @ odata-server-osgi-sample ---
[INFO] Enabled default license matchers.
[INFO] Will parse SCM ignores for exclusions...
[INFO] Finished adding exclusions from SCM ignore files.
[INFO] 62 implicit excludes.
[INFO] 26 explicit excludes.
[INFO] 1 resources included
[INFO] Rat check: Summary over all files. Unapproved: 0, unknown: 0, generated: 0, approved: 1 licenses.
[INFO]
[INFO] -----------------< org.apache.olingo:odata-karaf-fit >------------------
[INFO] Building odata-karaf-fit 4.10.0 [20/46]
[INFO] from ext/karaf/karaf-fit/pom.xml
[INFO] --------------------------------[ jar ]---------------------------------
[INFO]
[INFO] --- clean:3.2.0:clean (default-clean) @ odata-karaf-fit ---
[INFO]
[INFO] --- enforcer:3.3.0:enforce (enforce-maven-version) @ odata-karaf-fit ---
[INFO]
[INFO] --- enforcer:3.3.0:enforce (enforce-java-version) @ odata-karaf-fit ---
[INFO]
[INFO] --- remote-resources:1.5:process (process-resource-bundles) @ odata-karaf-fit ---
[INFO]
[INFO] --- remote-resources:1.5:process (default) @ odata-karaf-fit ---
[INFO]
[INFO] --- depends:1.2:generate-depends-file (generate-depends-file) @ odata-karaf-fit ---
[INFO] Created: <https://ci-builds.apache.org/job/Olingo/job/olingo-odata4-all-profiles/ws/ext/karaf/karaf-fit/target/classes/META-INF/maven/dependencies.properties>
[INFO]
[INFO] --- resources:3.3.1:resources (default-resources) @ odata-karaf-fit ---
[INFO] skip non existing resourceDirectory <https://ci-builds.apache.org/job/Olingo/job/olingo-odata4-all-profiles/ws/ext/karaf/karaf-fit/src/main/resources>
[INFO] Copying 3 resources from target/maven-shared-archive-resources to target/classes
[INFO] Copying 3 resources from target/maven-shared-archive-resources to target/classes
[INFO]
[INFO] --- compiler:3.11.0:compile (default-compile) @ odata-karaf-fit ---
[INFO] No sources to compile
[INFO]
[INFO] --- resources:3.3.1:testResources (default-testResources) @ odata-karaf-fit ---
[INFO] skip non existing resourceDirectory <https://ci-builds.apache.org/job/Olingo/job/olingo-odata4-all-profiles/ws/ext/karaf/karaf-fit/src/test/resources>
[INFO] Copying 3 resources from target/maven-shared-archive-resources to target/test-classes
[INFO] Copying 3 resources from target/maven-shared-archive-resources to target/test-classes
[INFO]
[INFO] --- compiler:3.11.0:testCompile (default-testCompile) @ odata-karaf-fit ---
[INFO] Changes detected - recompiling the module! :dependency
[INFO] Compiling 3 source files with javac [debug deprecation target 8] to target/test-classes
[INFO]
[INFO] --- surefire:3.1.2:test (default-test) @ odata-karaf-fit ---
[INFO] Using auto detected provider org.apache.maven.surefire.junit4.JUnit4Provider
[INFO]
[INFO] -------------------------------------------------------
[INFO] T E S T S
[INFO] -------------------------------------------------------
[INFO] Running org.apache.olingo.osgi.itests.BundlesTest
[ERROR] Tests run: 1, Failures: 1, Errors: 0, Skipped: 0, Time elapsed: 12.26 s <<< FAILURE! -- in org.apache.olingo.osgi.itests.BundlesTest
[ERROR] org.apache.olingo.osgi.itests.BundlesTest.test -- Time elapsed: 0.307 s <<< FAILURE!
java.lang.AssertionError: Bundle org.apache.olingo.odata-server-api should be installed
at org.junit.Assert.fail(Assert.java:88)
at org.junit.Assert.assertTrue(Assert.java:41)
at org.junit.Assert.assertNotNull(Assert.java:712)
at org.apache.olingo.osgi.itests.OlingoOSGiTestSupport.assertBundleStarted(OlingoOSGiTestSupport.java:122)
at org.apache.olingo.osgi.itests.BundlesTest.test(BundlesTest.java:40)
at sun.reflect.NativeMethodAccessorImpl.invoke0(Native Method)
at sun.reflect.NativeMethodAccessorImpl.invoke(NativeMethodAccessorImpl.java:62)
at sun.reflect.DelegatingMethodAccessorImpl.invoke(DelegatingMethodAccessorImpl.java:43)
at java.lang.reflect.Method.invoke(Method.java:498)
at org.junit.runners.model.FrameworkMethod$1.runReflectiveCall(FrameworkMethod.java:50)
at org.junit.internal.runners.model.ReflectiveCallable.run(ReflectiveCallable.java:12)
at org.junit.runners.model.FrameworkMethod.invokeExplosively(FrameworkMethod.java:47)
at org.junit.internal.runners.statements.InvokeMethod.evaluate(InvokeMethod.java:17)
at org.ops4j.pax.exam.invoker.junit.internal.ContainerTestRunner.runLeafWithRetry(ContainerTestRunner.java:97)
at org.ops4j.pax.exam.invoker.junit.internal.ContainerTestRunner.runChildWithRetry(ContainerTestRunner.java:84)
at org.ops4j.pax.exam.invoker.junit.internal.ContainerTestRunner.runChild(ContainerTestRunner.java:75)
at org.ops4j.pax.exam.invoker.junit.internal.ContainerTestRunner.runChild(ContainerTestRunner.java:43)
at org.junit.runners.ParentRunner$3.run(ParentRunner.java:290)
at org.junit.runners.ParentRunner$1.schedule(ParentRunner.java:71)
at org.junit.runners.ParentRunner.runChildren(ParentRunner.java:288)
at org.junit.runners.ParentRunner.access$000(ParentRunner.java:58)
at org.junit.runners.ParentRunner$2.evaluate(ParentRunner.java:268)
at org.junit.runners.ParentRunner.run(ParentRunner.java:363)
at org.junit.runner.JUnitCore.run(JUnitCore.java:137)
at org.junit.runner.JUnitCore.run(JUnitCore.java:115)
at org.ops4j.pax.exam.invoker.junit.internal.JUnitProbeInvoker.invokeViaJUnit(JUnitProbeInvoker.java:124)
at org.ops4j.pax.exam.invoker.junit.internal.JUnitProbeInvoker.findAndInvoke(JUnitProbeInvoker.java:97)
at org.ops4j.pax.exam.invoker.junit.internal.JUnitProbeInvoker.call(JUnitProbeInvoker.java:73)
at sun.reflect.NativeMethodAccessorImpl.invoke0(Native Method)
at sun.reflect.NativeMethodAccessorImpl.invoke(NativeMethodAccessorImpl.java:62)
at sun.reflect.DelegatingMethodAccessorImpl.invoke(DelegatingMethodAccessorImpl.java:43)
at java.lang.reflect.Method.invoke(Method.java:498)
at org.ops4j.pax.exam.rbc.internal.RemoteBundleContextImpl.remoteCall(RemoteBundleContextImpl.java:85)
at sun.reflect.NativeMethodAccessorImpl.invoke0(Native Method)
at sun.reflect.NativeMethodAccessorImpl.invoke(NativeMethodAccessorImpl.java:62)
at sun.reflect.DelegatingMethodAccessorImpl.invoke(DelegatingMethodAccessorImpl.java:43)
at java.lang.reflect.Method.invoke(Method.java:498)
at sun.rmi.server.UnicastServerRef.dispatch(UnicastServerRef.java:357)
at sun.rmi.transport.Transport$1.run(Transport.java:200)
at sun.rmi.transport.Transport$1.run(Transport.java:197)
at java.security.AccessController.doPrivileged(Native Method)
at sun.rmi.transport.Transport.serviceCall(Transport.java:196)
at sun.rmi.transport.tcp.TCPTransport.handleMessages(TCPTransport.java:573)
at sun.rmi.transport.tcp.TCPTransport$ConnectionHandler.run0(TCPTransport.java:834)
at sun.rmi.transport.tcp.TCPTransport$ConnectionHandler.lambda$run$0(TCPTransport.java:688)
at java.security.AccessController.doPrivileged(Native Method)
at sun.rmi.transport.tcp.TCPTransport$ConnectionHandler.run(TCPTransport.java:687)
at java.util.concurrent.ThreadPoolExecutor.runWorker(ThreadPoolExecutor.java:1149)
at java.util.concurrent.ThreadPoolExecutor$Worker.run(ThreadPoolExecutor.java:624)
at java.lang.Thread.run(Thread.java:750)
[INFO] Running org.apache.olingo.osgi.itests.server.CarServiceTest
[ERROR] Tests run: 1, Failures: 0, Errors: 1, Skipped: 0, Time elapsed: 7.907 s <<< FAILURE! -- in org.apache.olingo.osgi.itests.server.CarServiceTest
[ERROR] org.apache.olingo.osgi.itests.server.CarServiceTest.testServiceStarted -- Time elapsed: 7.900 s <<< ERROR!
java.io.EOFException
at java.io.DataInputStream.readByte(DataInputStream.java:267)
at sun.rmi.transport.StreamRemoteCall.executeCall(StreamRemoteCall.java:240)
at sun.rmi.server.UnicastRef.invoke(UnicastRef.java:164)
at java.rmi.server.RemoteObjectInvocationHandler.invokeRemoteMethod(RemoteObjectInvocationHandler.java:235)
at java.rmi.server.RemoteObjectInvocationHandler.invoke(RemoteObjectInvocationHandler.java:180)
at com.sun.proxy.$Proxy11.waitForState(Unknown Source)
at org.ops4j.pax.exam.rbc.client.intern.RemoteBundleContextClientImpl.waitForState(RemoteBundleContextClientImpl.java:218)
at org.ops4j.pax.exam.karaf.container.internal.KarafTestContainer.waitForState(KarafTestContainer.java:659)
at org.ops4j.pax.exam.karaf.container.internal.KarafTestContainer.startKaraf(KarafTestContainer.java:262)
at org.ops4j.pax.exam.karaf.container.internal.KarafTestContainer.start(KarafTestContainer.java:194)
at org.ops4j.pax.exam.spi.reactors.AllConfinedStagedReactor.invoke(AllConfinedStagedReactor.java:79)
at org.ops4j.pax.exam.junit.impl.ProbeRunner$2.evaluate(ProbeRunner.java:267)
at org.junit.runners.BlockJUnit4ClassRunner$1.evaluate(BlockJUnit4ClassRunner.java:100)
at org.junit.runners.ParentRunner.runLeaf(ParentRunner.java:366)
at org.junit.runners.BlockJUnit4ClassRunner.runChild(BlockJUnit4ClassRunner.java:103)
at org.junit.runners.BlockJUnit4ClassRunner.runChild(BlockJUnit4ClassRunner.java:63)
at org.junit.runners.ParentRunner$4.run(ParentRunner.java:331)
at org.junit.runners.ParentRunner$1.schedule(ParentRunner.java:79)
at org.junit.runners.ParentRunner.runChildren(ParentRunner.java:329)
at org.junit.runners.ParentRunner.access$100(ParentRunner.java:66)
at org.junit.runners.ParentRunner$2.evaluate(ParentRunner.java:293)
at org.junit.runners.ParentRunner.run(ParentRunner.java:413)
at org.ops4j.pax.exam.junit.impl.ProbeRunner.run(ProbeRunner.java:98)
at org.ops4j.pax.exam.junit.PaxExam.run(PaxExam.java:93)
at org.apache.maven.surefire.junit4.JUnit4Provider.execute(JUnit4Provider.java:316)
at org.apache.maven.surefire.junit4.JUnit4Provider.executeWithRerun(JUnit4Provider.java:240)
at org.apache.maven.surefire.junit4.JUnit4Provider.executeTestSet(JUnit4Provider.java:214)
at org.apache.maven.surefire.junit4.JUnit4Provider.invoke(JUnit4Provider.java:155)
at org.apache.maven.surefire.booter.ForkedBooter.runSuitesInProcess(ForkedBooter.java:385)
at org.apache.maven.surefire.booter.ForkedBooter.execute(ForkedBooter.java:162)
at org.apache.maven.surefire.booter.ForkedBooter.run(ForkedBooter.java:507)
at org.apache.maven.surefire.booter.ForkedBooter.main(ForkedBooter.java:495)
[INFO]
[INFO] Results:
[INFO]
[ERROR] Failures:
[ERROR] BundlesTest.test:40->OlingoOSGiTestSupport.assertBundleStarted:122 Bundle org.apache.olingo.odata-server-api should be installed
[ERROR] Errors:
[ERROR] CarServiceTest.testServiceStarted » EOF
[INFO]
[ERROR] Tests run: 2, Failures: 1, Errors: 1, Skipped: 0
[INFO]
[INFO] ------------------------------------------------------------------------
[INFO] Reactor Summary for Olingo-OData 4.10.0:
[INFO]
[INFO] Olingo-OData ....................................... SUCCESS [ 5.636 s]
[INFO] odata-lib .......................................... SUCCESS [ 0.480 s]
[INFO] odata-commons-api .................................. SUCCESS [ 15.861 s]
[INFO] odata-commons-core ................................. SUCCESS [ 12.808 s]
[INFO] odata-client-api ................................... SUCCESS [ 5.199 s]
[INFO] odata-client-core .................................. SUCCESS [ 19.710 s]
[INFO] odata-server-api ................................... SUCCESS [ 6.010 s]
[INFO] odata-server-core .................................. SUCCESS [ 16.963 s]
[INFO] odata-server-core-ext .............................. SUCCESS [ 12.322 s]
[INFO] odata-server-tecsvc ................................ SUCCESS [ 7.960 s]
[INFO] odata-server-test .................................. SUCCESS [ 18.929 s]
[INFO] odata-ext .......................................... SUCCESS [ 0.205 s]
[INFO] odata-client-proxy ................................. SUCCESS [ 2.106 s]
[INFO] pojogen-maven-plugin ............................... SUCCESS [ 38.406 s]
[INFO] odata-client-android ............................... SUCCESS [ 4.861 s]
[INFO] odata-karaf ........................................ SUCCESS [ 0.168 s]
[INFO] odata-karaf-features ............................... SUCCESS [ 0.231 s]
[INFO] odata-samples ...................................... SUCCESS [ 0.169 s]
[INFO] odata-server-osgi-sample ........................... SUCCESS [ 4.563 s]
[INFO] odata-karaf-fit .................................... FAILURE [ 24.452 s]
[INFO] odata-fit .......................................... SKIPPED
[INFO] odata-dist ......................................... SKIPPED
[INFO] Olingo-OData-Client-for-Android .................... SKIPPED
[INFO] Olingo-OData-Client-for-Java ....................... SKIPPED
[INFO] Olingo-OData-Server-for-Java ....................... SKIPPED
[INFO] Olingo-OData-Server-Extension-for-Java ............. SKIPPED
[INFO] Olingo-OData-JavaDoc ............................... SKIPPED
[INFO] odata-server-sample ................................ SKIPPED
[INFO] odata-client-sample ................................ SKIPPED
[INFO] DemoService Webapp ................................. SKIPPED
[INFO] DemoService-Read-Webapp ............................ SKIPPED
[INFO] DemoService-ReadEp-Webapp .......................... SKIPPED
[INFO] DemoService-Write-Webapp ........................... SKIPPED
[INFO] DemoService-Navigation-Webapp ...................... SKIPPED
[INFO] DemoService-QueryOptions-TCS-Webapp ................ SKIPPED
[INFO] DemoService-QueryOptions-ES-Webapp ................. SKIPPED
[INFO] DemoService-QueryOptions-O-Webapp .................. SKIPPED
[INFO] DemoService-QueryOptions-F Webapp .................. SKIPPED
[INFO] DemoService-Action-Webapp .......................... SKIPPED
[INFO] DemoService-ActionPreparation-Webapp ............... SKIPPED
[INFO] DemoService-Media-Webapp ........................... SKIPPED
[INFO] DemoService-Batch-Webapp ........................... SKIPPED
[INFO] DemoService-DeepInsert-Webapp ...................... SKIPPED
[INFO] DemoService-DeepInsertPreparation-Webapp ........... SKIPPED
[INFO] DemoService-Streaming-Webapp ....................... SKIPPED
[INFO] odata-tutorials .................................... SKIPPED
[INFO] ------------------------------------------------------------------------
[INFO] BUILD FAILURE
[INFO] ------------------------------------------------------------------------
[INFO] Total time: 03:19 min
[INFO] Finished at: 2023-10-23T02:27:21Z
[INFO] ------------------------------------------------------------------------
[ERROR] Failed to execute goal org.apache.maven.plugins:maven-surefire-plugin:3.1.2:test (default-test) on project odata-karaf-fit: There are test failures.
[ERROR]
[ERROR] Please refer to <https://ci-builds.apache.org/job/Olingo/job/olingo-odata4-all-profiles/ws/ext/karaf/karaf-fit/target/surefire-reports> for the individual test results.
[ERROR] Please refer to dump files (if any exist) [date].dump, [date]-jvmRun[N].dump and [date].dumpstream.
[ERROR] -> [Help 1]
[ERROR]
[ERROR] To see the full stack trace of the errors, re-run Maven with the -e switch.
[ERROR] Re-run Maven using the -X switch to enable full debug logging.
[ERROR]
[ERROR] For more information about the errors and possible solutions, please read the following articles:
[ERROR] [Help 1] http://cwiki.apache.org/confluence/display/MAVEN/MojoFailureException
[ERROR]
[ERROR] After correcting the problems, you can resume the build with the command
[ERROR] mvn <args> -rf :odata-karaf-fit
Build step 'Invoke top-level Maven targets' marked build as failure
Not sending mail to unregistered user archana.rai@sap.com
Not sending mail to unregistered user github@hugo-hirsch.de
Not sending mail to unregistered user ramya.vasanth@sap.com
Build failed in Jenkins: Olingo » olingo-odata4-all-profiles #34
Posted by Apache Jenkins Server <je...@builds.apache.org>.
See <https://ci-builds.apache.org/job/Olingo/job/olingo-odata4-all-profiles/34/display/redirect?page=changes>
Changes:
[raupppee] upgrade jdk and java ee
[Michael Bolz] [OLINGO-1600] Updated complier plugin config
[Michael Bolz] [OLINGO-1600] Set version to 5.0.0-ALPHA-01
[Michael Bolz] [OLINGO-1600] Set version to 5.0.0-ALPHA-02
[Michael Bolz] [OLINGO-1600] Dependency version updates
[Michael Bolz] [OLINGO-1613] Set version to 5.0.0
[Michael Bolz] [OLINGO-1613] Set version to 5.0.1-SNAPSHOT
------------------------------------------
Started by an SCM change
Running as SYSTEM
[EnvInject] - Loading node environment variables.
Building remotely on builds50 (tmp-22 ubuntu) in workspace <https://ci-builds.apache.org/job/Olingo/job/olingo-odata4-all-profiles/ws/>
The recommended git tool is: NONE
No credentials specified
Cloning the remote Git repository
Cloning repository https://git-wip-us.apache.org/repos/asf/olingo-odata4.git
> git init <https://ci-builds.apache.org/job/Olingo/job/olingo-odata4-all-profiles/ws/> # timeout=10
Fetching upstream changes from https://git-wip-us.apache.org/repos/asf/olingo-odata4.git
> git --version # timeout=10
> git --version # 'git version 2.34.1'
> git fetch --tags --force --progress -- https://git-wip-us.apache.org/repos/asf/olingo-odata4.git +refs/heads/*:refs/remotes/origin/* # timeout=10
> git config remote.origin.url https://git-wip-us.apache.org/repos/asf/olingo-odata4.git # timeout=10
> git config --add remote.origin.fetch +refs/heads/*:refs/remotes/origin/* # timeout=10
Avoid second fetch
> git rev-parse origin/master^{commit} # timeout=10
Checking out Revision 20b0d7a2c0134d00cd86ef42545bf4af9b254d32 (origin/master)
> git config core.sparsecheckout # timeout=10
> git checkout -f 20b0d7a2c0134d00cd86ef42545bf4af9b254d32 # timeout=10
Commit message: "[OLINGO-1613] Set version to 5.0.1-SNAPSHOT"
> git rev-list --no-walk 7b8f05659e2654570ae9c09b2aa52238083ea02a # timeout=10
[olingo-odata4-all-profiles] $ /home/jenkins/tools/maven/latest3/bin/mvn ******** clean install -Psamples
[INFO] Scanning for projects...
Downloading from Nexus: https://repository.apache.org/snapshots/org/apache/felix/maven-bundle-plugin/maven-metadata.xml
Progress (1): 592 B Downloaded from Nexus: https://repository.apache.org/snapshots/org/apache/felix/maven-bundle-plugin/maven-metadata.xml (592 B at 528 B/s)
[WARNING]
[WARNING] Some problems were encountered while building the effective model for org.apache.olingo:odata-server-osgi-sample:bundle:5.0.1-SNAPSHOT
[WARNING] 'build.plugins.plugin.version' for org.codehaus.mojo:build-helper-maven-plugin is missing. @ line 75, column 15
[WARNING] 'build.plugins.plugin.version' for org.apache.felix:maven-bundle-plugin is missing. @ line 93, column 15
[WARNING]
[WARNING] It is highly recommended to fix these problems because they threaten the stability of your build.
[WARNING]
[WARNING] For this reason, future Maven versions might no longer support building such malformed projects.
[WARNING]
[INFO] ------------------------------------------------------------------------
[INFO] Reactor Build Order:
[INFO]
[INFO] Olingo-OData [pom]
[INFO] odata-lib [pom]
[INFO] odata-commons-api [bundle]
[INFO] odata-commons-core [bundle]
[INFO] odata-client-api [bundle]
[INFO] odata-client-core [bundle]
[INFO] odata-server-api [bundle]
[INFO] odata-server-core [bundle]
[INFO] odata-server-core-ext [jar]
[INFO] odata-server-tecsvc [war]
[INFO] odata-server-test [jar]
[INFO] odata-ext [pom]
[INFO] odata-client-proxy [jar]
[INFO] pojogen-maven-plugin [maven-plugin]
[INFO] odata-client-android [jar]
[INFO] odata-fit [war]
[INFO] odata-dist [pom]
[INFO] Olingo-OData-Client-for-Android [pom]
[INFO] Olingo-OData-Client-for-Java [pom]
[INFO] Olingo-OData-Server-for-Java [pom]
[INFO] Olingo-OData-Server-Extension-for-Java [pom]
[INFO] Olingo-OData-JavaDoc [pom]
[INFO] odata-samples [pom]
[INFO] odata-server-sample [war]
[INFO] odata-server-osgi-sample [bundle]
[INFO] odata-client-sample [jar]
[INFO]
[INFO] -------------------< org.apache.olingo:odata-parent >-------------------
[INFO] Building Olingo-OData 5.0.1-SNAPSHOT [1/26]
[INFO] from pom.xml
[INFO] --------------------------------[ pom ]---------------------------------
[INFO]
[INFO] --- clean:3.2.0:clean (default-clean) @ odata-parent ---
[INFO]
[INFO] --- enforcer:3.3.0:enforce (enforce-maven-version) @ odata-parent ---
[INFO] Rule 0: org.apache.maven.enforcer.rules.version.RequireMavenVersion passed
[INFO]
[INFO] --- enforcer:3.3.0:enforce (enforce-java-version) @ odata-parent ---
[INFO] Rule 0: org.apache.maven.enforcer.rules.version.RequireJavaVersion passed
[INFO]
[INFO] --- remote-resources:1.5:process (process-resource-bundles) @ odata-parent ---
[INFO]
[INFO] --- remote-resources:1.5:process (default) @ odata-parent ---
[INFO]
[INFO] --- site:3.12.1:attach-descriptor (attach-descriptor) @ odata-parent ---
[INFO] No site descriptor found: nothing to attach.
[INFO]
[INFO] --- failsafe:3.1.2:integration-test (integration-test) @ odata-parent ---
[INFO] No tests to run.
[INFO]
[INFO] --- source:3.3.0:jar-no-fork (attach-sources) @ odata-parent ---
[INFO]
[INFO] --- failsafe:3.1.2:verify (integration-test) @ odata-parent ---
[WARNING] Parameter 'encoding' (user property 'encoding') is deprecated: since of 2.20.1
[INFO]
[INFO] --- checkstyle:3.1.0:check (checkstyle) @ odata-parent ---
Downloading from central: https://repo.maven.apache.org/maven2/com/puppycrawl/tools/checkstyle/8.19/checkstyle-8.19.pom
Progress (1): 1.4/126 kBProgress (1): 2.7/126 kBProgress (1): 4.1/126 kBProgress (1): 5.5/126 kBProgress (1): 6.9/126 kBProgress (1): 8.2/126 kBProgress (1): 9.6/126 kBProgress (1): 11/126 kB Progress (1): 12/126 kBProgress (1): 14/126 kBProgress (1): 15/126 kBProgress (1): 16/126 kBProgress (1): 32/126 kBProgress (1): 49/126 kBProgress (1): 65/126 kBProgress (1): 81/126 kBProgress (1): 98/126 kBProgress (1): 114/126 kBProgress (1): 126 kB Downloaded from central: https://repo.maven.apache.org/maven2/com/puppycrawl/tools/checkstyle/8.19/checkstyle-8.19.pom (126 kB at 530 kB/s)
Downloading from central: https://repo.maven.apache.org/maven2/net/sf/saxon/Saxon-HE/9.9.1-2/Saxon-HE-9.9.1-2.pom
Progress (1): 3.9 kB Downloaded from central: https://repo.maven.apache.org/maven2/net/sf/saxon/Saxon-HE/9.9.1-2/Saxon-HE-9.9.1-2.pom (3.9 kB at 118 kB/s)
Downloading from central: https://repo.maven.apache.org/maven2/com/ibm/icu/icu4j/63.1/icu4j-63.1.pom
Progress (1): 4.9 kB Downloaded from central: https://repo.maven.apache.org/maven2/com/ibm/icu/icu4j/63.1/icu4j-63.1.pom (4.9 kB at 150 kB/s)
Downloading from central: https://repo.maven.apache.org/maven2/com/puppycrawl/tools/checkstyle/8.19/checkstyle-8.19.jar
Progress (1): 0/1.3 MBProgress (1): 0/1.3 MBProgress (1): 0/1.3 MBProgress (1): 0.1/1.3 MBProgress (1): 0.1/1.3 MBProgress (1): 0.1/1.3 MBProgress (1): 0.1/1.3 MBProgress (1): 0.1/1.3 MBProgress (1): 0.1/1.3 MBProgress (1): 0.2/1.3 MBProgress (1): 0.2/1.3 MBProgress (1): 0.2/1.3 MBProgress (1): 0.2/1.3 MBProgress (1): 0.2/1.3 MBProgress (1): 0.2/1.3 MBProgress (1): 0.3/1.3 MBProgress (1): 0.3/1.3 MBProgress (1): 0.3/1.3 MBProgress (1): 0.3/1.3 MBProgress (1): 0.3/1.3 MBProgress (1): 0.3/1.3 MBProgress (1): 0.4/1.3 MBProgress (1): 0.4/1.3 MBProgress (1): 0.4/1.3 MBProgress (1): 0.4/1.3 MBProgress (1): 0.4/1.3 MBProgress (1): 0.4/1.3 MBProgress (1): 0.5/1.3 MBProgress (1): 0.5/1.3 MBProgress (1): 0.5/1.3 MBProgress (1): 0.5/1.3 MBProgress (1): 0.5/1.3 MBProgress (1): 0.5/1.3 MBProgress (1): 0.6/1.3 MBProgress (1): 0.6/1.3 MBProgress (1): 0.6/1.3 MBProgress (1): 0.6/1.3 MBProgress (1): 0.6/1.3 MBProgress (1): 0.6/1.3 MBProgress (1): 0.7/1.3 MBProgress (1): 0.7/1.3 MBProgress (1): 0.7/1.3 MBProgress (1): 0.7/1.3 MBProgress (1): 0.7/1.3 MBProgress (1): 0.7/1.3 MBProgress (1): 0.8/1.3 MBProgress (1): 0.8/1.3 MBProgress (1): 0.8/1.3 MBProgress (1): 0.8/1.3 MBProgress (1): 0.8/1.3 MBProgress (1): 0.8/1.3 MBProgress (1): 0.9/1.3 MBProgress (1): 0.9/1.3 MBProgress (1): 0.9/1.3 MBProgress (1): 0.9/1.3 MBProgress (1): 0.9/1.3 MBProgress (1): 0.9/1.3 MBProgress (1): 1.0/1.3 MBProgress (1): 1.0/1.3 MBProgress (1): 1.0/1.3 MBProgress (1): 1.0/1.3 MBProgress (1): 1.0/1.3 MBProgress (1): 1.0/1.3 MBProgress (1): 1.0/1.3 MBProgress (1): 1.1/1.3 MBProgress (1): 1.1/1.3 MBProgress (1): 1.1/1.3 MBProgress (1): 1.1/1.3 MBProgress (1): 1.1/1.3 MBProgress (1): 1.1/1.3 MBProgress (1): 1.2/1.3 MBProgress (1): 1.2/1.3 MBProgress (1): 1.2/1.3 MBProgress (1): 1.2/1.3 MBProgress (1): 1.2/1.3 MBProgress (1): 1.2/1.3 MBProgress (1): 1.3/1.3 MBProgress (1): 1.3/1.3 MBProgress (1): 1.3/1.3 MBProgress (1): 1.3/1.3 MBProgress (1): 1.3 MB Downloaded from central: https://repo.maven.apache.org/maven2/com/puppycrawl/tools/checkstyle/8.19/checkstyle-8.19.jar (1.3 MB at 8.9 MB/s)
Downloading from central: https://repo.maven.apache.org/maven2/net/sf/saxon/Saxon-HE/9.9.1-2/Saxon-HE-9.9.1-2.jar
Downloading from central: https://repo.maven.apache.org/maven2/com/ibm/icu/icu4j/63.1/icu4j-63.1.jar
Progress (1): 0/5.5 MBProgress (1): 0/5.5 MBProgress (1): 0/5.5 MBProgress (1): 0.1/5.5 MBProgress (1): 0.1/5.5 MBProgress (1): 0.1/5.5 MBProgress (1): 0.1/5.5 MBProgress (1): 0.1/5.5 MBProgress (1): 0.1/5.5 MBProgress (1): 0.2/5.5 MBProgress (1): 0.2/5.5 MBProgress (1): 0.2/5.5 MBProgress (1): 0.2/5.5 MBProgress (1): 0.2/5.5 MBProgress (1): 0.2/5.5 MBProgress (1): 0.3/5.5 MBProgress (1): 0.3/5.5 MBProgress (1): 0.3/5.5 MBProgress (1): 0.3/5.5 MBProgress (1): 0.3/5.5 MBProgress (1): 0.3/5.5 MBProgress (1): 0.4/5.5 MBProgress (1): 0.4/5.5 MBProgress (1): 0.4/5.5 MBProgress (1): 0.4/5.5 MBProgress (1): 0.4/5.5 MBProgress (1): 0.4/5.5 MBProgress (1): 0.5/5.5 MBProgress (1): 0.5/5.5 MBProgress (1): 0.5/5.5 MBProgress (1): 0.5/5.5 MBProgress (1): 0.5/5.5 MBProgress (1): 0.5/5.5 MBProgress (1): 0.6/5.5 MBProgress (1): 0.6/5.5 MBProgress (1): 0.6/5.5 MBProgress (1): 0.6/5.5 MBProgress (1): 0.6/5.5 MBProgress (1): 0.6/5.5 MBProgress (1): 0.7/5.5 MBProgress (1): 0.7/5.5 MBProgress (1): 0.7/5.5 MBProgress (1): 0.7/5.5 MBProgress (1): 0.7/5.5 MBProgress (1): 0.7/5.5 MBProgress (1): 0.8/5.5 MBProgress (1): 0.8/5.5 MBProgress (1): 0.8/5.5 MBProgress (1): 0.8/5.5 MBProgress (1): 0.8/5.5 MBProgress (1): 0.8/5.5 MBProgress (1): 0.9/5.5 MBProgress (1): 0.9/5.5 MBProgress (1): 0.9/5.5 MBProgress (1): 0.9/5.5 MBProgress (1): 0.9/5.5 MBProgress (1): 0.9/5.5 MBProgress (1): 1.0/5.5 MBProgress (1): 1.0/5.5 MBProgress (1): 1.0/5.5 MBProgress (1): 1.0/5.5 MBProgress (1): 1.0/5.5 MBProgress (1): 1.0/5.5 MBProgress (1): 1.0/5.5 MBProgress (1): 1.1/5.5 MBProgress (1): 1.1/5.5 MBProgress (1): 1.1/5.5 MBProgress (1): 1.1/5.5 MBProgress (1): 1.1/5.5 MBProgress (1): 1.1/5.5 MBProgress (1): 1.2/5.5 MBProgress (1): 1.2/5.5 MBProgress (1): 1.2/5.5 MBProgress (1): 1.2/5.5 MBProgress (1): 1.2/5.5 MBProgress (1): 1.2/5.5 MBProgress (1): 1.3/5.5 MBProgress (1): 1.3/5.5 MBProgress (1): 1.3/5.5 MBProgress (1): 1.3/5.5 MBProgress (1): 1.3/5.5 MBProgress (1): 1.3/5.5 MBProgress (1): 1.4/5.5 MBProgress (1): 1.4/5.5 MBProgress (1): 1.4/5.5 MBProgress (1): 1.4/5.5 MBProgress (1): 1.4/5.5 MBProgress (1): 1.4/5.5 MBProgress (1): 1.5/5.5 MBProgress (1): 1.5/5.5 MBProgress (1): 1.5/5.5 MBProgress (1): 1.5/5.5 MBProgress (1): 1.5/5.5 MBProgress (1): 1.5/5.5 MBProgress (1): 1.6/5.5 MBProgress (1): 1.6/5.5 MBProgress (1): 1.6/5.5 MBProgress (1): 1.6/5.5 MBProgress (1): 1.6/5.5 MBProgress (1): 1.6/5.5 MBProgress (1): 1.7/5.5 MBProgress (1): 1.7/5.5 MBProgress (1): 1.7/5.5 MBProgress (1): 1.7/5.5 MBProgress (1): 1.7/5.5 MBProgress (1): 1.7/5.5 MBProgress (1): 1.8/5.5 MBProgress (1): 1.8/5.5 MBProgress (1): 1.8/5.5 MBProgress (1): 1.8/5.5 MBProgress (1): 1.8/5.5 MBProgress (1): 1.8/5.5 MBProgress (1): 1.8/5.5 MBProgress (1): 1.9/5.5 MBProgress (1): 1.9/5.5 MBProgress (1): 1.9/5.5 MBProgress (1): 1.9/5.5 MBProgress (1): 1.9/5.5 MBProgress (1): 1.9/5.5 MBProgress (1): 2.0/5.5 MBProgress (1): 2.0/5.5 MBProgress (1): 2.0/5.5 MBProgress (1): 2.0/5.5 MBProgress (1): 2.0/5.5 MBProgress (1): 2.0/5.5 MBProgress (1): 2.0/5.5 MBProgress (1): 2.1/5.5 MBProgress (1): 2.1/5.5 MBProgress (1): 2.1/5.5 MBProgress (1): 2.1/5.5 MBProgress (1): 2.1/5.5 MBProgress (1): 2.1/5.5 MBProgress (1): 2.1/5.5 MBProgress (1): 2.2/5.5 MBProgress (1): 2.2/5.5 MBProgress (1): 2.2/5.5 MBProgress (1): 2.2/5.5 MBProgress (1): 2.2/5.5 MBProgress (1): 2.2/5.5 MBProgress (1): 2.3/5.5 MBProgress (1): 2.3/5.5 MBProgress (1): 2.3/5.5 MBProgress (2): 2.3/5.5 MB | 0/13 MBProgress (2): 2.3/5.5 MB | 0/13 MBProgress (2): 2.3/5.5 MB | 0/13 MBProgress (2): 2.3/5.5 MB | 0/13 MBProgress (2): 2.3/5.5 MB | 0/13 MBProgress (2): 2.3/5.5 MB | 0/13 MBProgress (2): 2.3/5.5 MB | 0/13 MBProgress (2): 2.3/5.5 MB | 0/13 MBProgress (2): 2.3/5.5 MB | 0/13 MBProgress (2): 2.3/5.5 MB | 0/13 MBProgress (2): 2.3/5.5 MB | 0/13 MBProgress (2): 2.3/5.5 MB | 0/13 MBProgress (2): 2.3/5.5 MB | 0/13 MBProgress (2): 2.4/5.5 MB | 0/13 MBProgress (2): 2.4/5.5 MB | 0/13 MBProgress (2): 2.4/5.5 MB | 0/13 MBProgress (2): 2.4/5.5 MB | 0/13 MBProgress (2): 2.4/5.5 MB | 0/13 MBProgress (2): 2.4/5.5 MB | 0/13 MBProgress (2): 2.4/5.5 MB | 0/13 MBProgress (2): 2.4/5.5 MB | 0/13 MBProgress (2): 2.4/5.5 MB | 0/13 MBProgress (2): 2.4/5.5 MB | 0/13 MBProgress (2): 2.5/5.5 MB | 0/13 MBProgress (2): 2.5/5.5 MB | 0/13 MBProgress (2): 2.5/5.5 MB | 0/13 MBProgress (2): 2.5/5.5 MB | 0/13 MBProgress (2): 2.5/5.5 MB | 0/13 MBProgress (2): 2.5/5.5 MB | 0/13 MBProgress (2): 2.6/5.5 MB | 0/13 MBProgress (2): 2.6/5.5 MB | 0/13 MBProgress (2): 2.6/5.5 MB | 0/13 MBProgress (2): 2.6/5.5 MB | 0/13 MBProgress (2): 2.6/5.5 MB | 0/13 MBProgress (2): 2.6/5.5 MB | 0/13 MBProgress (2): 2.7/5.5 MB | 0/13 MBProgress (2): 2.7/5.5 MB | 0/13 MBProgress (2): 2.7/5.5 MB | 0/13 MBProgress (2): 2.7/5.5 MB | 0/13 MBProgress (2): 2.7/5.5 MB | 0/13 MBProgress (2): 2.7/5.5 MB | 0/13 MBProgress (2): 2.7/5.5 MB | 0/13 MBProgress (2): 2.7/5.5 MB | 0/13 MBProgress (2): 2.7/5.5 MB | 0.1/13 MBProgress (2): 2.8/5.5 MB | 0.1/13 MBProgress (2): 2.8/5.5 MB | 0.1/13 MBProgress (2): 2.8/5.5 MB | 0.1/13 MBProgress (2): 2.8/5.5 MB | 0.1/13 MBProgress (2): 2.8/5.5 MB | 0.1/13 MBProgress (2): 2.8/5.5 MB | 0.1/13 MBProgress (2): 2.8/5.5 MB | 0.1/13 MBProgress (2): 2.8/5.5 MB | 0.1/13 MBProgress (2): 2.9/5.5 MB | 0.1/13 MBProgress (2): 2.9/5.5 MB | 0.1/13 MBProgress (2): 2.9/5.5 MB | 0.1/13 MBProgress (2): 2.9/5.5 MB | 0.1/13 MBProgress (2): 2.9/5.5 MB | 0.1/13 MBProgress (2): 2.9/5.5 MB | 0.1/13 MBProgress (2): 3.0/5.5 MB | 0.1/13 MBProgress (2): 3.0/5.5 MB | 0.1/13 MBProgress (2): 3.0/5.5 MB | 0.1/13 MBProgress (2): 3.0/5.5 MB | 0.1/13 MBProgress (2): 3.0/5.5 MB | 0.1/13 MBProgress (2): 3.0/5.5 MB | 0.1/13 MBProgress (2): 3.1/5.5 MB | 0.1/13 MBProgress (2): 3.1/5.5 MB | 0.1/13 MBProgress (2): 3.1/5.5 MB | 0.1/13 MBProgress (2): 3.1/5.5 MB | 0.1/13 MBProgress (2): 3.1/5.5 MB | 0.1/13 MBProgress (2): 3.1/5.5 MB | 0.1/13 MBProgress (2): 3.1/5.5 MB | 0.1/13 MBProgress (2): 3.1/5.5 MB | 0.1/13 MBProgress (2): 3.1/5.5 MB | 0.1/13 MBProgress (2): 3.2/5.5 MB | 0.1/13 MBProgress (2): 3.2/5.5 MB | 0.2/13 MBProgress (2): 3.2/5.5 MB | 0.2/13 MBProgress (2): 3.2/5.5 MB | 0.2/13 MBProgress (2): 3.2/5.5 MB | 0.2/13 MBProgress (2): 3.2/5.5 MB | 0.2/13 MBProgress (2): 3.2/5.5 MB | 0.2/13 MBProgress (2): 3.2/5.5 MB | 0.2/13 MBProgress (2): 3.2/5.5 MB | 0.2/13 MBProgress (2): 3.2/5.5 MB | 0.2/13 MBProgress (2): 3.3/5.5 MB | 0.2/13 MBProgress (2): 3.3/5.5 MB | 0.2/13 MBProgress (2): 3.3/5.5 MB | 0.2/13 MBProgress (2): 3.3/5.5 MB | 0.2/13 MBProgress (2): 3.3/5.5 MB | 0.2/13 MBProgress (2): 3.3/5.5 MB | 0.2/13 MBProgress (2): 3.3/5.5 MB | 0.2/13 MBProgress (2): 3.3/5.5 MB | 0.2/13 MBProgress (2): 3.4/5.5 MB | 0.2/13 MBProgress (2): 3.4/5.5 MB | 0.2/13 MBProgress (2): 3.4/5.5 MB | 0.2/13 MBProgress (2): 3.4/5.5 MB | 0.2/13 MBProgress (2): 3.4/5.5 MB | 0.2/13 MBProgress (2): 3.4/5.5 MB | 0.2/13 MBProgress (2): 3.4/5.5 MB | 0.3/13 MBProgress (2): 3.5/5.5 MB | 0.3/13 MBProgress (2): 3.5/5.5 MB | 0.3/13 MBProgress (2): 3.5/5.5 MB | 0.3/13 MBProgress (2): 3.5/5.5 MB | 0.3/13 MBProgress (2): 3.5/5.5 MB | 0.3/13 MBProgress (2): 3.5/5.5 MB | 0.3/13 MBProgress (2): 3.5/5.5 MB | 0.3/13 MBProgress (2): 3.5/5.5 MB | 0.3/13 MBProgress (2): 3.5/5.5 MB | 0.3/13 MBProgress (2): 3.5/5.5 MB | 0.3/13 MBProgress (2): 3.6/5.5 MB | 0.3/13 MBProgress (2): 3.6/5.5 MB | 0.3/13 MBProgress (2): 3.6/5.5 MB | 0.3/13 MBProgress (2): 3.6/5.5 MB | 0.3/13 MBProgress (2): 3.6/5.5 MB | 0.4/13 MBProgress (2): 3.6/5.5 MB | 0.4/13 MBProgress (2): 3.6/5.5 MB | 0.4/13 MBProgress (2): 3.6/5.5 MB | 0.4/13 MBProgress (2): 3.6/5.5 MB | 0.4/13 MBProgress (2): 3.6/5.5 MB | 0.4/13 MBProgress (2): 3.6/5.5 MB | 0.4/13 MBProgress (2): 3.6/5.5 MB | 0.4/13 MBProgress (2): 3.6/5.5 MB | 0.4/13 MBProgress (2): 3.7/5.5 MB | 0.4/13 MBProgress (2): 3.7/5.5 MB | 0.4/13 MBProgress (2): 3.7/5.5 MB | 0.4/13 MBProgress (2): 3.7/5.5 MB | 0.5/13 MBProgress (2): 3.7/5.5 MB | 0.5/13 MBProgress (2): 3.7/5.5 MB | 0.5/13 MBProgress (2): 3.7/5.5 MB | 0.5/13 MBProgress (2): 3.7/5.5 MB | 0.5/13 MBProgress (2): 3.7/5.5 MB | 0.5/13 MBProgress (2): 3.7/5.5 MB | 0.5/13 MBProgress (2): 3.7/5.5 MB | 0.5/13 MBProgress (2): 3.7/5.5 MB | 0.5/13 MBProgress (2): 3.8/5.5 MB | 0.5/13 MBProgress (2): 3.8/5.5 MB | 0.5/13 MBProgress (2): 3.8/5.5 MB | 0.5/13 MBProgress (2): 3.8/5.5 MB | 0.5/13 MBProgress (2): 3.8/5.5 MB | 0.5/13 MBProgress (2): 3.8/5.5 MB | 0.6/13 MBProgress (2): 3.8/5.5 MB | 0.6/13 MBProgress (2): 3.8/5.5 MB | 0.6/13 MBProgress (2): 3.8/5.5 MB | 0.6/13 MBProgress (2): 3.8/5.5 MB | 0.6/13 MBProgress (2): 3.9/5.5 MB | 0.6/13 MBProgress (2): 3.9/5.5 MB | 0.6/13 MBProgress (2): 3.9/5.5 MB | 0.6/13 MBProgress (2): 3.9/5.5 MB | 0.6/13 MBProgress (2): 3.9/5.5 MB | 0.6/13 MBProgress (2): 3.9/5.5 MB | 0.6/13 MBProgress (2): 3.9/5.5 MB | 0.6/13 MBProgress (2): 3.9/5.5 MB | 0.7/13 MBProgress (2): 3.9/5.5 MB | 0.7/13 MBProgress (2): 3.9/5.5 MB | 0.7/13 MBProgress (2): 3.9/5.5 MB | 0.7/13 MBProgress (2): 3.9/5.5 MB | 0.7/13 MBProgress (2): 4.0/5.5 MB | 0.7/13 MBProgress (2): 4.0/5.5 MB | 0.7/13 MBProgress (2): 4.0/5.5 MB | 0.7/13 MBProgress (2): 4.0/5.5 MB | 0.7/13 MBProgress (2): 4.0/5.5 MB | 0.7/13 MBProgress (2): 4.0/5.5 MB | 0.7/13 MBProgress (2): 4.0/5.5 MB | 0.7/13 MBProgress (2): 4.0/5.5 MB | 0.8/13 MBProgress (2): 4.0/5.5 MB | 0.8/13 MBProgress (2): 4.0/5.5 MB | 0.8/13 MBProgress (2): 4.0/5.5 MB | 0.8/13 MBProgress (2): 4.0/5.5 MB | 0.8/13 MBProgress (2): 4.1/5.5 MB | 0.8/13 MBProgress (2): 4.1/5.5 MB | 0.8/13 MBProgress (2): 4.1/5.5 MB | 0.8/13 MBProgress (2): 4.1/5.5 MB | 0.8/13 MBProgress (2): 4.1/5.5 MB | 0.8/13 MBProgress (2): 4.1/5.5 MB | 0.8/13 MBProgress (2): 4.1/5.5 MB | 0.8/13 MBProgress (2): 4.1/5.5 MB | 0.8/13 MBProgress (2): 4.1/5.5 MB | 0.9/13 MBProgress (2): 4.1/5.5 MB | 0.9/13 MBProgress (2): 4.1/5.5 MB | 0.9/13 MBProgress (2): 4.1/5.5 MB | 0.9/13 MBProgress (2): 4.1/5.5 MB | 0.9/13 MBProgress (2): 4.2/5.5 MB | 0.9/13 MBProgress (2): 4.2/5.5 MB | 0.9/13 MBProgress (2): 4.2/5.5 MB | 0.9/13 MBProgress (2): 4.2/5.5 MB | 0.9/13 MBProgress (2): 4.2/5.5 MB | 0.9/13 MBProgress (2): 4.2/5.5 MB | 0.9/13 MBProgress (2): 4.2/5.5 MB | 0.9/13 MBProgress (2): 4.2/5.5 MB | 1.0/13 MBProgress (2): 4.2/5.5 MB | 1.0/13 MBProgress (2): 4.2/5.5 MB | 1.0/13 MBProgress (2): 4.2/5.5 MB | 1.0/13 MBProgress (2): 4.2/5.5 MB | 1.0/13 MBProgress (2): 4.3/5.5 MB | 1.0/13 MBProgress (2): 4.3/5.5 MB | 1.0/13 MBProgress (2): 4.3/5.5 MB | 1.0/13 MBProgress (2): 4.3/5.5 MB | 1.0/13 MBProgress (2): 4.3/5.5 MB | 1.0/13 MBProgress (2): 4.3/5.5 MB | 1.0/13 MBProgress (2): 4.3/5.5 MB | 1.0/13 MBProgress (2): 4.3/5.5 MB | 1.1/13 MBProgress (2): 4.3/5.5 MB | 1.1/13 MBProgress (2): 4.3/5.5 MB | 1.1/13 MBProgress (2): 4.3/5.5 MB | 1.1/13 MBProgress (2): 4.3/5.5 MB | 1.1/13 MBProgress (2): 4.4/5.5 MB | 1.1/13 MBProgress (2): 4.4/5.5 MB | 1.1/13 MBProgress (2): 4.4/5.5 MB | 1.1/13 MBProgress (2): 4.4/5.5 MB | 1.1/13 MBProgress (2): 4.4/5.5 MB | 1.1/13 MBProgress (2): 4.4/5.5 MB | 1.1/13 MBProgress (2): 4.4/5.5 MB | 1.1/13 MBProgress (2): 4.4/5.5 MB | 1.1/13 MBProgress (2): 4.4/5.5 MB | 1.1/13 MBProgress (2): 4.4/5.5 MB | 1.2/13 MBProgress (2): 4.4/5.5 MB | 1.2/13 MBProgress (2): 4.4/5.5 MB | 1.2/13 MBProgress (2): 4.5/5.5 MB | 1.2/13 MBProgress (2): 4.5/5.5 MB | 1.2/13 MBProgress (2): 4.5/5.5 MB | 1.2/13 MBProgress (2): 4.5/5.5 MB | 1.2/13 MBProgress (2): 4.5/5.5 MB | 1.2/13 MBProgress (2): 4.5/5.5 MB | 1.2/13 MBProgress (2): 4.5/5.5 MB | 1.2/13 MBProgress (2): 4.5/5.5 MB | 1.2/13 MBProgress (2): 4.5/5.5 MB | 1.2/13 MBProgress (2): 4.5/5.5 MB | 1.3/13 MBProgress (2): 4.5/5.5 MB | 1.3/13 MBProgress (2): 4.5/5.5 MB | 1.3/13 MBProgress (2): 4.6/5.5 MB | 1.3/13 MBProgress (2): 4.6/5.5 MB | 1.3/13 MBProgress (2): 4.6/5.5 MB | 1.3/13 MBProgress (2): 4.6/5.5 MB | 1.3/13 MBProgress (2): 4.6/5.5 MB | 1.3/13 MBProgress (2): 4.6/5.5 MB | 1.3/13 MBProgress (2): 4.6/5.5 MB | 1.3/13 MBProgress (2): 4.6/5.5 MB | 1.3/13 MBProgress (2): 4.6/5.5 MB | 1.3/13 MBProgress (2): 4.6/5.5 MB | 1.4/13 MBProgress (2): 4.6/5.5 MB | 1.4/13 MBProgress (2): 4.6/5.5 MB | 1.4/13 MBProgress (2): 4.6/5.5 MB | 1.4/13 MBProgress (2): 4.6/5.5 MB | 1.4/13 MBProgress (2): 4.7/5.5 MB | 1.4/13 MBProgress (2): 4.7/5.5 MB | 1.4/13 MBProgress (2): 4.7/5.5 MB | 1.4/13 MBProgress (2): 4.7/5.5 MB | 1.4/13 MBProgress (2): 4.7/5.5 MB | 1.4/13 MBProgress (2): 4.7/5.5 MB | 1.4/13 MBProgress (2): 4.7/5.5 MB | 1.4/13 MBProgress (2): 4.7/5.5 MB | 1.5/13 MBProgress (2): 4.7/5.5 MB | 1.5/13 MBProgress (2): 4.7/5.5 MB | 1.5/13 MBProgress (2): 4.7/5.5 MB | 1.5/13 MBProgress (2): 4.7/5.5 MB | 1.5/13 MBProgress (2): 4.8/5.5 MB | 1.5/13 MBProgress (2): 4.8/5.5 MB | 1.5/13 MBProgress (2): 4.8/5.5 MB | 1.5/13 MBProgress (2): 4.8/5.5 MB | 1.5/13 MBProgress (2): 4.8/5.5 MB | 1.5/13 MBProgress (2): 4.8/5.5 MB | 1.5/13 MBProgress (2): 4.8/5.5 MB | 1.5/13 MBProgress (2): 4.8/5.5 MB | 1.6/13 MBProgress (2): 4.8/5.5 MB | 1.6/13 MBProgress (2): 4.8/5.5 MB | 1.6/13 MBProgress (2): 4.8/5.5 MB | 1.6/13 MBProgress (2): 4.8/5.5 MB | 1.6/13 MBProgress (2): 4.9/5.5 MB | 1.6/13 MBProgress (2): 4.9/5.5 MB | 1.6/13 MBProgress (2): 4.9/5.5 MB | 1.6/13 MBProgress (2): 4.9/5.5 MB | 1.6/13 MBProgress (2): 4.9/5.5 MB | 1.6/13 MBProgress (2): 4.9/5.5 MB | 1.6/13 MBProgress (2): 4.9/5.5 MB | 1.6/13 MBProgress (2): 4.9/5.5 MB | 1.7/13 MBProgress (2): 4.9/5.5 MB | 1.7/13 MBProgress (2): 4.9/5.5 MB | 1.7/13 MBProgress (2): 4.9/5.5 MB | 1.7/13 MBProgress (2): 4.9/5.5 MB | 1.7/13 MBProgress (2): 5.0/5.5 MB | 1.7/13 MBProgress (2): 5.0/5.5 MB | 1.7/13 MBProgress (2): 5.0/5.5 MB | 1.7/13 MBProgress (2): 5.0/5.5 MB | 1.7/13 MBProgress (2): 5.0/5.5 MB | 1.7/13 MBProgress (2): 5.0/5.5 MB | 1.7/13 MBProgress (2): 5.0/5.5 MB | 1.7/13 MBProgress (2): 5.0/5.5 MB | 1.8/13 MBProgress (2): 5.0/5.5 MB | 1.8/13 MBProgress (2): 5.0/5.5 MB | 1.8/13 MBProgress (2): 5.0/5.5 MB | 1.8/13 MBProgress (2): 5.0/5.5 MB | 1.8/13 MBProgress (2): 5.1/5.5 MB | 1.8/13 MBProgress (2): 5.1/5.5 MB | 1.8/13 MBProgress (2): 5.1/5.5 MB | 1.8/13 MBProgress (2): 5.1/5.5 MB | 1.8/13 MBProgress (2): 5.1/5.5 MB | 1.8/13 MBProgress (2): 5.1/5.5 MB | 1.8/13 MBProgress (2): 5.1/5.5 MB | 1.8/13 MBProgress (2): 5.1/5.5 MB | 1.8/13 MBProgress (2): 5.1/5.5 MB | 1.9/13 MBProgress (2): 5.1/5.5 MB | 1.9/13 MBProgress (2): 5.1/5.5 MB | 1.9/13 MBProgress (2): 5.2/5.5 MB | 1.9/13 MBProgress (2): 5.2/5.5 MB | 1.9/13 MBProgress (2): 5.2/5.5 MB | 1.9/13 MBProgress (2): 5.2/5.5 MB | 1.9/13 MBProgress (2): 5.2/5.5 MB | 1.9/13 MBProgress (2): 5.2/5.5 MB | 1.9/13 MBProgress (2): 5.2/5.5 MB | 1.9/13 MBProgress (2): 5.2/5.5 MB | 1.9/13 MBProgress (2): 5.2/5.5 MB | 1.9/13 MBProgress (2): 5.2/5.5 MB | 2.0/13 MBProgress (2): 5.2/5.5 MB | 2.0/13 MBProgress (2): 5.3/5.5 MB | 2.0/13 MBProgress (2): 5.3/5.5 MB | 2.0/13 MBProgress (2): 5.3/5.5 MB | 2.0/13 MBProgress (2): 5.3/5.5 MB | 2.0/13 MBProgress (2): 5.3/5.5 MB | 2.0/13 MBProgress (2): 5.3/5.5 MB | 2.0/13 MBProgress (2): 5.3/5.5 MB | 2.0/13 MBProgress (2): 5.3/5.5 MB | 2.0/13 MBProgress (2): 5.3/5.5 MB | 2.0/13 MBProgress (2): 5.3/5.5 MB | 2.0/13 MBProgress (2): 5.3/5.5 MB | 2.0/13 MBProgress (2): 5.3/5.5 MB | 2.1/13 MBProgress (2): 5.4/5.5 MB | 2.1/13 MBProgress (2): 5.4/5.5 MB | 2.1/13 MBProgress (2): 5.4/5.5 MB | 2.1/13 MBProgress (2): 5.4/5.5 MB | 2.1/13 MBProgress (2): 5.4/5.5 MB | 2.1/13 MBProgress (2): 5.4/5.5 MB | 2.1/13 MBProgress (2): 5.4/5.5 MB | 2.1/13 MBProgress (2): 5.4/5.5 MB | 2.1/13 MBProgress (2): 5.4/5.5 MB | 2.1/13 MBProgress (2): 5.4/5.5 MB | 2.1/13 MBProgress (2): 5.4/5.5 MB | 2.1/13 MBProgress (2): 5.4/5.5 MB | 2.1/13 MBProgress (2): 5.5/5.5 MB | 2.1/13 MBProgress (2): 5.5/5.5 MB | 2.1/13 MBProgress (2): 5.5/5.5 MB | 2.2/13 MBProgress (2): 5.5 MB | 2.2/13 MB Progress (2): 5.5 MB | 2.2/13 MBProgress (2): 5.5 MB | 2.2/13 MB Downloaded from central: https://repo.maven.apache.org/maven2/net/sf/saxon/Saxon-HE/9.9.1-2/Saxon-HE-9.9.1-2.jar (5.5 MB at 13 MB/s)
Progress (1): 2.2/13 MBProgress (1): 2.2/13 MBProgress (1): 2.2/13 MBProgress (1): 2.3/13 MBProgress (1): 2.3/13 MBProgress (1): 2.3/13 MBProgress (1): 2.3/13 MBProgress (1): 2.3/13 MBProgress (1): 2.3/13 MBProgress (1): 2.4/13 MBProgress (1): 2.4/13 MBProgress (1): 2.4/13 MBProgress (1): 2.4/13 MBProgress (1): 2.4/13 MBProgress (1): 2.4/13 MBProgress (1): 2.5/13 MBProgress (1): 2.5/13 MBProgress (1): 2.5/13 MBProgress (1): 2.5/13 MBProgress (1): 2.5/13 MBProgress (1): 2.5/13 MBProgress (1): 2.6/13 MBProgress (1): 2.6/13 MBProgress (1): 2.6/13 MBProgress (1): 2.6/13 MBProgress (1): 2.6/13 MBProgress (1): 2.6/13 MBProgress (1): 2.7/13 MBProgress (1): 2.7/13 MBProgress (1): 2.7/13 MBProgress (1): 2.7/13 MBProgress (1): 2.7/13 MBProgress (1): 2.7/13 MBProgress (1): 2.8/13 MBProgress (1): 2.8/13 MBProgress (1): 2.8/13 MBProgress (1): 2.8/13 MBProgress (1): 2.8/13 MBProgress (1): 2.8/13 MBProgress (1): 2.9/13 MBProgress (1): 2.9/13 MBProgress (1): 2.9/13 MBProgress (1): 2.9/13 MBProgress (1): 2.9/13 MBProgress (1): 2.9/13 MBProgress (1): 3.0/13 MBProgress (1): 3.0/13 MBProgress (1): 3.0/13 MBProgress (1): 3.0/13 MBProgress (1): 3.0/13 MBProgress (1): 3.0/13 MBProgress (1): 3.1/13 MBProgress (1): 3.1/13 MBProgress (1): 3.1/13 MBProgress (1): 3.1/13 MBProgress (1): 3.1/13 MBProgress (1): 3.1/13 MBProgress (1): 3.1/13 MBProgress (1): 3.2/13 MBProgress (1): 3.2/13 MBProgress (1): 3.2/13 MBProgress (1): 3.2/13 MBProgress (1): 3.2/13 MBProgress (1): 3.2/13 MBProgress (1): 3.3/13 MBProgress (1): 3.3/13 MBProgress (1): 3.3/13 MBProgress (1): 3.3/13 MBProgress (1): 3.3/13 MBProgress (1): 3.3/13 MBProgress (1): 3.4/13 MBProgress (1): 3.4/13 MBProgress (1): 3.4/13 MBProgress (1): 3.4/13 MBProgress (1): 3.4/13 MBProgress (1): 3.4/13 MBProgress (1): 3.5/13 MBProgress (1): 3.5/13 MBProgress (1): 3.5/13 MBProgress (1): 3.5/13 MBProgress (1): 3.5/13 MBProgress (1): 3.5/13 MBProgress (1): 3.6/13 MBProgress (1): 3.6/13 MBProgress (1): 3.6/13 MBProgress (1): 3.6/13 MBProgress (1): 3.6/13 MBProgress (1): 3.6/13 MBProgress (1): 3.7/13 MBProgress (1): 3.7/13 MBProgress (1): 3.7/13 MBProgress (1): 3.7/13 MBProgress (1): 3.7/13 MBProgress (1): 3.7/13 MBProgress (1): 3.8/13 MBProgress (1): 3.8/13 MBProgress (1): 3.8/13 MBProgress (1): 3.8/13 MBProgress (1): 3.8/13 MBProgress (1): 3.8/13 MBProgress (1): 3.9/13 MBProgress (1): 3.9/13 MBProgress (1): 3.9/13 MBProgress (1): 3.9/13 MBProgress (1): 3.9/13 MBProgress (1): 3.9/13 MBProgress (1): 4.0/13 MBProgress (1): 4.0/13 MBProgress (1): 4.0/13 MBProgress (1): 4.0/13 MBProgress (1): 4.0/13 MBProgress (1): 4.0/13 MBProgress (1): 4.0/13 MBProgress (1): 4.1/13 MBProgress (1): 4.1/13 MBProgress (1): 4.1/13 MBProgress (1): 4.1/13 MBProgress (1): 4.1/13 MBProgress (1): 4.1/13 MBProgress (1): 4.2/13 MBProgress (1): 4.2/13 MBProgress (1): 4.2/13 MBProgress (1): 4.2/13 MBProgress (1): 4.2/13 MBProgress (1): 4.2/13 MBProgress (1): 4.3/13 MBProgress (1): 4.3/13 MBProgress (1): 4.3/13 MBProgress (1): 4.3/13 MBProgress (1): 4.3/13 MBProgress (1): 4.3/13 MBProgress (1): 4.4/13 MBProgress (1): 4.4/13 MBProgress (1): 4.4/13 MBProgress (1): 4.4/13 MBProgress (1): 4.4/13 MBProgress (1): 4.4/13 MBProgress (1): 4.5/13 MBProgress (1): 4.5/13 MBProgress (1): 4.5/13 MBProgress (1): 4.5/13 MBProgress (1): 4.5/13 MBProgress (1): 4.5/13 MBProgress (1): 4.6/13 MBProgress (1): 4.6/13 MBProgress (1): 4.6/13 MBProgress (1): 4.6/13 MBProgress (1): 4.6/13 MBProgress (1): 4.6/13 MBProgress (1): 4.7/13 MBProgress (1): 4.7/13 MBProgress (1): 4.7/13 MBProgress (1): 4.7/13 MBProgress (1): 4.7/13 MBProgress (1): 4.7/13 MBProgress (1): 4.8/13 MBProgress (1): 4.8/13 MBProgress (1): 4.8/13 MBProgress (1): 4.8/13 MBProgress (1): 4.8/13 MBProgress (1): 4.8/13 MBProgress (1): 4.9/13 MBProgress (1): 4.9/13 MBProgress (1): 4.9/13 MBProgress (1): 4.9/13 MBProgress (1): 4.9/13 MBProgress (1): 4.9/13 MBProgress (1): 5.0/13 MBProgress (1): 5.0/13 MBProgress (1): 5.0/13 MBProgress (1): 5.0/13 MBProgress (1): 5.0/13 MBProgress (1): 5.0/13 MBProgress (1): 5.0/13 MBProgress (1): 5.1/13 MBProgress (1): 5.1/13 MBProgress (1): 5.1/13 MBProgress (1): 5.1/13 MBProgress (1): 5.1/13 MBProgress (1): 5.1/13 MBProgress (1): 5.2/13 MBProgress (1): 5.2/13 MBProgress (1): 5.2/13 MBProgress (1): 5.2/13 MBProgress (1): 5.2/13 MBProgress (1): 5.2/13 MBProgress (1): 5.3/13 MBProgress (1): 5.3/13 MBProgress (1): 5.3/13 MBProgress (1): 5.3/13 MBProgress (1): 5.3/13 MBProgress (1): 5.3/13 MBProgress (1): 5.4/13 MBProgress (1): 5.4/13 MBProgress (1): 5.4/13 MBProgress (1): 5.4/13 MBProgress (1): 5.4/13 MBProgress (1): 5.4/13 MBProgress (1): 5.5/13 MBProgress (1): 5.5/13 MBProgress (1): 5.5/13 MBProgress (1): 5.5/13 MBProgress (1): 5.5/13 MBProgress (1): 5.5/13 MBProgress (1): 5.6/13 MBProgress (1): 5.6/13 MBProgress (1): 5.6/13 MBProgress (1): 5.6/13 MBProgress (1): 5.6/13 MBProgress (1): 5.6/13 MBProgress (1): 5.7/13 MBProgress (1): 5.7/13 MBProgress (1): 5.7/13 MBProgress (1): 5.7/13 MBProgress (1): 5.7/13 MBProgress (1): 5.7/13 MBProgress (1): 5.8/13 MBProgress (1): 5.8/13 MBProgress (1): 5.8/13 MBProgress (1): 5.8/13 MBProgress (1): 5.8/13 MBProgress (1): 5.8/13 MBProgress (1): 5.9/13 MBProgress (1): 5.9/13 MBProgress (1): 5.9/13 MBProgress (1): 5.9/13 MBProgress (1): 5.9/13 MBProgress (1): 5.9/13 MBProgress (1): 6.0/13 MBProgress (1): 6.0/13 MBProgress (1): 6.0/13 MBProgress (1): 6.0/13 MBProgress (1): 6.0/13 MBProgress (1): 6.0/13 MBProgress (1): 6.0/13 MBProgress (1): 6.1/13 MBProgress (1): 6.1/13 MBProgress (1): 6.1/13 MBProgress (1): 6.1/13 MBProgress (1): 6.1/13 MBProgress (1): 6.1/13 MBProgress (1): 6.2/13 MBProgress (1): 6.2/13 MBProgress (1): 6.2/13 MBProgress (1): 6.2/13 MBProgress (1): 6.2/13 MBProgress (1): 6.2/13 MBProgress (1): 6.3/13 MBProgress (1): 6.3/13 MBProgress (1): 6.3/13 MBProgress (1): 6.3/13 MBProgress (1): 6.3/13 MBProgress (1): 6.3/13 MBProgress (1): 6.4/13 MBProgress (1): 6.4/13 MBProgress (1): 6.4/13 MBProgress (1): 6.4/13 MBProgress (1): 6.4/13 MBProgress (1): 6.4/13 MBProgress (1): 6.5/13 MBProgress (1): 6.5/13 MBProgress (1): 6.5/13 MBProgress (1): 6.5/13 MBProgress (1): 6.5/13 MBProgress (1): 6.5/13 MBProgress (1): 6.6/13 MBProgress (1): 6.6/13 MBProgress (1): 6.6/13 MBProgress (1): 6.6/13 MBProgress (1): 6.6/13 MBProgress (1): 6.6/13 MBProgress (1): 6.7/13 MBProgress (1): 6.7/13 MBProgress (1): 6.7/13 MBProgress (1): 6.7/13 MBProgress (1): 6.7/13 MBProgress (1): 6.7/13 MBProgress (1): 6.8/13 MBProgress (1): 6.8/13 MBProgress (1): 6.8/13 MBProgress (1): 6.8/13 MBProgress (1): 6.8/13 MBProgress (1): 6.8/13 MBProgress (1): 6.9/13 MBProgress (1): 6.9/13 MBProgress (1): 6.9/13 MBProgress (1): 6.9/13 MBProgress (1): 6.9/13 MBProgress (1): 6.9/13 MBProgress (1): 6.9/13 MBProgress (1): 7.0/13 MBProgress (1): 7.0/13 MBProgress (1): 7.0/13 MBProgress (1): 7.0/13 MBProgress (1): 7.0/13 MBProgress (1): 7.0/13 MBProgress (1): 7.1/13 MBProgress (1): 7.1/13 MBProgress (1): 7.1/13 MBProgress (1): 7.1/13 MBProgress (1): 7.1/13 MBProgress (1): 7.1/13 MBProgress (1): 7.2/13 MBProgress (1): 7.2/13 MBProgress (1): 7.2/13 MBProgress (1): 7.2/13 MBProgress (1): 7.2/13 MBProgress (1): 7.2/13 MBProgress (1): 7.3/13 MBProgress (1): 7.3/13 MBProgress (1): 7.3/13 MBProgress (1): 7.3/13 MBProgress (1): 7.3/13 MBProgress (1): 7.3/13 MBProgress (1): 7.4/13 MBProgress (1): 7.4/13 MBProgress (1): 7.4/13 MBProgress (1): 7.4/13 MBProgress (1): 7.4/13 MBProgress (1): 7.4/13 MBProgress (1): 7.5/13 MBProgress (1): 7.5/13 MBProgress (1): 7.5/13 MBProgress (1): 7.5/13 MBProgress (1): 7.5/13 MBProgress (1): 7.5/13 MBProgress (1): 7.6/13 MBProgress (1): 7.6/13 MBProgress (1): 7.6/13 MBProgress (1): 7.6/13 MBProgress (1): 7.6/13 MBProgress (1): 7.6/13 MBProgress (1): 7.7/13 MBProgress (1): 7.7/13 MBProgress (1): 7.7/13 MBProgress (1): 7.7/13 MBProgress (1): 7.7/13 MBProgress (1): 7.7/13 MBProgress (1): 7.8/13 MBProgress (1): 7.8/13 MBProgress (1): 7.8/13 MBProgress (1): 7.8/13 MBProgress (1): 7.8/13 MBProgress (1): 7.8/13 MBProgress (1): 7.9/13 MBProgress (1): 7.9/13 MBProgress (1): 7.9/13 MBProgress (1): 7.9/13 MBProgress (1): 7.9/13 MBProgress (1): 7.9/13 MBProgress (1): 7.9/13 MBProgress (1): 8.0/13 MBProgress (1): 8.0/13 MBProgress (1): 8.0/13 MBProgress (1): 8.0/13 MBProgress (1): 8.0/13 MBProgress (1): 8.0/13 MBProgress (1): 8.1/13 MBProgress (1): 8.1/13 MBProgress (1): 8.1/13 MBProgress (1): 8.1/13 MBProgress (1): 8.1/13 MBProgress (1): 8.1/13 MBProgress (1): 8.2/13 MBProgress (1): 8.2/13 MBProgress (1): 8.2/13 MBProgress (1): 8.2/13 MBProgress (1): 8.2/13 MBProgress (1): 8.2/13 MBProgress (1): 8.3/13 MBProgress (1): 8.3/13 MBProgress (1): 8.3/13 MBProgress (1): 8.3/13 MBProgress (1): 8.3/13 MBProgress (1): 8.3/13 MBProgress (1): 8.4/13 MBProgress (1): 8.4/13 MBProgress (1): 8.4/13 MBProgress (1): 8.4/13 MBProgress (1): 8.4/13 MBProgress (1): 8.4/13 MBProgress (1): 8.5/13 MBProgress (1): 8.5/13 MBProgress (1): 8.5/13 MBProgress (1): 8.5/13 MBProgress (1): 8.5/13 MBProgress (1): 8.5/13 MBProgress (1): 8.6/13 MBProgress (1): 8.6/13 MBProgress (1): 8.6/13 MBProgress (1): 8.6/13 MBProgress (1): 8.6/13 MBProgress (1): 8.6/13 MBProgress (1): 8.7/13 MBProgress (1): 8.7/13 MBProgress (1): 8.7/13 MBProgress (1): 8.7/13 MBProgress (1): 8.7/13 MBProgress (1): 8.7/13 MBProgress (1): 8.8/13 MBProgress (1): 8.8/13 MBProgress (1): 8.8/13 MBProgress (1): 8.8/13 MBProgress (1): 8.8/13 MBProgress (1): 8.8/13 MBProgress (1): 8.9/13 MBProgress (1): 8.9/13 MBProgress (1): 8.9/13 MBProgress (1): 8.9/13 MBProgress (1): 8.9/13 MBProgress (1): 8.9/13 MBProgress (1): 8.9/13 MBProgress (1): 9.0/13 MBProgress (1): 9.0/13 MBProgress (1): 9.0/13 MBProgress (1): 9.0/13 MBProgress (1): 9.0/13 MBProgress (1): 9.0/13 MBProgress (1): 9.1/13 MBProgress (1): 9.1/13 MBProgress (1): 9.1/13 MBProgress (1): 9.1/13 MBProgress (1): 9.1/13 MBProgress (1): 9.1/13 MBProgress (1): 9.2/13 MBProgress (1): 9.2/13 MBProgress (1): 9.2/13 MBProgress (1): 9.2/13 MBProgress (1): 9.2/13 MBProgress (1): 9.2/13 MBProgress (1): 9.3/13 MBProgress (1): 9.3/13 MBProgress (1): 9.3/13 MBProgress (1): 9.3/13 MBProgress (1): 9.3/13 MBProgress (1): 9.3/13 MBProgress (1): 9.4/13 MBProgress (1): 9.4/13 MBProgress (1): 9.4/13 MBProgress (1): 9.4/13 MBProgress (1): 9.4/13 MBProgress (1): 9.4/13 MBProgress (1): 9.5/13 MBProgress (1): 9.5/13 MBProgress (1): 9.5/13 MBProgress (1): 9.5/13 MBProgress (1): 9.5/13 MBProgress (1): 9.5/13 MBProgress (1): 9.6/13 MBProgress (1): 9.6/13 MBProgress (1): 9.6/13 MBProgress (1): 9.6/13 MBProgress (1): 9.6/13 MBProgress (1): 9.6/13 MBProgress (1): 9.7/13 MBProgress (1): 9.7/13 MBProgress (1): 9.7/13 MBProgress (1): 9.7/13 MBProgress (1): 9.7/13 MBProgress (1): 9.7/13 MBProgress (1): 9.8/13 MBProgress (1): 9.8/13 MBProgress (1): 9.8/13 MBProgress (1): 9.8/13 MBProgress (1): 9.8/13 MBProgress (1): 9.8/13 MBProgress (1): 9.8/13 MBProgress (1): 9.9/13 MBProgress (1): 9.9/13 MBProgress (1): 9.9/13 MBProgress (1): 9.9/13 MBProgress (1): 9.9/13 MBProgress (1): 9.9/13 MBProgress (1): 10.0/13 MBProgress (1): 10.0/13 MBProgress (1): 10.0/13 MBProgress (1): 10/13 MB Progress (1): 10/13 MBProgress (1): 10/13 MBProgress (1): 10/13 MBProgress (1): 10/13 MBProgress (1): 10/13 MBProgress (1): 10/13 MBProgress (1): 10/13 MBProgress (1): 10/13 MBProgress (1): 10/13 MBProgress (1): 10/13 MBProgress (1): 10/13 MBProgress (1): 10/13 MBProgress (1): 10/13 MBProgress (1): 10/13 MBProgress (1): 10/13 MBProgress (1): 10/13 MBProgress (1): 10/13 MBProgress (1): 10/13 MBProgress (1): 10/13 MBProgress (1): 10/13 MBProgress (1): 10/13 MBProgress (1): 10/13 MBProgress (1): 10/13 MBProgress (1): 10/13 MBProgress (1): 10/13 MBProgress (1): 10/13 MBProgress (1): 10/13 MBProgress (1): 10/13 MBProgress (1): 10/13 MBProgress (1): 11/13 MBProgress (1): 11/13 MBProgress (1): 11/13 MBProgress (1): 11/13 MBProgress (1): 11/13 MBProgress (1): 11/13 MBProgress (1): 11/13 MBProgress (1): 11/13 MBProgress (1): 11/13 MBProgress (1): 11/13 MBProgress (1): 11/13 MBProgress (1): 11/13 MBProgress (1): 11/13 MBProgress (1): 11/13 MBProgress (1): 11/13 MBProgress (1): 11/13 MBProgress (1): 11/13 MBProgress (1): 11/13 MBProgress (1): 11/13 MBProgress (1): 11/13 MBProgress (1): 11/13 MBProgress (1): 11/13 MBProgress (1): 11/13 MBProgress (1): 11/13 MBProgress (1): 11/13 MBProgress (1): 11/13 MBProgress (1): 11/13 MBProgress (1): 11/13 MBProgress (1): 11/13 MBProgress (1): 11/13 MBProgress (1): 11/13 MBProgress (1): 11/13 MBProgress (1): 11/13 MBProgress (1): 11/13 MBProgress (1): 11/13 MBProgress (1): 11/13 MBProgress (1): 11/13 MBProgress (1): 11/13 MBProgress (1): 11/13 MBProgress (1): 11/13 MBProgress (1): 11/13 MBProgress (1): 11/13 MBProgress (1): 11/13 MBProgress (1): 11/13 MBProgress (1): 11/13 MBProgress (1): 11/13 MBProgress (1): 11/13 MBProgress (1): 11/13 MBProgress (1): 11/13 MBProgress (1): 11/13 MBProgress (1): 11/13 MBProgress (1): 11/13 MBProgress (1): 11/13 MBProgress (1): 11/13 MBProgress (1): 11/13 MBProgress (1): 11/13 MBProgress (1): 11/13 MBProgress (1): 11/13 MBProgress (1): 11/13 MBProgress (1): 11/13 MBProgress (1): 11/13 MBProgress (1): 12/13 MBProgress (1): 12/13 MBProgress (1): 12/13 MBProgress (1): 12/13 MBProgress (1): 12/13 MBProgress (1): 12/13 MBProgress (1): 12/13 MBProgress (1): 12/13 MBProgress (1): 12/13 MBProgress (1): 12/13 MBProgress (1): 12/13 MBProgress (1): 12/13 MBProgress (1): 12/13 MBProgress (1): 12/13 MBProgress (1): 12/13 MBProgress (1): 12/13 MBProgress (1): 12/13 MBProgress (1): 12/13 MBProgress (1): 12/13 MBProgress (1): 12/13 MBProgress (1): 12/13 MBProgress (1): 12/13 MBProgress (1): 12/13 MBProgress (1): 12/13 MBProgress (1): 12/13 MBProgress (1): 12/13 MBProgress (1): 12/13 MBProgress (1): 12/13 MBProgress (1): 12/13 MBProgress (1): 12/13 MBProgress (1): 12/13 MBProgress (1): 12/13 MBProgress (1): 12/13 MBProgress (1): 12/13 MBProgress (1): 12/13 MBProgress (1): 12/13 MBProgress (1): 12/13 MBProgress (1): 12/13 MBProgress (1): 12/13 MBProgress (1): 12/13 MBProgress (1): 12/13 MBProgress (1): 12/13 MBProgress (1): 12/13 MBProgress (1): 12/13 MBProgress (1): 12/13 MBProgress (1): 12/13 MBProgress (1): 12/13 MBProgress (1): 12/13 MBProgress (1): 12/13 MBProgress (1): 12/13 MBProgress (1): 12/13 MBProgress (1): 12/13 MBProgress (1): 12/13 MBProgress (1): 12/13 MBProgress (1): 12/13 MBProgress (1): 12/13 MBProgress (1): 12/13 MBProgress (1): 12/13 MBProgress (1): 12/13 MBProgress (1): 12/13 MBProgress (1): 12/13 MBProgress (1): 13/13 MBProgress (1): 13/13 MBProgress (1): 13/13 MBProgress (1): 13/13 MBProgress (1): 13/13 MBProgress (1): 13/13 MBProgress (1): 13/13 MBProgress (1): 13/13 MBProgress (1): 13 MB Downloaded from central: https://repo.maven.apache.org/maven2/com/ibm/icu/icu4j/63.1/icu4j-63.1.jar (13 MB at 12 MB/s)
[INFO] Starting audit...
Audit done.
[INFO]
[INFO] --- install:3.1.1:install (default-install) @ odata-parent ---
[INFO] Installing <https://ci-builds.apache.org/job/Olingo/job/olingo-odata4-all-profiles/ws/pom.xml> to /home/jenkins/.m2/repository/org/apache/olingo/odata-parent/5.0.1-SNAPSHOT/odata-parent-5.0.1-SNAPSHOT.pom
[INFO]
[INFO] --- apache-rat:0.15:check (rat-check) @ odata-parent ---
[INFO] Enabled default license matchers.
[INFO] Will parse SCM ignores for exclusions...
[INFO] Parsing exclusions from <https://ci-builds.apache.org/job/Olingo/job/olingo-odata4-all-profiles/ws/.gitignore>
[INFO] Finished adding exclusions from SCM ignore files.
[INFO] 80 implicit excludes.
[INFO] 26 explicit excludes.
[INFO] 7 resources included
[INFO] Rat check: Summary over all files. Unapproved: 0, unknown: 0, generated: 0, approved: 5 licenses.
[INFO]
[INFO] --------------------< org.apache.olingo:odata-lib >---------------------
[INFO] Building odata-lib 5.0.1-SNAPSHOT [2/26]
[INFO] from lib/pom.xml
[INFO] --------------------------------[ pom ]---------------------------------
[INFO]
[INFO] --- clean:3.2.0:clean (default-clean) @ odata-lib ---
[INFO]
[INFO] --- enforcer:3.3.0:enforce (enforce-maven-version) @ odata-lib ---
[INFO]
[INFO] --- enforcer:3.3.0:enforce (enforce-java-version) @ odata-lib ---
[INFO]
[INFO] --- remote-resources:1.5:process (process-resource-bundles) @ odata-lib ---
[INFO]
[INFO] --- remote-resources:1.5:process (default) @ odata-lib ---
[INFO]
[INFO] --- site:3.12.1:attach-descriptor (attach-descriptor) @ odata-lib ---
[INFO] No site descriptor found: nothing to attach.
[INFO]
[INFO] --- failsafe:3.1.2:integration-test (integration-test) @ odata-lib ---
[INFO] No tests to run.
[INFO]
[INFO] --- source:3.3.0:jar-no-fork (attach-sources) @ odata-lib ---
[INFO]
[INFO] --- failsafe:3.1.2:verify (integration-test) @ odata-lib ---
[WARNING] Parameter 'encoding' (user property 'encoding') is deprecated: since of 2.20.1
[INFO]
[INFO] --- checkstyle:3.1.0:check (checkstyle) @ odata-lib ---
[INFO] Starting audit...
Audit done.
[INFO]
[INFO] --- install:3.1.1:install (default-install) @ odata-lib ---
[INFO] Installing <https://ci-builds.apache.org/job/Olingo/job/olingo-odata4-all-profiles/ws/lib/pom.xml> to /home/jenkins/.m2/repository/org/apache/olingo/odata-lib/5.0.1-SNAPSHOT/odata-lib-5.0.1-SNAPSHOT.pom
[INFO]
[INFO] --- apache-rat:0.15:check (rat-check) @ odata-lib ---
[INFO] Enabled default license matchers.
[INFO] Will parse SCM ignores for exclusions...
[INFO] Finished adding exclusions from SCM ignore files.
[INFO] 71 implicit excludes.
[INFO] 26 explicit excludes.
[INFO] 1 resources included
[INFO] Rat check: Summary over all files. Unapproved: 0, unknown: 0, generated: 0, approved: 1 licenses.
[INFO]
[INFO] ----------------< org.apache.olingo:odata-commons-api >-----------------
[INFO] Building odata-commons-api 5.0.1-SNAPSHOT [3/26]
[INFO] from lib/commons-api/pom.xml
[INFO] -------------------------------[ bundle ]-------------------------------
[INFO]
[INFO] --- clean:3.2.0:clean (default-clean) @ odata-commons-api ---
[INFO]
[INFO] --- enforcer:3.3.0:enforce (enforce-maven-version) @ odata-commons-api ---
[INFO] Rule 0: org.apache.maven.enforcer.rules.version.RequireMavenVersion passed
[INFO]
[INFO] --- enforcer:3.3.0:enforce (enforce-java-version) @ odata-commons-api ---
[INFO] Rule 0: org.apache.maven.enforcer.rules.version.RequireJavaVersion passed
[INFO]
[INFO] --- remote-resources:1.5:process (process-resource-bundles) @ odata-commons-api ---
[INFO]
[INFO] --- remote-resources:1.5:process (default) @ odata-commons-api ---
[INFO]
[INFO] --- resources:3.3.1:resources (default-resources) @ odata-commons-api ---
[INFO] skip non existing resourceDirectory <https://ci-builds.apache.org/job/Olingo/job/olingo-odata4-all-profiles/ws/lib/commons-api/src/main/resources>
[INFO] Copying 3 resources from target/maven-shared-archive-resources to target/classes
[INFO] Copying 3 resources from target/maven-shared-archive-resources to target/classes
[INFO]
[INFO] --- compiler:3.11.0:compile (default-compile) @ odata-commons-api ---
[INFO] Changes detected - recompiling the module! :source
[INFO] Compiling 196 source files with javac [debug deprecation release 8] to target/classes
[INFO] ------------------------------------------------------------------------
[INFO] Reactor Summary for Olingo-OData 5.0.1-SNAPSHOT:
[INFO]
[INFO] Olingo-OData ....................................... SUCCESS [ 5.921 s]
[INFO] odata-lib .......................................... SUCCESS [ 0.258 s]
[INFO] odata-commons-api .................................. FAILURE [ 0.691 s]
[INFO] odata-commons-core ................................. SKIPPED
[INFO] odata-client-api ................................... SKIPPED
[INFO] odata-client-core .................................. SKIPPED
[INFO] odata-server-api ................................... SKIPPED
[INFO] odata-server-core .................................. SKIPPED
[INFO] odata-server-core-ext .............................. SKIPPED
[INFO] odata-server-tecsvc ................................ SKIPPED
[INFO] odata-server-test .................................. SKIPPED
[INFO] odata-ext .......................................... SKIPPED
[INFO] odata-client-proxy ................................. SKIPPED
[INFO] pojogen-maven-plugin ............................... SKIPPED
[INFO] odata-client-android ............................... SKIPPED
[INFO] odata-fit .......................................... SKIPPED
[INFO] odata-dist ......................................... SKIPPED
[INFO] Olingo-OData-Client-for-Android .................... SKIPPED
[INFO] Olingo-OData-Client-for-Java ....................... SKIPPED
[INFO] Olingo-OData-Server-for-Java ....................... SKIPPED
[INFO] Olingo-OData-Server-Extension-for-Java ............. SKIPPED
[INFO] Olingo-OData-JavaDoc ............................... SKIPPED
[INFO] odata-samples ...................................... SKIPPED
[INFO] odata-server-sample ................................ SKIPPED
[INFO] odata-server-osgi-sample ........................... SKIPPED
[INFO] odata-client-sample ................................ SKIPPED
[INFO] ------------------------------------------------------------------------
[INFO] BUILD FAILURE
[INFO] ------------------------------------------------------------------------
[INFO] Total time: 9.882 s
[INFO] Finished at: 2023-12-18T02:19:29Z
[INFO] ------------------------------------------------------------------------
[ERROR] Failed to execute goal org.apache.maven.plugins:maven-compiler-plugin:3.11.0:compile (default-compile) on project odata-commons-api: Fatal error compiling: invalid flag: --release -> [Help 1]
[ERROR]
[ERROR] To see the full stack trace of the errors, re-run Maven with the -e switch.
[ERROR] Re-run Maven using the -X switch to enable full debug logging.
[ERROR]
[ERROR] For more information about the errors and possible solutions, please read the following articles:
[ERROR] [Help 1] http://cwiki.apache.org/confluence/display/MAVEN/MojoExecutionException
[ERROR]
[ERROR] After correcting the problems, you can resume the build with the command
[ERROR] mvn <args> -rf :odata-commons-api
Build step 'Invoke top-level Maven targets' marked build as failure
Not sending mail to unregistered user archana.rai@sap.com
Not sending mail to unregistered user github@hugo-hirsch.de
Not sending mail to unregistered user raupppee@emea.roche.com
Not sending mail to unregistered user ramya.vasanth@sap.com
Build failed in Jenkins: Olingo » olingo-odata4-all-profiles #33
Posted by Apache Jenkins Server <je...@builds.apache.org>.
See <https://ci-builds.apache.org/job/Olingo/job/olingo-odata4-all-profiles/33/display/redirect?page=changes>
Changes:
[Michael Bolz] [OLINGO-1603] Set version to 5.0.0-SNAPSHOT
------------------------------------------
[...truncated 711.60 KB...]
[INFO] Installing <https://ci-builds.apache.org/job/Olingo/job/olingo-odata4-all-profiles/ws/samples/osgi/server/target/odata-server-osgi-sample-5.0.0-SNAPSHOT-sources.jar> to /home/jenkins/.m2/repository/org/apache/olingo/odata-server-osgi-sample/5.0.0-SNAPSHOT/odata-server-osgi-sample-5.0.0-SNAPSHOT-sources.jar
[INFO]
[INFO] --- bundle:5.1.9:install (default-install) @ odata-server-osgi-sample ---
[INFO] Installing org/apache/olingo/odata-server-osgi-sample/5.0.0-SNAPSHOT/odata-server-osgi-sample-5.0.0-SNAPSHOT.jar
[INFO] Writing OBR metadata
[INFO]
[INFO] --- apache-rat:0.15:check (rat-check) @ odata-server-osgi-sample ---
[INFO] Enabled default license matchers.
[INFO] Will parse SCM ignores for exclusions...
[INFO] Finished adding exclusions from SCM ignore files.
[INFO] 62 implicit excludes.
[INFO] 26 explicit excludes.
[INFO] 1 resources included
[INFO] Rat check: Summary over all files. Unapproved: 0, unknown: 0, generated: 0, approved: 1 licenses.
[INFO]
[INFO] -----------------< org.apache.olingo:odata-karaf-fit >------------------
[INFO] Building odata-karaf-fit 5.0.0-SNAPSHOT [20/46]
[INFO] from ext/karaf/karaf-fit/pom.xml
[INFO] --------------------------------[ jar ]---------------------------------
[INFO]
[INFO] --- clean:3.2.0:clean (default-clean) @ odata-karaf-fit ---
[INFO]
[INFO] --- enforcer:3.3.0:enforce (enforce-maven-version) @ odata-karaf-fit ---
[INFO]
[INFO] --- enforcer:3.3.0:enforce (enforce-java-version) @ odata-karaf-fit ---
[INFO]
[INFO] --- remote-resources:1.5:process (process-resource-bundles) @ odata-karaf-fit ---
[INFO]
[INFO] --- remote-resources:1.5:process (default) @ odata-karaf-fit ---
[INFO]
[INFO] --- depends:1.2:generate-depends-file (generate-depends-file) @ odata-karaf-fit ---
[INFO] Created: <https://ci-builds.apache.org/job/Olingo/job/olingo-odata4-all-profiles/ws/ext/karaf/karaf-fit/target/classes/META-INF/maven/dependencies.properties>
[INFO]
[INFO] --- resources:3.3.1:resources (default-resources) @ odata-karaf-fit ---
[INFO] skip non existing resourceDirectory <https://ci-builds.apache.org/job/Olingo/job/olingo-odata4-all-profiles/ws/ext/karaf/karaf-fit/src/main/resources>
[INFO] Copying 3 resources from target/maven-shared-archive-resources to target/classes
[INFO] Copying 3 resources from target/maven-shared-archive-resources to target/classes
[INFO]
[INFO] --- compiler:3.11.0:compile (default-compile) @ odata-karaf-fit ---
[INFO] No sources to compile
[INFO]
[INFO] --- resources:3.3.1:testResources (default-testResources) @ odata-karaf-fit ---
[INFO] skip non existing resourceDirectory <https://ci-builds.apache.org/job/Olingo/job/olingo-odata4-all-profiles/ws/ext/karaf/karaf-fit/src/test/resources>
[INFO] Copying 3 resources from target/maven-shared-archive-resources to target/test-classes
[INFO] Copying 3 resources from target/maven-shared-archive-resources to target/test-classes
[INFO]
[INFO] --- compiler:3.11.0:testCompile (default-testCompile) @ odata-karaf-fit ---
[INFO] Changes detected - recompiling the module! :dependency
[INFO] Compiling 3 source files with javac [debug deprecation target 8] to target/test-classes
[INFO]
[INFO] --- surefire:3.1.2:test (default-test) @ odata-karaf-fit ---
[INFO] Using auto detected provider org.apache.maven.surefire.junit4.JUnit4Provider
[INFO]
[INFO] -------------------------------------------------------
[INFO] T E S T S
[INFO] -------------------------------------------------------
[INFO] Running org.apache.olingo.osgi.itests.BundlesTest
[ERROR] Tests run: 1, Failures: 1, Errors: 0, Skipped: 0, Time elapsed: 14.80 s <<< FAILURE! -- in org.apache.olingo.osgi.itests.BundlesTest
[ERROR] org.apache.olingo.osgi.itests.BundlesTest.test -- Time elapsed: 0.374 s <<< FAILURE!
java.lang.AssertionError: Bundle org.apache.olingo.odata-server-api should be installed
at org.junit.Assert.fail(Assert.java:88)
at org.junit.Assert.assertTrue(Assert.java:41)
at org.junit.Assert.assertNotNull(Assert.java:712)
at org.apache.olingo.osgi.itests.OlingoOSGiTestSupport.assertBundleStarted(OlingoOSGiTestSupport.java:122)
at org.apache.olingo.osgi.itests.BundlesTest.test(BundlesTest.java:40)
at sun.reflect.NativeMethodAccessorImpl.invoke0(Native Method)
at sun.reflect.NativeMethodAccessorImpl.invoke(NativeMethodAccessorImpl.java:62)
at sun.reflect.DelegatingMethodAccessorImpl.invoke(DelegatingMethodAccessorImpl.java:43)
at java.lang.reflect.Method.invoke(Method.java:498)
at org.junit.runners.model.FrameworkMethod$1.runReflectiveCall(FrameworkMethod.java:50)
at org.junit.internal.runners.model.ReflectiveCallable.run(ReflectiveCallable.java:12)
at org.junit.runners.model.FrameworkMethod.invokeExplosively(FrameworkMethod.java:47)
at org.junit.internal.runners.statements.InvokeMethod.evaluate(InvokeMethod.java:17)
at org.ops4j.pax.exam.invoker.junit.internal.ContainerTestRunner.runLeafWithRetry(ContainerTestRunner.java:97)
at org.ops4j.pax.exam.invoker.junit.internal.ContainerTestRunner.runChildWithRetry(ContainerTestRunner.java:84)
at org.ops4j.pax.exam.invoker.junit.internal.ContainerTestRunner.runChild(ContainerTestRunner.java:75)
at org.ops4j.pax.exam.invoker.junit.internal.ContainerTestRunner.runChild(ContainerTestRunner.java:43)
at org.junit.runners.ParentRunner$3.run(ParentRunner.java:290)
at org.junit.runners.ParentRunner$1.schedule(ParentRunner.java:71)
at org.junit.runners.ParentRunner.runChildren(ParentRunner.java:288)
at org.junit.runners.ParentRunner.access$000(ParentRunner.java:58)
at org.junit.runners.ParentRunner$2.evaluate(ParentRunner.java:268)
at org.junit.runners.ParentRunner.run(ParentRunner.java:363)
at org.junit.runner.JUnitCore.run(JUnitCore.java:137)
at org.junit.runner.JUnitCore.run(JUnitCore.java:115)
at org.ops4j.pax.exam.invoker.junit.internal.JUnitProbeInvoker.invokeViaJUnit(JUnitProbeInvoker.java:124)
at org.ops4j.pax.exam.invoker.junit.internal.JUnitProbeInvoker.findAndInvoke(JUnitProbeInvoker.java:97)
at org.ops4j.pax.exam.invoker.junit.internal.JUnitProbeInvoker.call(JUnitProbeInvoker.java:73)
at sun.reflect.NativeMethodAccessorImpl.invoke0(Native Method)
at sun.reflect.NativeMethodAccessorImpl.invoke(NativeMethodAccessorImpl.java:62)
at sun.reflect.DelegatingMethodAccessorImpl.invoke(DelegatingMethodAccessorImpl.java:43)
at java.lang.reflect.Method.invoke(Method.java:498)
at org.ops4j.pax.exam.rbc.internal.RemoteBundleContextImpl.remoteCall(RemoteBundleContextImpl.java:85)
at sun.reflect.NativeMethodAccessorImpl.invoke0(Native Method)
at sun.reflect.NativeMethodAccessorImpl.invoke(NativeMethodAccessorImpl.java:62)
at sun.reflect.DelegatingMethodAccessorImpl.invoke(DelegatingMethodAccessorImpl.java:43)
at java.lang.reflect.Method.invoke(Method.java:498)
at sun.rmi.server.UnicastServerRef.dispatch(UnicastServerRef.java:357)
at sun.rmi.transport.Transport$1.run(Transport.java:200)
at sun.rmi.transport.Transport$1.run(Transport.java:197)
at java.security.AccessController.doPrivileged(Native Method)
at sun.rmi.transport.Transport.serviceCall(Transport.java:196)
at sun.rmi.transport.tcp.TCPTransport.handleMessages(TCPTransport.java:573)
at sun.rmi.transport.tcp.TCPTransport$ConnectionHandler.run0(TCPTransport.java:834)
at sun.rmi.transport.tcp.TCPTransport$ConnectionHandler.lambda$run$0(TCPTransport.java:688)
at java.security.AccessController.doPrivileged(Native Method)
at sun.rmi.transport.tcp.TCPTransport$ConnectionHandler.run(TCPTransport.java:687)
at java.util.concurrent.ThreadPoolExecutor.runWorker(ThreadPoolExecutor.java:1149)
at java.util.concurrent.ThreadPoolExecutor$Worker.run(ThreadPoolExecutor.java:624)
at java.lang.Thread.run(Thread.java:750)
[INFO] Running org.apache.olingo.osgi.itests.server.CarServiceTest
[ERROR] Tests run: 1, Failures: 1, Errors: 0, Skipped: 0, Time elapsed: 10.69 s <<< FAILURE! -- in org.apache.olingo.osgi.itests.server.CarServiceTest
[ERROR] org.apache.olingo.osgi.itests.server.CarServiceTest.testServiceStarted -- Time elapsed: 10.69 s <<< FAILURE!
java.lang.AssertionError: Bundle org.apache.olingo.odata-server-osgi-sample should be installed
at org.junit.Assert.fail(Assert.java:88)
at org.junit.Assert.assertTrue(Assert.java:41)
at org.junit.Assert.assertNotNull(Assert.java:712)
at org.apache.olingo.osgi.itests.OlingoOSGiTestSupport.assertBundleStarted(OlingoOSGiTestSupport.java:122)
at org.apache.olingo.osgi.itests.server.CarServiceTest.testServiceStarted(CarServiceTest.java:52)
at sun.reflect.NativeMethodAccessorImpl.invoke0(Native Method)
at sun.reflect.NativeMethodAccessorImpl.invoke(NativeMethodAccessorImpl.java:62)
at sun.reflect.DelegatingMethodAccessorImpl.invoke(DelegatingMethodAccessorImpl.java:43)
at java.lang.reflect.Method.invoke(Method.java:498)
at org.junit.runners.model.FrameworkMethod$1.runReflectiveCall(FrameworkMethod.java:50)
at org.junit.internal.runners.model.ReflectiveCallable.run(ReflectiveCallable.java:12)
at org.junit.runners.model.FrameworkMethod.invokeExplosively(FrameworkMethod.java:47)
at org.junit.internal.runners.statements.InvokeMethod.evaluate(InvokeMethod.java:17)
at org.ops4j.pax.exam.invoker.junit.internal.ContainerTestRunner.runLeafWithRetry(ContainerTestRunner.java:97)
at org.ops4j.pax.exam.invoker.junit.internal.ContainerTestRunner.runChildWithRetry(ContainerTestRunner.java:84)
at org.ops4j.pax.exam.invoker.junit.internal.ContainerTestRunner.runChild(ContainerTestRunner.java:75)
at org.ops4j.pax.exam.invoker.junit.internal.ContainerTestRunner.runChild(ContainerTestRunner.java:43)
at org.junit.runners.ParentRunner$3.run(ParentRunner.java:290)
at org.junit.runners.ParentRunner$1.schedule(ParentRunner.java:71)
at org.junit.runners.ParentRunner.runChildren(ParentRunner.java:288)
at org.junit.runners.ParentRunner.access$000(ParentRunner.java:58)
at org.junit.runners.ParentRunner$2.evaluate(ParentRunner.java:268)
at org.junit.runners.ParentRunner.run(ParentRunner.java:363)
at org.junit.runner.JUnitCore.run(JUnitCore.java:137)
at org.junit.runner.JUnitCore.run(JUnitCore.java:115)
at org.ops4j.pax.exam.invoker.junit.internal.JUnitProbeInvoker.invokeViaJUnit(JUnitProbeInvoker.java:124)
at org.ops4j.pax.exam.invoker.junit.internal.JUnitProbeInvoker.findAndInvoke(JUnitProbeInvoker.java:97)
at org.ops4j.pax.exam.invoker.junit.internal.JUnitProbeInvoker.call(JUnitProbeInvoker.java:73)
at sun.reflect.NativeMethodAccessorImpl.invoke0(Native Method)
at sun.reflect.NativeMethodAccessorImpl.invoke(NativeMethodAccessorImpl.java:62)
at sun.reflect.DelegatingMethodAccessorImpl.invoke(DelegatingMethodAccessorImpl.java:43)
at java.lang.reflect.Method.invoke(Method.java:498)
at org.ops4j.pax.exam.rbc.internal.RemoteBundleContextImpl.remoteCall(RemoteBundleContextImpl.java:85)
at sun.reflect.NativeMethodAccessorImpl.invoke0(Native Method)
at sun.reflect.NativeMethodAccessorImpl.invoke(NativeMethodAccessorImpl.java:62)
at sun.reflect.DelegatingMethodAccessorImpl.invoke(DelegatingMethodAccessorImpl.java:43)
at java.lang.reflect.Method.invoke(Method.java:498)
at sun.rmi.server.UnicastServerRef.dispatch(UnicastServerRef.java:357)
at sun.rmi.transport.Transport$1.run(Transport.java:200)
at sun.rmi.transport.Transport$1.run(Transport.java:197)
at java.security.AccessController.doPrivileged(Native Method)
at sun.rmi.transport.Transport.serviceCall(Transport.java:196)
at sun.rmi.transport.tcp.TCPTransport.handleMessages(TCPTransport.java:573)
at sun.rmi.transport.tcp.TCPTransport$ConnectionHandler.run0(TCPTransport.java:834)
at sun.rmi.transport.tcp.TCPTransport$ConnectionHandler.lambda$run$0(TCPTransport.java:688)
at java.security.AccessController.doPrivileged(Native Method)
at sun.rmi.transport.tcp.TCPTransport$ConnectionHandler.run(TCPTransport.java:687)
at java.util.concurrent.ThreadPoolExecutor.runWorker(ThreadPoolExecutor.java:1149)
at java.util.concurrent.ThreadPoolExecutor$Worker.run(ThreadPoolExecutor.java:624)
at java.lang.Thread.run(Thread.java:750)
[ERROR] Surefire is going to kill self fork JVM. The exit has elapsed 30 seconds after System.exit(0).
[INFO]
[INFO] Results:
[INFO]
[ERROR] Failures:
[ERROR] BundlesTest.test:40->OlingoOSGiTestSupport.assertBundleStarted:122 Bundle org.apache.olingo.odata-server-api should be installed
[ERROR] CarServiceTest.testServiceStarted:52->OlingoOSGiTestSupport.assertBundleStarted:122 Bundle org.apache.olingo.odata-server-osgi-sample should be installed
[INFO]
[ERROR] Tests run: 2, Failures: 2, Errors: 0, Skipped: 0
[INFO]
[INFO] ------------------------------------------------------------------------
[INFO] Reactor Summary for Olingo-OData 5.0.0-SNAPSHOT:
[INFO]
[INFO] Olingo-OData ....................................... SUCCESS [ 10.308 s]
[INFO] odata-lib .......................................... SUCCESS [ 0.675 s]
[INFO] odata-commons-api .................................. SUCCESS [ 21.354 s]
[INFO] odata-commons-core ................................. SUCCESS [ 13.429 s]
[INFO] odata-client-api ................................... SUCCESS [ 5.179 s]
[INFO] odata-client-core .................................. SUCCESS [ 20.920 s]
[INFO] odata-server-api ................................... SUCCESS [ 6.452 s]
[INFO] odata-server-core .................................. SUCCESS [ 17.460 s]
[INFO] odata-server-core-ext .............................. SUCCESS [ 13.128 s]
[INFO] odata-server-tecsvc ................................ SUCCESS [ 9.356 s]
[INFO] odata-server-test .................................. SUCCESS [ 20.913 s]
[INFO] odata-ext .......................................... SUCCESS [ 0.235 s]
[INFO] odata-client-proxy ................................. SUCCESS [ 2.790 s]
[INFO] pojogen-maven-plugin ............................... SUCCESS [ 42.255 s]
[INFO] odata-client-android ............................... SUCCESS [ 5.680 s]
[INFO] odata-karaf ........................................ SUCCESS [ 0.218 s]
[INFO] odata-karaf-features ............................... SUCCESS [ 0.261 s]
[INFO] odata-samples ...................................... SUCCESS [ 0.187 s]
[INFO] odata-server-osgi-sample ........................... SUCCESS [ 4.705 s]
[INFO] odata-karaf-fit .................................... FAILURE [01:00 min]
[INFO] odata-fit .......................................... SKIPPED
[INFO] odata-dist ......................................... SKIPPED
[INFO] Olingo-OData-Client-for-Android .................... SKIPPED
[INFO] Olingo-OData-Client-for-Java ....................... SKIPPED
[INFO] Olingo-OData-Server-for-Java ....................... SKIPPED
[INFO] Olingo-OData-Server-Extension-for-Java ............. SKIPPED
[INFO] Olingo-OData-JavaDoc ............................... SKIPPED
[INFO] odata-server-sample ................................ SKIPPED
[INFO] odata-client-sample ................................ SKIPPED
[INFO] DemoService Webapp ................................. SKIPPED
[INFO] DemoService-Read-Webapp ............................ SKIPPED
[INFO] DemoService-ReadEp-Webapp .......................... SKIPPED
[INFO] DemoService-Write-Webapp ........................... SKIPPED
[INFO] DemoService-Navigation-Webapp ...................... SKIPPED
[INFO] DemoService-QueryOptions-TCS-Webapp ................ SKIPPED
[INFO] DemoService-QueryOptions-ES-Webapp ................. SKIPPED
[INFO] DemoService-QueryOptions-O-Webapp .................. SKIPPED
[INFO] DemoService-QueryOptions-F Webapp .................. SKIPPED
[INFO] DemoService-Action-Webapp .......................... SKIPPED
[INFO] DemoService-ActionPreparation-Webapp ............... SKIPPED
[INFO] DemoService-Media-Webapp ........................... SKIPPED
[INFO] DemoService-Batch-Webapp ........................... SKIPPED
[INFO] DemoService-DeepInsert-Webapp ...................... SKIPPED
[INFO] DemoService-DeepInsertPreparation-Webapp ........... SKIPPED
[INFO] DemoService-Streaming-Webapp ....................... SKIPPED
[INFO] odata-tutorials .................................... SKIPPED
[INFO] ------------------------------------------------------------------------
[INFO] BUILD FAILURE
[INFO] ------------------------------------------------------------------------
[INFO] Total time: 04:24 min
[INFO] Finished at: 2023-11-07T02:28:51Z
[INFO] ------------------------------------------------------------------------
[ERROR] Failed to execute goal org.apache.maven.plugins:maven-surefire-plugin:3.1.2:test (default-test) on project odata-karaf-fit: There are test failures.
[ERROR]
[ERROR] Please refer to <https://ci-builds.apache.org/job/Olingo/job/olingo-odata4-all-profiles/ws/ext/karaf/karaf-fit/target/surefire-reports> for the individual test results.
[ERROR] Please refer to dump files (if any exist) [date].dump, [date]-jvmRun[N].dump and [date].dumpstream.
[ERROR] -> [Help 1]
[ERROR]
[ERROR] To see the full stack trace of the errors, re-run Maven with the -e switch.
[ERROR] Re-run Maven using the -X switch to enable full debug logging.
[ERROR]
[ERROR] For more information about the errors and possible solutions, please read the following articles:
[ERROR] [Help 1] http://cwiki.apache.org/confluence/display/MAVEN/MojoFailureException
[ERROR]
[ERROR] After correcting the problems, you can resume the build with the command
[ERROR] mvn <args> -rf :odata-karaf-fit
Build step 'Invoke top-level Maven targets' marked build as failure
Not sending mail to unregistered user archana.rai@sap.com
Not sending mail to unregistered user github@hugo-hirsch.de
Not sending mail to unregistered user ramya.vasanth@sap.com