You are viewing a plain text version of this content. The canonical link for it is here.
Posted to dev@zookeeper.apache.org by Apache Jenkins Server <je...@builds.apache.org> on 2016/05/22 23:29:19 UTC
ZooKeeper-trunk - Build # 2933 - Failure
See https://builds.apache.org/job/ZooKeeper-trunk/2933/
###################################################################################
########################## LAST 60 LINES OF THE CONSOLE ###########################
[...truncated 382225 lines...]
[exec] Log Message Received: [2016-05-22 23:27:10,400:13261(0x2b44e9b9b540):ZOO_INFO@log_env@1048: Client environment:user.name=jenkins]
[exec] Log Message Received: [2016-05-22 23:27:10,400:13261(0x2b44e9b9b540):ZOO_INFO@log_env@1056: Client environment:user.home=/home/jenkins]
[exec] Log Message Received: [2016-05-22 23:27:10,400:13261(0x2b44e9b9b540):ZOO_INFO@log_env@1068: Client environment:user.dir=/home/jenkins/jenkins-slave/workspace/ZooKeeper-trunk/trunk/build/test/test-cppunit]
[exec] Log Message Received: [2016-05-22 23:27:10,400:13261(0x2b44e9b9b540):ZOO_INFO@zookeeper_init_internal@1111: Initiating client connection, host=127.0.0.1:22181 sessionTimeout=10000 watcher=0x45d2a0 sessionId=0 sessionPasswd=<null> context=0x7fffa17aec60 flags=0]
[exec] Log Message Received: [2016-05-22 23:27:10,402:13261(0x2b44ec22a700):ZOO_INFO@check_events@2357: initiated connection to server [127.0.0.1:22181]]
[exec] Log Message Received: [2016-05-22 23:27:10,405:13261(0x2b44ec22a700):ZOO_INFO@check_events@2409: session establishment complete on server [127.0.0.1:22181], sessionId=0x1017c6ce8da000f, negotiated timeout=10000 ]
[exec] : elapsed 1002 : OK
[exec] Zookeeper_simpleSystem::testAsyncWatcherAutoReset ZooKeeper server started : elapsed 10405 : OK
[exec] Zookeeper_simpleSystem::testDeserializeString : elapsed 0 : OK
[exec] Zookeeper_simpleSystem::testFirstServerDown : elapsed 1001 : OK
[exec] Zookeeper_simpleSystem::testNullData : elapsed 1024 : OK
[exec] Zookeeper_simpleSystem::testIPV6 : elapsed 1006 : OK
[exec] Zookeeper_simpleSystem::testCreate : elapsed 1007 : OK
[exec] Zookeeper_simpleSystem::testPath : elapsed 1010 : OK
[exec] Zookeeper_simpleSystem::testPathValidation : elapsed 1029 : OK
[exec] Zookeeper_simpleSystem::testPing : elapsed 17154 : OK
[exec] Zookeeper_simpleSystem::testAcl : elapsed 1009 : OK
[exec] Zookeeper_simpleSystem::testChroot : elapsed 4025 : OK
[exec] Zookeeper_simpleSystem::testAuth ZooKeeper server started ZooKeeper server started : elapsed 30630 : OK
[exec] Zookeeper_simpleSystem::testHangingClient : elapsed 1029 : OK
[exec] Zookeeper_simpleSystem::testWatcherAutoResetWithGlobal ZooKeeper server started ZooKeeper server started ZooKeeper server started : elapsed 15076 : OK
[exec] Zookeeper_simpleSystem::testWatcherAutoResetWithLocal ZooKeeper server started ZooKeeper server started ZooKeeper server started : elapsed 15721 : OK
[exec] Zookeeper_simpleSystem::testGetChildren2 : elapsed 1037 : OK
[exec] Zookeeper_simpleSystem::testLastZxid : elapsed 4512 : OK
[exec] Zookeeper_simpleSystem::testRemoveWatchers ZooKeeper server started : elapsed 4409 : OK
[exec] Zookeeper_readOnly::testReadOnly : elapsed 4089 : OK
[exec] /home/jenkins/jenkins-slave/workspace/ZooKeeper-trunk/trunk/src/c/tests/TestReconfig.cc:183: Assertion: equality assertion failed [Expected: 1, Actual : 0]
[exec] Failures !!!
[exec] Run: 72 Failure total: 1 Failures: 1 Errors: 0
[exec] FAIL: zktest-mt
[exec] ==========================================
[exec] 1 of 2 tests failed
[exec] Please report to user@zookeeper.apache.org
[exec] ==========================================
[exec] make[1]: Leaving directory `/home/jenkins/jenkins-slave/workspace/ZooKeeper-trunk/trunk/build/test/test-cppunit'
[exec] make[1]: *** [check-TESTS] Error 1
[exec] make: *** [check-am] Error 2
BUILD FAILED
/home/jenkins/jenkins-slave/workspace/ZooKeeper-trunk/trunk/build.xml:1322: The following error occurred while executing this line:
/home/jenkins/jenkins-slave/workspace/ZooKeeper-trunk/trunk/build.xml:1282: The following error occurred while executing this line:
/home/jenkins/jenkins-slave/workspace/ZooKeeper-trunk/trunk/build.xml:1292: exec returned: 2
Total time: 11 minutes 42 seconds
Build step 'Execute shell' marked build as failure
[FINDBUGS] Skipping publisher since build result is FAILURE
[WARNINGS] Skipping publisher since build result is FAILURE
Archiving artifacts
Setting LATEST1_7_HOME=/home/jenkins/jenkins-slave/tools/hudson.model.JDK/latest1.7
Recording fingerprints
Setting LATEST1_7_HOME=/home/jenkins/jenkins-slave/tools/hudson.model.JDK/latest1.7
Recording test results
Setting LATEST1_7_HOME=/home/jenkins/jenkins-slave/tools/hudson.model.JDK/latest1.7
Publishing Javadoc
Setting LATEST1_7_HOME=/home/jenkins/jenkins-slave/tools/hudson.model.JDK/latest1.7
Email was triggered for: Failure - Any
Sending email for trigger: Failure - Any
Setting LATEST1_7_HOME=/home/jenkins/jenkins-slave/tools/hudson.model.JDK/latest1.7
Setting LATEST1_7_HOME=/home/jenkins/jenkins-slave/tools/hudson.model.JDK/latest1.7
###################################################################################
############################## FAILED TESTS (if any) ##############################
All tests passed