You are viewing a plain text version of this content. The canonical link for it is here.
Posted to notifications@ctakes.apache.org by Apache Jenkins Server <je...@builds.apache.org> on 2020/01/15 19:29:32 UTC

Build failed in Jenkins: ctakes-trunk-compiletest #1262

See <https://builds.apache.org/job/ctakes-trunk-compiletest/1262/display/redirect?page=changes>

Changes:

[tmill] Pulled out a class from an eval script so it can be used for relation extractors in other modules.


------------------------------------------
[...truncated 397.85 KB...]
AU        ctakes-constituency-parser-res/src/main/resources/org/apache/ctakes/constituency/parser/models/thyme.bin
AU        ctakes-constituency-parser-res/src/main/resources/org/apache/ctakes/constituency/parser/models/sharpacq-3.1.bin
AU        ctakes-constituency-parser-res/src/main/resources/org/apache/ctakes/constituency/parser/models/sharpacq-1.5.bin
A         ctakes-constituency-parser-res/src/test
A         ctakes-constituency-parser-res/LICENSE
A         ctakes-context-tokenizer
A         ctakes-context-tokenizer/pom.xml
A         ctakes-context-tokenizer/src
A         ctakes-context-tokenizer/src/main
A         ctakes-context-tokenizer/src/main/java
A         ctakes-context-tokenizer/src/main/java/org
A         ctakes-context-tokenizer/src/main/java/org/apache
A         ctakes-context-tokenizer/src/main/java/org/apache/ctakes
A         ctakes-context-tokenizer/src/main/java/org/apache/ctakes/contexttokenizer
A         ctakes-context-tokenizer/src/main/java/org/apache/ctakes/contexttokenizer/ae
A         ctakes-context-tokenizer/src/main/java/org/apache/ctakes/contexttokenizer/ae/ContextDependentTokenizerAnnotator.java
A         ctakes-context-tokenizer/src/main/java/org/apache/ctakes/context
A         ctakes-context-tokenizer/src/test
A         ctakes-context-tokenizer/src/test/java
A         ctakes-context-tokenizer/src/test/java/org
A         ctakes-context-tokenizer/src/test/java/org/apache
A         ctakes-context-tokenizer/src/test/java/org/apache/ctakes
A         ctakes-context-tokenizer/src/test/java/org/apache/ctakes/contexttokenizer
A         ctakes-context-tokenizer/src/test/java/org/apache/ctakes/contexttokenizer/ae
AU        ctakes-context-tokenizer/src/test/java/org/apache/ctakes/contexttokenizer/ae/TestContextDependentTokenizerAnnotator.java
A         ctakes-context-tokenizer/desc
A         ctakes-context-tokenizer/desc/analysis_engine
A         ctakes-context-tokenizer/desc/analysis_engine/AggregateAE.xml
A         ctakes-context-tokenizer/desc/analysis_engine/TestTAE.xml
A         ctakes-context-tokenizer/desc/analysis_engine/ContextDependentTokenizerAnnotator.xml
A         ctakes-context-tokenizer/LICENSE
A         ctakes-context-tokenizer/data
A         ctakes-context-tokenizer/data/test
A         ctakes-context-tokenizer/data/test/output
A         ctakes-context-tokenizer/resources
A         ctakes-context-tokenizer/resources/launch
A         ctakes-context-tokenizer/README
A         ctakes-drug-ner-res
A         ctakes-drug-ner-res/pom.xml
A         ctakes-drug-ner-res/src
A         ctakes-drug-ner-res/src/main
A         ctakes-drug-ner-res/src/main/resources
A         ctakes-drug-ner-res/src/main/resources/org
A         ctakes-drug-ner-res/src/main/resources/org/apache
A         ctakes-drug-ner-res/src/main/resources/org/apache/ctakes
A         ctakes-drug-ner-res/src/main/resources/org/apache/ctakes/drugner
A         ctakes-drug-ner-res/src/main/resources/org/apache/ctakes/drugner/types
A         ctakes-drug-ner-res/src/main/resources/org/apache/ctakes/drugner/types/TypeSystem.xml
A         ctakes-drug-ner-res/src/main/resources/org/apache/ctakes/drugner/lookup
A         ctakes-drug-ner-res/src/main/resources/org/apache/ctakes/drugner/lookup/LookupDesc_DrugNER.xml
A         ctakes-drug-ner-res/src/main/resources/org/apache/ctakes/drugner/tokenizer
A         ctakes-drug-ner-res/src/main/resources/org/apache/ctakes/drugner/tokenizer/hyphen_freq.txt
A         ctakes-drug-ner-res/src/test
A         ctakes-drug-ner-res/LICENSE
A         ctakes-ne-contexts-res
A         ctakes-ne-contexts-res/pom.xml
A         ctakes-ne-contexts-res/src
A         ctakes-ne-contexts-res/src/main
A         ctakes-ne-contexts-res/src/main/resources
A         ctakes-ne-contexts-res/src/main/resources/org
A         ctakes-ne-contexts-res/src/main/resources/org/apache
A         ctakes-ne-contexts-res/src/main/resources/org/apache/ctakes
A         ctakes-ne-contexts-res/src/main/resources/org/apache/ctakes/necontexts
A         ctakes-ne-contexts-res/src/main/resources/org/apache/ctakes/necontexts/pipeline
A         ctakes-ne-contexts-res/src/main/resources/org/apache/ctakes/necontexts/pipeline/NeContextsSubPipe.piper
A         ctakes-ne-contexts-res/src/main/resources/org/apache/ctakes/necontexts/desc
A         ctakes-ne-contexts-res/src/main/resources/org/apache/ctakes/necontexts/desc/NegationAnnotator.xml
A         ctakes-ne-contexts-res/src/test
A         ctakes-ne-contexts-res/LICENSE
A         ctakes-pos-tagger-res
A         ctakes-pos-tagger-res/pom.xml
A         ctakes-pos-tagger-res/src
A         ctakes-pos-tagger-res/src/main
A         ctakes-pos-tagger-res/src/main/resources
A         ctakes-pos-tagger-res/src/main/resources/org
A         ctakes-pos-tagger-res/src/main/resources/org/apache
A         ctakes-pos-tagger-res/src/main/resources/org/apache/ctakes
A         ctakes-pos-tagger-res/src/main/resources/org/apache/ctakes/postagger
A         ctakes-pos-tagger-res/src/main/resources/org/apache/ctakes/postagger/models
A         ctakes-pos-tagger-res/src/main/resources/org/apache/ctakes/postagger/models/clearnlp
AU        ctakes-pos-tagger-res/src/main/resources/org/apache/ctakes/postagger/models/clearnlp/mayo-en-pos-1.3.0.jar
AU        ctakes-pos-tagger-res/src/main/resources/org/apache/ctakes/postagger/models/mayo-pos.zip
A         ctakes-pos-tagger-res/src/main/resources/org/apache/ctakes/postagger/models/README
A         ctakes-pos-tagger-res/src/test
A         ctakes-pos-tagger-res/LICENSE
A         ctakes-side-effect-res
A         ctakes-side-effect-res/pom.xml
A         ctakes-side-effect-res/src
A         ctakes-side-effect-res/src/main
A         ctakes-side-effect-res/src/main/resources
A         ctakes-side-effect-res/src/main/resources/org
A         ctakes-side-effect-res/src/main/resources/org/apache
A         ctakes-side-effect-res/src/main/resources/org/apache/ctakes
A         ctakes-side-effect-res/src/main/resources/org/apache/ctakes/sideeffect
A         ctakes-side-effect-res/src/main/resources/org/apache/ctakes/sideeffect/lookup
A         ctakes-side-effect-res/src/main/resources/org/apache/ctakes/sideeffect/lookup/LookupDesc_sideEffect.xml
A         ctakes-side-effect-res/src/main/resources/org/apache/ctakes/sideeffect/lookup/LookupDesc_sideEffectUMLS.xml
A         ctakes-side-effect-res/src/main/resources/org/apache/ctakes/sideeffect/lookup/sideEffect_dictionary.txt
A         ctakes-side-effect-res/src/main/resources/org/apache/ctakes/sideeffect/lookup/additionalNE_dictionary.csv
A         ctakes-side-effect-res/src/main/resources/org/apache/ctakes/sideeffect/classifier
A         ctakes-side-effect-res/src/main/resources/org/apache/ctakes/sideeffect/classifier/libsvm_model_onWholeSet
A         ctakes-side-effect-res/src/main/resources/org/apache/ctakes/sideeffect/data
A         ctakes-side-effect-res/src/main/resources/org/apache/ctakes/sideeffect/data/sentenceLevelMetaKeywords.txt
A         ctakes-side-effect-res/src/test
A         ctakes-side-effect-res/LICENSE
A         ctakes-smoking-status-res
A         ctakes-smoking-status-res/pom.xml
A         ctakes-smoking-status-res/src
A         ctakes-smoking-status-res/src/main
A         ctakes-smoking-status-res/src/main/resources
A         ctakes-smoking-status-res/src/main/resources/org
A         ctakes-smoking-status-res/src/main/resources/org/apache
A         ctakes-smoking-status-res/src/main/resources/org/apache/ctakes
A         ctakes-smoking-status-res/src/main/resources/org/apache/ctakes/smokingstatus
A         ctakes-smoking-status-res/src/main/resources/org/apache/ctakes/smokingstatus/analysis_engine
A         ctakes-smoking-status-res/src/main/resources/org/apache/ctakes/smokingstatus/analysis_engine/KuRuleBasedClassifierAnnotator.xml
A         ctakes-smoking-status-res/src/main/resources/org/apache/ctakes/smokingstatus/analysis_engine/ProductionPostSentenceAggregate_step2_libsvm.xml
A         ctakes-smoking-status-res/src/main/resources/org/apache/ctakes/smokingstatus/analysis_engine/SmokingStatusDictionaryLookupAnnotator.xml
A         ctakes-smoking-status-res/src/main/resources/org/apache/ctakes/smokingstatus/analysis_engine/ArtificialSentenceAnnotator.xml
A         ctakes-smoking-status-res/src/main/resources/org/apache/ctakes/smokingstatus/analysis_engine/ProductionPostSentenceAggregate_step1.xml
A         ctakes-smoking-status-res/src/main/resources/org/apache/ctakes/smokingstatus/analysis_engine/SentenceAdjuster.xml
A         ctakes-smoking-status-res/src/main/resources/org/apache/ctakes/smokingstatus/analysis_engine/PcsClassifierAnnotator_libsvm.xml
A         ctakes-smoking-status-res/src/main/resources/org/apache/ctakes/smokingstatus/data
A         ctakes-smoking-status-res/src/main/resources/org/apache/ctakes/smokingstatus/data/KU
A         ctakes-smoking-status-res/src/main/resources/org/apache/ctakes/smokingstatus/data/KU/keywords.txt
A         ctakes-smoking-status-res/src/main/resources/org/apache/ctakes/smokingstatus/data/KU/unknown_words.txt
A         ctakes-smoking-status-res/src/main/resources/org/apache/ctakes/smokingstatus/data/nonsmoker.dictionary
A         ctakes-smoking-status-res/src/main/resources/org/apache/ctakes/smokingstatus/data/context
A         ctakes-smoking-status-res/src/main/resources/org/apache/ctakes/smokingstatus/data/context/negationContradictionWords.txt
A         ctakes-smoking-status-res/src/main/resources/org/apache/ctakes/smokingstatus/data/context/boundaryData.txt
A         ctakes-smoking-status-res/src/main/resources/org/apache/ctakes/smokingstatus/data/smoker.dictionary
A         ctakes-smoking-status-res/src/main/resources/org/apache/ctakes/smokingstatus/data/PCS
A         ctakes-smoking-status-res/src/main/resources/org/apache/ctakes/smokingstatus/data/PCS/stopwords_PCS.txt
A         ctakes-smoking-status-res/src/main/resources/org/apache/ctakes/smokingstatus/data/PCS/pcs_libsvm-2.91.model
A         ctakes-smoking-status-res/src/main/resources/org/apache/ctakes/smokingstatus/data/PCS/keywords_PCS.txt
A         ctakes-smoking-status-res/src/main/resources/org/apache/ctakes/smokingstatus/data/SmokingStatusLookupConfig.xml
A         ctakes-smoking-status-res/src/test
A         ctakes-smoking-status-res/LICENSE
A         ctakes-template-filler
AU        ctakes-template-filler/pom.xml
A         ctakes-template-filler/desc
A         ctakes-template-filler/desc/analysis_engine
AU        ctakes-template-filler/desc/analysis_engine/AggregateTemplateFiller.xml
AU        ctakes-template-filler/desc/analysis_engine/RelationExtractorAggregateWithoutOrangeBook.xml
AU        ctakes-template-filler/desc/analysis_engine/TemplateFillerAnnotator.xml
A         ctakes-template-filler/src
A         ctakes-template-filler/src/main
A         ctakes-template-filler/src/main/java
A         ctakes-template-filler/src/main/java/org
A         ctakes-template-filler/src/main/java/org/apache
A         ctakes-template-filler/src/main/java/org/apache/ctakes
A         ctakes-template-filler/src/main/java/org/apache/ctakes/template
A         ctakes-template-filler/src/main/java/org/apache/ctakes/template/filler
A         ctakes-template-filler/src/main/java/org/apache/ctakes/template/filler/ae
AU        ctakes-template-filler/src/main/java/org/apache/ctakes/template/filler/ae/TemplateFillerAnnotator.java
A         ctakes-template-filler/src/main/resources
A         ctakes-template-filler/src/test
A         ctakes-template-filler/src/test/java
A         ctakes-template-filler/src/test/resources
A         README
AU        KEYS
A         NOTICE
A         LICENSE
 U        .
At revision 1872836

Parsing POMs
Downloaded artifact https://repo.maven.apache.org/maven2/org/cleartk/cleartk/2.0.0/cleartk-2.0.0.pom
Modules changed, recalculating dependency graph
Established TCP socket on 36087
maven3-agent.jar already up to date
maven3-interceptor.jar already up to date
maven3-interceptor-commons.jar already up to date
[ctakes-trunk-compiletest] $ /home/jenkins/tools/java/latest1.8/bin/java -Xmx4g -Xms256m -XX:MaxPermSize=512m -cp /home/jenkins/jenkins-slave/maven3-agent.jar:/home/jenkins/tools/maven/apache-maven-3.0.5/boot/plexus-classworlds-2.4.jar org.jvnet.hudson.maven3.agent.Maven3Main /home/jenkins/tools/maven/apache-maven-3.0.5 /home/jenkins/jenkins-slave/remoting.jar /home/jenkins/jenkins-slave/maven3-interceptor.jar /home/jenkins/jenkins-slave/maven3-interceptor-commons.jar 36087
Java HotSpot(TM) 64-Bit Server VM warning: ignoring option MaxPermSize=512m; support was removed in 8.0
<===[JENKINS REMOTING CAPACITY]===>   channel started
Executing Maven:  -B -f <https://builds.apache.org/job/ctakes-trunk-compiletest/ws/pom.xml> -Dmaven.repo.local=/home/jenkins/jenkins-slave/maven-repositories/0 clean compile test
[INFO] Scanning for projects...
Downloading: http://repo.maven.apache.org/maven2/org/apache/maven/wagon/wagon-http-lightweight/2.2/wagon-http-lightweight-2.2.pom
[ERROR] The build could not read 1 project -> [Help 1]
[ERROR]   
[ERROR]   The project org.apache.ctakes:ctakes-ytex:4.0.1-SNAPSHOT (<https://builds.apache.org/job/ctakes-trunk-compiletest/ws/ctakes-ytex/pom.xml)> has 1 error
[ERROR]     Unresolveable build extension: Plugin org.apache.maven.wagon:wagon-http-lightweight:2.2 or one of its dependencies could not be resolved: Failed to collect dependencies for org.apache.maven.wagon:wagon-http-lightweight:jar:2.2 (): Failed to read artifact descriptor for org.apache.maven.wagon:wagon-http-lightweight:jar:2.2: Could not transfer artifact org.apache.maven.wagon:wagon-http-lightweight:pom:2.2 from/to central (http://repo.maven.apache.org/maven2): Failed to transfer file: http://repo.maven.apache.org/maven2/org/apache/maven/wagon/wagon-http-lightweight/2.2/wagon-http-lightweight-2.2.pom. Return code is: 501 , ReasonPhrase:HTTPS Required. -> [Help 2]
[ERROR] 
[ERROR] To see the full stack trace of the errors, re-run Maven with the -e switch.
[ERROR] Re-run Maven using the -X switch to enable full debug logging.
[ERROR] 
[ERROR] For more information about the errors and possible solutions, please read the following articles:
[ERROR] [Help 1] http://cwiki.apache.org/confluence/display/MAVEN/ProjectBuildingException
[ERROR] [Help 2] http://cwiki.apache.org/confluence/display/MAVEN/PluginResolutionException
No mail will be sent out, as 'ctakes-trunk-compiletest » Apache cTAKES fhir support #1262' does not have a result yet. Please make sure you set a proper result in case of pipeline/build scripts.
No mail will be sent out, as 'ctakes-trunk-compiletest » Apache cTAKES ctakes-clinical-pipeline #1262' does not have a result yet. Please make sure you set a proper result in case of pipeline/build scripts.
No mail will be sent out, as 'ctakes-trunk-compiletest » Apache cTAKES common type system #1262' does not have a result yet. Please make sure you set a proper result in case of pipeline/build scripts.
No mail will be sent out, as 'ctakes-trunk-compiletest » Apache cTAKES dictionary lookup #1262' does not have a result yet. Please make sure you set a proper result in case of pipeline/build scripts.
No mail will be sent out, as 'ctakes-trunk-compiletest » Apache cTAKES Constituency Parser #1262' does not have a result yet. Please make sure you set a proper result in case of pipeline/build scripts.
No mail will be sent out, as 'ctakes-trunk-compiletest » ctakes-examples-res #1262' does not have a result yet. Please make sure you set a proper result in case of pipeline/build scripts.
No mail will be sent out, as 'ctakes-trunk-compiletest » Apache cTAKES Temporal Information Extraction #1262' does not have a result yet. Please make sure you set a proper result in case of pipeline/build scripts.
No mail will be sent out, as 'ctakes-trunk-compiletest » Apache cTAKES Resources ctakes-chunker-res #1262' does not have a result yet. Please make sure you set a proper result in case of pipeline/build scripts.
No mail will be sent out, as 'ctakes-trunk-compiletest » Apache cTAKES Regression-test #1262' does not have a result yet. Please make sure you set a proper result in case of pipeline/build scripts.
No mail will be sent out, as 'ctakes-trunk-compiletest » Apache cTAKES Relation Extractor #1262' does not have a result yet. Please make sure you set a proper result in case of pipeline/build scripts.
No mail will be sent out, as 'ctakes-trunk-compiletest » ctakes-gui #1262' does not have a result yet. Please make sure you set a proper result in case of pipeline/build scripts.
No mail will be sent out, as 'ctakes-trunk-compiletest » Apache cTAKES document preprocessor #1262' does not have a result yet. Please make sure you set a proper result in case of pipeline/build scripts.
No mail will be sent out, as 'ctakes-trunk-compiletest » Apache cTAKES Resources assertion #1262' does not have a result yet. Please make sure you set a proper result in case of pipeline/build scripts.
No mail will be sent out, as 'ctakes-trunk-compiletest » Apache cTAKES Resources assertion-zoner #1262' does not have a result yet. Please make sure you set a proper result in case of pipeline/build scripts.
No mail will be sent out, as 'ctakes-trunk-compiletest » Apache cTAKES Assertion's zoner #1262' does not have a result yet. Please make sure you set a proper result in case of pipeline/build scripts.
No mail will be sent out, as 'ctakes-trunk-compiletest » Apache cTAKES Resources ne-contexts #1262' does not have a result yet. Please make sure you set a proper result in case of pipeline/build scripts.
No mail will be sent out, as 'ctakes-trunk-compiletest » Apache cTAKES Dockhand #1262' does not have a result yet. Please make sure you set a proper result in case of pipeline/build scripts.
No mail will be sent out, as 'ctakes-trunk-compiletest » Apache cTAKES Drug NER #1262' does not have a result yet. Please make sure you set a proper result in case of pipeline/build scripts.
No mail will be sent out, as 'ctakes-trunk-compiletest » Apache cTAKES YTEX Web #1262' does not have a result yet. Please make sure you set a proper result in case of pipeline/build scripts.
No mail will be sent out, as 'ctakes-trunk-compiletest » Apache cTAKES context dependent tokenizer #1262' does not have a result yet. Please make sure you set a proper result in case of pipeline/build scripts.
No mail will be sent out, as 'ctakes-trunk-compiletest » Apache cTAKES Resources side-effect #1262' does not have a result yet. Please make sure you set a proper result in case of pipeline/build scripts.
No mail will be sent out, as 'ctakes-trunk-compiletest » ctakes-examples #1262' does not have a result yet. Please make sure you set a proper result in case of pipeline/build scripts.
No mail will be sent out, as 'ctakes-trunk-compiletest » Apache cTAKES Resources dictionary-lookup-fast-res #1262' does not have a result yet. Please make sure you set a proper result in case of pipeline/build scripts.
No mail will be sent out, as 'ctakes-trunk-compiletest » Apache cTAKES dictionary lookup fast #1262' does not have a result yet. Please make sure you set a proper result in case of pipeline/build scripts.
No mail will be sent out, as 'ctakes-trunk-compiletest » Apache cTAKES named entity contexts #1262' does not have a result yet. Please make sure you set a proper result in case of pipeline/build scripts.
No mail will be sent out, as 'ctakes-trunk-compiletest » Apache cTAKES LVG lexical tools #1262' does not have a result yet. Please make sure you set a proper result in case of pipeline/build scripts.
No mail will be sent out, as 'ctakes-trunk-compiletest » Apache cTAKES Resources smoking-status #1262' does not have a result yet. Please make sure you set a proper result in case of pipeline/build scripts.
No mail will be sent out, as 'ctakes-trunk-compiletest » Apache cTAKES part-of-speech tagger #1262' does not have a result yet. Please make sure you set a proper result in case of pipeline/build scripts.
No mail will be sent out, as 'ctakes-trunk-compiletest » Apache cTAKES Side Effects #1262' does not have a result yet. Please make sure you set a proper result in case of pipeline/build scripts.
No mail will be sent out, as 'ctakes-trunk-compiletest » Apache cTAKES template filler #1262' does not have a result yet. Please make sure you set a proper result in case of pipeline/build scripts.
No mail will be sent out, as 'ctakes-trunk-compiletest » Apache cTAKES #1262' does not have a result yet. Please make sure you set a proper result in case of pipeline/build scripts.
No mail will be sent out, as 'ctakes-trunk-compiletest » Apache cTAKES chunker #1262' does not have a result yet. Please make sure you set a proper result in case of pipeline/build scripts.
No mail will be sent out, as 'ctakes-trunk-compiletest » Apache cTAKES Tiny Rest Service #1262' does not have a result yet. Please make sure you set a proper result in case of pipeline/build scripts.
No mail will be sent out, as 'ctakes-trunk-compiletest » Apache cTAKES Resources dependency-parser clearNLP #1262' does not have a result yet. Please make sure you set a proper result in case of pipeline/build scripts.
No mail will be sent out, as 'ctakes-trunk-compiletest » Apache cTAKES utils #1262' does not have a result yet. Please make sure you set a proper result in case of pipeline/build scripts.
No mail will be sent out, as 'ctakes-trunk-compiletest » Apache cTAKES Resources drug-ner #1262' does not have a result yet. Please make sure you set a proper result in case of pipeline/build scripts.
No mail will be sent out, as 'ctakes-trunk-compiletest » Apache cTAKES core #1262' does not have a result yet. Please make sure you set a proper result in case of pipeline/build scripts.
No mail will be sent out, as 'ctakes-trunk-compiletest » Apache cTAKES Dependency Parser #1262' does not have a result yet. Please make sure you set a proper result in case of pipeline/build scripts.
No mail will be sent out, as 'ctakes-trunk-compiletest » Apache cTAKES Distribution #1262' does not have a result yet. Please make sure you set a proper result in case of pipeline/build scripts.
No mail will be sent out, as 'ctakes-trunk-compiletest » Apache cTAKES Resources coreference #1262' does not have a result yet. Please make sure you set a proper result in case of pipeline/build scripts.
No mail will be sent out, as 'ctakes-trunk-compiletest » Apache cTAKES CoReference Resolver #1262' does not have a result yet. Please make sure you set a proper result in case of pipeline/build scripts.
No mail will be sent out, as 'ctakes-trunk-compiletest » Apache cTAKES Assertion #1262' does not have a result yet. Please make sure you set a proper result in case of pipeline/build scripts.
No mail will be sent out, as 'ctakes-trunk-compiletest » ctakes-clinical-pipeline-res #1262' does not have a result yet. Please make sure you set a proper result in case of pipeline/build scripts.
No mail will be sent out, as 'ctakes-trunk-compiletest » Apache cTAKES Resources ctakes-ytex-res #1262' does not have a result yet. Please make sure you set a proper result in case of pipeline/build scripts.
No mail will be sent out, as 'ctakes-trunk-compiletest » Apache cTAKES Resources dictionary-lookup #1262' does not have a result yet. Please make sure you set a proper result in case of pipeline/build scripts.
No mail will be sent out, as 'ctakes-trunk-compiletest » Apache cTAKES Resources temporal #1262' does not have a result yet. Please make sure you set a proper result in case of pipeline/build scripts.
No mail will be sent out, as 'ctakes-trunk-compiletest » ctakes-gui-res #1262' does not have a result yet. Please make sure you set a proper result in case of pipeline/build scripts.
No mail will be sent out, as 'ctakes-trunk-compiletest » Apache cTAKES Resources lvg #1262' does not have a result yet. Please make sure you set a proper result in case of pipeline/build scripts.
No mail will be sent out, as 'ctakes-trunk-compiletest » Apache cTAKES YTEX #1262' does not have a result yet. Please make sure you set a proper result in case of pipeline/build scripts.
No mail will be sent out, as 'ctakes-trunk-compiletest » Apache cTAKES Resources relation-extractor #1262' does not have a result yet. Please make sure you set a proper result in case of pipeline/build scripts.
No mail will be sent out, as 'ctakes-trunk-compiletest » Apache cTAKES Resources constituency-parser #1262' does not have a result yet. Please make sure you set a proper result in case of pipeline/build scripts.
No mail will be sent out, as 'ctakes-trunk-compiletest » Apache cTAKES Resources core #1262' does not have a result yet. Please make sure you set a proper result in case of pipeline/build scripts.
No mail will be sent out, as 'ctakes-trunk-compiletest » Apache cTAKES Resources dependency-parser #1262' does not have a result yet. Please make sure you set a proper result in case of pipeline/build scripts.
No mail will be sent out, as 'ctakes-trunk-compiletest » Apache cTAKES Smoking Status #1262' does not have a result yet. Please make sure you set a proper result in case of pipeline/build scripts.
No mail will be sent out, as 'ctakes-trunk-compiletest » Apache cTAKES Resources pos-tagger #1262' does not have a result yet. Please make sure you set a proper result in case of pipeline/build scripts.
No mail will be sent out, as 'ctakes-trunk-compiletest » Apache cTAKES YTEX UIMA #1262' does not have a result yet. Please make sure you set a proper result in case of pipeline/build scripts.
channel stopped
[ctakes-trunk-compiletest] $ /bin/bash -xe /tmp/jenkins8365064762884737838.sh
+ rm -fr '/tmp/ctakes-*'

Jenkins build is back to normal : ctakes-trunk-compiletest #1267

Posted by Apache Jenkins Server <je...@builds.apache.org>.
See <https://builds.apache.org/job/ctakes-trunk-compiletest/1267/display/redirect?page=changes>


Build failed in Jenkins: ctakes-trunk-compiletest #1266

Posted by Apache Jenkins Server <je...@builds.apache.org>.
See <https://builds.apache.org/job/ctakes-trunk-compiletest/1266/display/redirect?page=changes>

Changes:

[clin] removed a unused import


------------------------------------------
[...truncated 397.84 KB...]
A         ctakes-constituency-parser-res/src/main/resources/org/apache/ctakes/constituency/parser/models
AU        ctakes-constituency-parser-res/src/main/resources/org/apache/ctakes/constituency/parser/models/thyme.bin
AU        ctakes-constituency-parser-res/src/main/resources/org/apache/ctakes/constituency/parser/models/sharpacq-3.1.bin
AU        ctakes-constituency-parser-res/src/main/resources/org/apache/ctakes/constituency/parser/models/sharpacq-1.5.bin
A         ctakes-constituency-parser-res/src/test
A         ctakes-constituency-parser-res/LICENSE
A         ctakes-context-tokenizer
A         ctakes-context-tokenizer/pom.xml
A         ctakes-context-tokenizer/src
A         ctakes-context-tokenizer/src/main
A         ctakes-context-tokenizer/src/main/java
A         ctakes-context-tokenizer/src/main/java/org
A         ctakes-context-tokenizer/src/main/java/org/apache
A         ctakes-context-tokenizer/src/main/java/org/apache/ctakes
A         ctakes-context-tokenizer/src/main/java/org/apache/ctakes/contexttokenizer
A         ctakes-context-tokenizer/src/main/java/org/apache/ctakes/contexttokenizer/ae
A         ctakes-context-tokenizer/src/main/java/org/apache/ctakes/contexttokenizer/ae/ContextDependentTokenizerAnnotator.java
A         ctakes-context-tokenizer/src/main/java/org/apache/ctakes/context
A         ctakes-context-tokenizer/src/test
A         ctakes-context-tokenizer/src/test/java
A         ctakes-context-tokenizer/src/test/java/org
A         ctakes-context-tokenizer/src/test/java/org/apache
A         ctakes-context-tokenizer/src/test/java/org/apache/ctakes
A         ctakes-context-tokenizer/src/test/java/org/apache/ctakes/contexttokenizer
A         ctakes-context-tokenizer/src/test/java/org/apache/ctakes/contexttokenizer/ae
AU        ctakes-context-tokenizer/src/test/java/org/apache/ctakes/contexttokenizer/ae/TestContextDependentTokenizerAnnotator.java
A         ctakes-context-tokenizer/desc
A         ctakes-context-tokenizer/desc/analysis_engine
A         ctakes-context-tokenizer/desc/analysis_engine/AggregateAE.xml
A         ctakes-context-tokenizer/desc/analysis_engine/TestTAE.xml
A         ctakes-context-tokenizer/desc/analysis_engine/ContextDependentTokenizerAnnotator.xml
A         ctakes-context-tokenizer/LICENSE
A         ctakes-context-tokenizer/data
A         ctakes-context-tokenizer/data/test
A         ctakes-context-tokenizer/data/test/output
A         ctakes-context-tokenizer/resources
A         ctakes-context-tokenizer/resources/launch
A         ctakes-context-tokenizer/README
A         ctakes-drug-ner-res
A         ctakes-drug-ner-res/pom.xml
A         ctakes-drug-ner-res/src
A         ctakes-drug-ner-res/src/main
A         ctakes-drug-ner-res/src/main/resources
A         ctakes-drug-ner-res/src/main/resources/org
A         ctakes-drug-ner-res/src/main/resources/org/apache
A         ctakes-drug-ner-res/src/main/resources/org/apache/ctakes
A         ctakes-drug-ner-res/src/main/resources/org/apache/ctakes/drugner
A         ctakes-drug-ner-res/src/main/resources/org/apache/ctakes/drugner/types
A         ctakes-drug-ner-res/src/main/resources/org/apache/ctakes/drugner/types/TypeSystem.xml
A         ctakes-drug-ner-res/src/main/resources/org/apache/ctakes/drugner/lookup
A         ctakes-drug-ner-res/src/main/resources/org/apache/ctakes/drugner/lookup/LookupDesc_DrugNER.xml
A         ctakes-drug-ner-res/src/main/resources/org/apache/ctakes/drugner/tokenizer
A         ctakes-drug-ner-res/src/main/resources/org/apache/ctakes/drugner/tokenizer/hyphen_freq.txt
A         ctakes-drug-ner-res/src/test
A         ctakes-drug-ner-res/LICENSE
A         ctakes-ne-contexts-res
A         ctakes-ne-contexts-res/pom.xml
A         ctakes-ne-contexts-res/src
A         ctakes-ne-contexts-res/src/main
A         ctakes-ne-contexts-res/src/main/resources
A         ctakes-ne-contexts-res/src/main/resources/org
A         ctakes-ne-contexts-res/src/main/resources/org/apache
A         ctakes-ne-contexts-res/src/main/resources/org/apache/ctakes
A         ctakes-ne-contexts-res/src/main/resources/org/apache/ctakes/necontexts
A         ctakes-ne-contexts-res/src/main/resources/org/apache/ctakes/necontexts/pipeline
A         ctakes-ne-contexts-res/src/main/resources/org/apache/ctakes/necontexts/pipeline/NeContextsSubPipe.piper
A         ctakes-ne-contexts-res/src/main/resources/org/apache/ctakes/necontexts/desc
A         ctakes-ne-contexts-res/src/main/resources/org/apache/ctakes/necontexts/desc/NegationAnnotator.xml
A         ctakes-ne-contexts-res/src/test
A         ctakes-ne-contexts-res/LICENSE
A         ctakes-pos-tagger-res
A         ctakes-pos-tagger-res/pom.xml
A         ctakes-pos-tagger-res/src
A         ctakes-pos-tagger-res/src/main
A         ctakes-pos-tagger-res/src/main/resources
A         ctakes-pos-tagger-res/src/main/resources/org
A         ctakes-pos-tagger-res/src/main/resources/org/apache
A         ctakes-pos-tagger-res/src/main/resources/org/apache/ctakes
A         ctakes-pos-tagger-res/src/main/resources/org/apache/ctakes/postagger
A         ctakes-pos-tagger-res/src/main/resources/org/apache/ctakes/postagger/models
A         ctakes-pos-tagger-res/src/main/resources/org/apache/ctakes/postagger/models/clearnlp
AU        ctakes-pos-tagger-res/src/main/resources/org/apache/ctakes/postagger/models/clearnlp/mayo-en-pos-1.3.0.jar
AU        ctakes-pos-tagger-res/src/main/resources/org/apache/ctakes/postagger/models/mayo-pos.zip
A         ctakes-pos-tagger-res/src/main/resources/org/apache/ctakes/postagger/models/README
A         ctakes-pos-tagger-res/src/test
A         ctakes-pos-tagger-res/LICENSE
A         ctakes-side-effect-res
A         ctakes-side-effect-res/pom.xml
A         ctakes-side-effect-res/src
A         ctakes-side-effect-res/src/main
A         ctakes-side-effect-res/src/main/resources
A         ctakes-side-effect-res/src/main/resources/org
A         ctakes-side-effect-res/src/main/resources/org/apache
A         ctakes-side-effect-res/src/main/resources/org/apache/ctakes
A         ctakes-side-effect-res/src/main/resources/org/apache/ctakes/sideeffect
A         ctakes-side-effect-res/src/main/resources/org/apache/ctakes/sideeffect/lookup
A         ctakes-side-effect-res/src/main/resources/org/apache/ctakes/sideeffect/lookup/LookupDesc_sideEffect.xml
A         ctakes-side-effect-res/src/main/resources/org/apache/ctakes/sideeffect/lookup/LookupDesc_sideEffectUMLS.xml
A         ctakes-side-effect-res/src/main/resources/org/apache/ctakes/sideeffect/lookup/sideEffect_dictionary.txt
A         ctakes-side-effect-res/src/main/resources/org/apache/ctakes/sideeffect/lookup/additionalNE_dictionary.csv
A         ctakes-side-effect-res/src/main/resources/org/apache/ctakes/sideeffect/classifier
A         ctakes-side-effect-res/src/main/resources/org/apache/ctakes/sideeffect/classifier/libsvm_model_onWholeSet
A         ctakes-side-effect-res/src/main/resources/org/apache/ctakes/sideeffect/data
A         ctakes-side-effect-res/src/main/resources/org/apache/ctakes/sideeffect/data/sentenceLevelMetaKeywords.txt
A         ctakes-side-effect-res/src/test
A         ctakes-side-effect-res/LICENSE
A         ctakes-smoking-status-res
A         ctakes-smoking-status-res/pom.xml
A         ctakes-smoking-status-res/src
A         ctakes-smoking-status-res/src/main
A         ctakes-smoking-status-res/src/main/resources
A         ctakes-smoking-status-res/src/main/resources/org
A         ctakes-smoking-status-res/src/main/resources/org/apache
A         ctakes-smoking-status-res/src/main/resources/org/apache/ctakes
A         ctakes-smoking-status-res/src/main/resources/org/apache/ctakes/smokingstatus
A         ctakes-smoking-status-res/src/main/resources/org/apache/ctakes/smokingstatus/analysis_engine
A         ctakes-smoking-status-res/src/main/resources/org/apache/ctakes/smokingstatus/analysis_engine/KuRuleBasedClassifierAnnotator.xml
A         ctakes-smoking-status-res/src/main/resources/org/apache/ctakes/smokingstatus/analysis_engine/ProductionPostSentenceAggregate_step2_libsvm.xml
A         ctakes-smoking-status-res/src/main/resources/org/apache/ctakes/smokingstatus/analysis_engine/SmokingStatusDictionaryLookupAnnotator.xml
A         ctakes-smoking-status-res/src/main/resources/org/apache/ctakes/smokingstatus/analysis_engine/ArtificialSentenceAnnotator.xml
A         ctakes-smoking-status-res/src/main/resources/org/apache/ctakes/smokingstatus/analysis_engine/ProductionPostSentenceAggregate_step1.xml
A         ctakes-smoking-status-res/src/main/resources/org/apache/ctakes/smokingstatus/analysis_engine/SentenceAdjuster.xml
A         ctakes-smoking-status-res/src/main/resources/org/apache/ctakes/smokingstatus/analysis_engine/PcsClassifierAnnotator_libsvm.xml
A         ctakes-smoking-status-res/src/main/resources/org/apache/ctakes/smokingstatus/data
A         ctakes-smoking-status-res/src/main/resources/org/apache/ctakes/smokingstatus/data/KU
A         ctakes-smoking-status-res/src/main/resources/org/apache/ctakes/smokingstatus/data/KU/keywords.txt
A         ctakes-smoking-status-res/src/main/resources/org/apache/ctakes/smokingstatus/data/KU/unknown_words.txt
A         ctakes-smoking-status-res/src/main/resources/org/apache/ctakes/smokingstatus/data/nonsmoker.dictionary
A         ctakes-smoking-status-res/src/main/resources/org/apache/ctakes/smokingstatus/data/context
A         ctakes-smoking-status-res/src/main/resources/org/apache/ctakes/smokingstatus/data/context/negationContradictionWords.txt
A         ctakes-smoking-status-res/src/main/resources/org/apache/ctakes/smokingstatus/data/context/boundaryData.txt
A         ctakes-smoking-status-res/src/main/resources/org/apache/ctakes/smokingstatus/data/smoker.dictionary
A         ctakes-smoking-status-res/src/main/resources/org/apache/ctakes/smokingstatus/data/PCS
A         ctakes-smoking-status-res/src/main/resources/org/apache/ctakes/smokingstatus/data/PCS/stopwords_PCS.txt
A         ctakes-smoking-status-res/src/main/resources/org/apache/ctakes/smokingstatus/data/PCS/pcs_libsvm-2.91.model
A         ctakes-smoking-status-res/src/main/resources/org/apache/ctakes/smokingstatus/data/PCS/keywords_PCS.txt
A         ctakes-smoking-status-res/src/main/resources/org/apache/ctakes/smokingstatus/data/SmokingStatusLookupConfig.xml
A         ctakes-smoking-status-res/src/test
A         ctakes-smoking-status-res/LICENSE
A         ctakes-template-filler
AU        ctakes-template-filler/pom.xml
A         ctakes-template-filler/desc
A         ctakes-template-filler/desc/analysis_engine
AU        ctakes-template-filler/desc/analysis_engine/AggregateTemplateFiller.xml
AU        ctakes-template-filler/desc/analysis_engine/RelationExtractorAggregateWithoutOrangeBook.xml
AU        ctakes-template-filler/desc/analysis_engine/TemplateFillerAnnotator.xml
A         ctakes-template-filler/src
A         ctakes-template-filler/src/main
A         ctakes-template-filler/src/main/java
A         ctakes-template-filler/src/main/java/org
A         ctakes-template-filler/src/main/java/org/apache
A         ctakes-template-filler/src/main/java/org/apache/ctakes
A         ctakes-template-filler/src/main/java/org/apache/ctakes/template
A         ctakes-template-filler/src/main/java/org/apache/ctakes/template/filler
A         ctakes-template-filler/src/main/java/org/apache/ctakes/template/filler/ae
AU        ctakes-template-filler/src/main/java/org/apache/ctakes/template/filler/ae/TemplateFillerAnnotator.java
A         ctakes-template-filler/src/main/resources
A         ctakes-template-filler/src/test
A         ctakes-template-filler/src/test/java
A         ctakes-template-filler/src/test/resources
A         README
AU        KEYS
A         NOTICE
A         LICENSE
 U        .
At revision 1874262

Parsing POMs
Modules changed, recalculating dependency graph
Established TCP socket on 43323
maven3-agent.jar already up to date
maven3-interceptor.jar already up to date
maven3-interceptor-commons.jar already up to date
[ctakes-trunk-compiletest] $ /home/jenkins/tools/java/latest1.8/bin/java -Xmx4g -Xms256m -XX:MaxPermSize=512m -cp /home/jenkins/jenkins-slave/maven3-agent.jar:/home/jenkins/tools/maven/apache-maven-3.0.5/boot/plexus-classworlds-2.4.jar org.jvnet.hudson.maven3.agent.Maven3Main /home/jenkins/tools/maven/apache-maven-3.0.5 /home/jenkins/jenkins-slave/remoting.jar /home/jenkins/jenkins-slave/maven3-interceptor.jar /home/jenkins/jenkins-slave/maven3-interceptor-commons.jar 43323
Java HotSpot(TM) 64-Bit Server VM warning: ignoring option MaxPermSize=512m; support was removed in 8.0
<===[JENKINS REMOTING CAPACITY]===>   channel started
Executing Maven:  -B -f <https://builds.apache.org/job/ctakes-trunk-compiletest/ws/pom.xml> -Dmaven.repo.local=/home/jenkins/jenkins-slave/maven-repositories/1 clean compile test
[INFO] Scanning for projects...
Downloading: http://repo.maven.apache.org/maven2/org/apache/maven/wagon/wagon-http-lightweight/2.2/wagon-http-lightweight-2.2.pom
[ERROR] The build could not read 1 project -> [Help 1]
[ERROR]   
[ERROR]   The project org.apache.ctakes:ctakes-ytex:4.0.1-SNAPSHOT (<https://builds.apache.org/job/ctakes-trunk-compiletest/ws/ctakes-ytex/pom.xml)> has 1 error
[ERROR]     Unresolveable build extension: Plugin org.apache.maven.wagon:wagon-http-lightweight:2.2 or one of its dependencies could not be resolved: Failed to collect dependencies for org.apache.maven.wagon:wagon-http-lightweight:jar:2.2 (): Failed to read artifact descriptor for org.apache.maven.wagon:wagon-http-lightweight:jar:2.2: Could not transfer artifact org.apache.maven.wagon:wagon-http-lightweight:pom:2.2 from/to central (http://repo.maven.apache.org/maven2): Failed to transfer file: http://repo.maven.apache.org/maven2/org/apache/maven/wagon/wagon-http-lightweight/2.2/wagon-http-lightweight-2.2.pom. Return code is: 501 , ReasonPhrase:HTTPS Required. -> [Help 2]
[ERROR] 
[ERROR] To see the full stack trace of the errors, re-run Maven with the -e switch.
[ERROR] Re-run Maven using the -X switch to enable full debug logging.
[ERROR] 
[ERROR] For more information about the errors and possible solutions, please read the following articles:
[ERROR] [Help 1] http://cwiki.apache.org/confluence/display/MAVEN/ProjectBuildingException
[ERROR] [Help 2] http://cwiki.apache.org/confluence/display/MAVEN/PluginResolutionException
No mail will be sent out, as 'ctakes-trunk-compiletest » Apache cTAKES fhir support #1266' does not have a result yet. Please make sure you set a proper result in case of pipeline/build scripts.
No mail will be sent out, as 'ctakes-trunk-compiletest » Apache cTAKES ctakes-clinical-pipeline #1266' does not have a result yet. Please make sure you set a proper result in case of pipeline/build scripts.
No mail will be sent out, as 'ctakes-trunk-compiletest » Apache cTAKES common type system #1266' does not have a result yet. Please make sure you set a proper result in case of pipeline/build scripts.
No mail will be sent out, as 'ctakes-trunk-compiletest » Apache cTAKES dictionary lookup #1266' does not have a result yet. Please make sure you set a proper result in case of pipeline/build scripts.
No mail will be sent out, as 'ctakes-trunk-compiletest » Apache cTAKES Constituency Parser #1266' does not have a result yet. Please make sure you set a proper result in case of pipeline/build scripts.
No mail will be sent out, as 'ctakes-trunk-compiletest » ctakes-examples-res #1266' does not have a result yet. Please make sure you set a proper result in case of pipeline/build scripts.
No mail will be sent out, as 'ctakes-trunk-compiletest » Apache cTAKES Temporal Information Extraction #1266' does not have a result yet. Please make sure you set a proper result in case of pipeline/build scripts.
No mail will be sent out, as 'ctakes-trunk-compiletest » Apache cTAKES Resources ctakes-chunker-res #1266' does not have a result yet. Please make sure you set a proper result in case of pipeline/build scripts.
No mail will be sent out, as 'ctakes-trunk-compiletest » Apache cTAKES Regression-test #1266' does not have a result yet. Please make sure you set a proper result in case of pipeline/build scripts.
No mail will be sent out, as 'ctakes-trunk-compiletest » Apache cTAKES Relation Extractor #1266' does not have a result yet. Please make sure you set a proper result in case of pipeline/build scripts.
No mail will be sent out, as 'ctakes-trunk-compiletest » ctakes-gui #1266' does not have a result yet. Please make sure you set a proper result in case of pipeline/build scripts.
No mail will be sent out, as 'ctakes-trunk-compiletest » Apache cTAKES document preprocessor #1266' does not have a result yet. Please make sure you set a proper result in case of pipeline/build scripts.
No mail will be sent out, as 'ctakes-trunk-compiletest » Apache cTAKES Resources assertion #1266' does not have a result yet. Please make sure you set a proper result in case of pipeline/build scripts.
No mail will be sent out, as 'ctakes-trunk-compiletest » Apache cTAKES Resources assertion-zoner #1266' does not have a result yet. Please make sure you set a proper result in case of pipeline/build scripts.
No mail will be sent out, as 'ctakes-trunk-compiletest » Apache cTAKES Assertion's zoner #1266' does not have a result yet. Please make sure you set a proper result in case of pipeline/build scripts.
No mail will be sent out, as 'ctakes-trunk-compiletest » Apache cTAKES Resources ne-contexts #1266' does not have a result yet. Please make sure you set a proper result in case of pipeline/build scripts.
No mail will be sent out, as 'ctakes-trunk-compiletest » Apache cTAKES Dockhand #1266' does not have a result yet. Please make sure you set a proper result in case of pipeline/build scripts.
No mail will be sent out, as 'ctakes-trunk-compiletest » Apache cTAKES Drug NER #1266' does not have a result yet. Please make sure you set a proper result in case of pipeline/build scripts.
No mail will be sent out, as 'ctakes-trunk-compiletest » Apache cTAKES YTEX Web #1266' does not have a result yet. Please make sure you set a proper result in case of pipeline/build scripts.
No mail will be sent out, as 'ctakes-trunk-compiletest » Apache cTAKES context dependent tokenizer #1266' does not have a result yet. Please make sure you set a proper result in case of pipeline/build scripts.
No mail will be sent out, as 'ctakes-trunk-compiletest » Apache cTAKES Resources side-effect #1266' does not have a result yet. Please make sure you set a proper result in case of pipeline/build scripts.
No mail will be sent out, as 'ctakes-trunk-compiletest » ctakes-examples #1266' does not have a result yet. Please make sure you set a proper result in case of pipeline/build scripts.
No mail will be sent out, as 'ctakes-trunk-compiletest » Apache cTAKES Resources dictionary-lookup-fast-res #1266' does not have a result yet. Please make sure you set a proper result in case of pipeline/build scripts.
No mail will be sent out, as 'ctakes-trunk-compiletest » Apache cTAKES dictionary lookup fast #1266' does not have a result yet. Please make sure you set a proper result in case of pipeline/build scripts.
No mail will be sent out, as 'ctakes-trunk-compiletest » Apache cTAKES named entity contexts #1266' does not have a result yet. Please make sure you set a proper result in case of pipeline/build scripts.
No mail will be sent out, as 'ctakes-trunk-compiletest » Apache cTAKES LVG lexical tools #1266' does not have a result yet. Please make sure you set a proper result in case of pipeline/build scripts.
No mail will be sent out, as 'ctakes-trunk-compiletest » Apache cTAKES Resources smoking-status #1266' does not have a result yet. Please make sure you set a proper result in case of pipeline/build scripts.
No mail will be sent out, as 'ctakes-trunk-compiletest » Apache cTAKES part-of-speech tagger #1266' does not have a result yet. Please make sure you set a proper result in case of pipeline/build scripts.
No mail will be sent out, as 'ctakes-trunk-compiletest » Apache cTAKES Side Effects #1266' does not have a result yet. Please make sure you set a proper result in case of pipeline/build scripts.
No mail will be sent out, as 'ctakes-trunk-compiletest » Apache cTAKES template filler #1266' does not have a result yet. Please make sure you set a proper result in case of pipeline/build scripts.
No mail will be sent out, as 'ctakes-trunk-compiletest » Apache cTAKES #1266' does not have a result yet. Please make sure you set a proper result in case of pipeline/build scripts.
No mail will be sent out, as 'ctakes-trunk-compiletest » Apache cTAKES chunker #1266' does not have a result yet. Please make sure you set a proper result in case of pipeline/build scripts.
No mail will be sent out, as 'ctakes-trunk-compiletest » Apache cTAKES Tiny Rest Service #1266' does not have a result yet. Please make sure you set a proper result in case of pipeline/build scripts.
No mail will be sent out, as 'ctakes-trunk-compiletest » Apache cTAKES Resources dependency-parser clearNLP #1266' does not have a result yet. Please make sure you set a proper result in case of pipeline/build scripts.
No mail will be sent out, as 'ctakes-trunk-compiletest » Apache cTAKES utils #1266' does not have a result yet. Please make sure you set a proper result in case of pipeline/build scripts.
No mail will be sent out, as 'ctakes-trunk-compiletest » Apache cTAKES Resources drug-ner #1266' does not have a result yet. Please make sure you set a proper result in case of pipeline/build scripts.
No mail will be sent out, as 'ctakes-trunk-compiletest » Apache cTAKES core #1266' does not have a result yet. Please make sure you set a proper result in case of pipeline/build scripts.
No mail will be sent out, as 'ctakes-trunk-compiletest » Apache cTAKES Dependency Parser #1266' does not have a result yet. Please make sure you set a proper result in case of pipeline/build scripts.
No mail will be sent out, as 'ctakes-trunk-compiletest » Apache cTAKES Distribution #1266' does not have a result yet. Please make sure you set a proper result in case of pipeline/build scripts.
No mail will be sent out, as 'ctakes-trunk-compiletest » Apache cTAKES Resources coreference #1266' does not have a result yet. Please make sure you set a proper result in case of pipeline/build scripts.
No mail will be sent out, as 'ctakes-trunk-compiletest » Apache cTAKES CoReference Resolver #1266' does not have a result yet. Please make sure you set a proper result in case of pipeline/build scripts.
No mail will be sent out, as 'ctakes-trunk-compiletest » Apache cTAKES Assertion #1266' does not have a result yet. Please make sure you set a proper result in case of pipeline/build scripts.
No mail will be sent out, as 'ctakes-trunk-compiletest » ctakes-clinical-pipeline-res #1266' does not have a result yet. Please make sure you set a proper result in case of pipeline/build scripts.
No mail will be sent out, as 'ctakes-trunk-compiletest » Apache cTAKES Resources ctakes-ytex-res #1266' does not have a result yet. Please make sure you set a proper result in case of pipeline/build scripts.
No mail will be sent out, as 'ctakes-trunk-compiletest » Apache cTAKES Resources dictionary-lookup #1266' does not have a result yet. Please make sure you set a proper result in case of pipeline/build scripts.
No mail will be sent out, as 'ctakes-trunk-compiletest » Apache cTAKES Resources temporal #1266' does not have a result yet. Please make sure you set a proper result in case of pipeline/build scripts.
No mail will be sent out, as 'ctakes-trunk-compiletest » ctakes-gui-res #1266' does not have a result yet. Please make sure you set a proper result in case of pipeline/build scripts.
No mail will be sent out, as 'ctakes-trunk-compiletest » Apache cTAKES Resources lvg #1266' does not have a result yet. Please make sure you set a proper result in case of pipeline/build scripts.
No mail will be sent out, as 'ctakes-trunk-compiletest » Apache cTAKES YTEX #1266' does not have a result yet. Please make sure you set a proper result in case of pipeline/build scripts.
No mail will be sent out, as 'ctakes-trunk-compiletest » Apache cTAKES Resources relation-extractor #1266' does not have a result yet. Please make sure you set a proper result in case of pipeline/build scripts.
No mail will be sent out, as 'ctakes-trunk-compiletest » Apache cTAKES Resources constituency-parser #1266' does not have a result yet. Please make sure you set a proper result in case of pipeline/build scripts.
No mail will be sent out, as 'ctakes-trunk-compiletest » Apache cTAKES Resources core #1266' does not have a result yet. Please make sure you set a proper result in case of pipeline/build scripts.
No mail will be sent out, as 'ctakes-trunk-compiletest » Apache cTAKES Resources dependency-parser #1266' does not have a result yet. Please make sure you set a proper result in case of pipeline/build scripts.
No mail will be sent out, as 'ctakes-trunk-compiletest » Apache cTAKES Smoking Status #1266' does not have a result yet. Please make sure you set a proper result in case of pipeline/build scripts.
No mail will be sent out, as 'ctakes-trunk-compiletest » Apache cTAKES Resources pos-tagger #1266' does not have a result yet. Please make sure you set a proper result in case of pipeline/build scripts.
No mail will be sent out, as 'ctakes-trunk-compiletest » Apache cTAKES YTEX UIMA #1266' does not have a result yet. Please make sure you set a proper result in case of pipeline/build scripts.
channel stopped
[ctakes-trunk-compiletest] $ /bin/bash -xe /tmp/jenkins4816318043020581458.sh
+ rm -fr '/tmp/ctakes-*'

Build failed in Jenkins: ctakes-trunk-compiletest #1265

Posted by Apache Jenkins Server <je...@builds.apache.org>.
See <https://builds.apache.org/job/ctakes-trunk-compiletest/1265/display/redirect?page=changes>

Changes:

[seanfinan] example ae that assigns body sides to anatomic sites.


------------------------------------------
[...truncated 397.84 KB...]
A         ctakes-constituency-parser-res/src/main/resources/org/apache/ctakes/constituency/parser/models
AU        ctakes-constituency-parser-res/src/main/resources/org/apache/ctakes/constituency/parser/models/thyme.bin
AU        ctakes-constituency-parser-res/src/main/resources/org/apache/ctakes/constituency/parser/models/sharpacq-3.1.bin
AU        ctakes-constituency-parser-res/src/main/resources/org/apache/ctakes/constituency/parser/models/sharpacq-1.5.bin
A         ctakes-constituency-parser-res/src/test
A         ctakes-constituency-parser-res/LICENSE
A         ctakes-context-tokenizer
A         ctakes-context-tokenizer/pom.xml
A         ctakes-context-tokenizer/src
A         ctakes-context-tokenizer/src/main
A         ctakes-context-tokenizer/src/main/java
A         ctakes-context-tokenizer/src/main/java/org
A         ctakes-context-tokenizer/src/main/java/org/apache
A         ctakes-context-tokenizer/src/main/java/org/apache/ctakes
A         ctakes-context-tokenizer/src/main/java/org/apache/ctakes/contexttokenizer
A         ctakes-context-tokenizer/src/main/java/org/apache/ctakes/contexttokenizer/ae
A         ctakes-context-tokenizer/src/main/java/org/apache/ctakes/contexttokenizer/ae/ContextDependentTokenizerAnnotator.java
A         ctakes-context-tokenizer/src/main/java/org/apache/ctakes/context
A         ctakes-context-tokenizer/src/test
A         ctakes-context-tokenizer/src/test/java
A         ctakes-context-tokenizer/src/test/java/org
A         ctakes-context-tokenizer/src/test/java/org/apache
A         ctakes-context-tokenizer/src/test/java/org/apache/ctakes
A         ctakes-context-tokenizer/src/test/java/org/apache/ctakes/contexttokenizer
A         ctakes-context-tokenizer/src/test/java/org/apache/ctakes/contexttokenizer/ae
AU        ctakes-context-tokenizer/src/test/java/org/apache/ctakes/contexttokenizer/ae/TestContextDependentTokenizerAnnotator.java
A         ctakes-context-tokenizer/desc
A         ctakes-context-tokenizer/desc/analysis_engine
A         ctakes-context-tokenizer/desc/analysis_engine/AggregateAE.xml
A         ctakes-context-tokenizer/desc/analysis_engine/TestTAE.xml
A         ctakes-context-tokenizer/desc/analysis_engine/ContextDependentTokenizerAnnotator.xml
A         ctakes-context-tokenizer/LICENSE
A         ctakes-context-tokenizer/data
A         ctakes-context-tokenizer/data/test
A         ctakes-context-tokenizer/data/test/output
A         ctakes-context-tokenizer/resources
A         ctakes-context-tokenizer/resources/launch
A         ctakes-context-tokenizer/README
A         ctakes-drug-ner-res
A         ctakes-drug-ner-res/pom.xml
A         ctakes-drug-ner-res/src
A         ctakes-drug-ner-res/src/main
A         ctakes-drug-ner-res/src/main/resources
A         ctakes-drug-ner-res/src/main/resources/org
A         ctakes-drug-ner-res/src/main/resources/org/apache
A         ctakes-drug-ner-res/src/main/resources/org/apache/ctakes
A         ctakes-drug-ner-res/src/main/resources/org/apache/ctakes/drugner
A         ctakes-drug-ner-res/src/main/resources/org/apache/ctakes/drugner/types
A         ctakes-drug-ner-res/src/main/resources/org/apache/ctakes/drugner/types/TypeSystem.xml
A         ctakes-drug-ner-res/src/main/resources/org/apache/ctakes/drugner/lookup
A         ctakes-drug-ner-res/src/main/resources/org/apache/ctakes/drugner/lookup/LookupDesc_DrugNER.xml
A         ctakes-drug-ner-res/src/main/resources/org/apache/ctakes/drugner/tokenizer
A         ctakes-drug-ner-res/src/main/resources/org/apache/ctakes/drugner/tokenizer/hyphen_freq.txt
A         ctakes-drug-ner-res/src/test
A         ctakes-drug-ner-res/LICENSE
A         ctakes-ne-contexts-res
A         ctakes-ne-contexts-res/pom.xml
A         ctakes-ne-contexts-res/src
A         ctakes-ne-contexts-res/src/main
A         ctakes-ne-contexts-res/src/main/resources
A         ctakes-ne-contexts-res/src/main/resources/org
A         ctakes-ne-contexts-res/src/main/resources/org/apache
A         ctakes-ne-contexts-res/src/main/resources/org/apache/ctakes
A         ctakes-ne-contexts-res/src/main/resources/org/apache/ctakes/necontexts
A         ctakes-ne-contexts-res/src/main/resources/org/apache/ctakes/necontexts/pipeline
A         ctakes-ne-contexts-res/src/main/resources/org/apache/ctakes/necontexts/pipeline/NeContextsSubPipe.piper
A         ctakes-ne-contexts-res/src/main/resources/org/apache/ctakes/necontexts/desc
A         ctakes-ne-contexts-res/src/main/resources/org/apache/ctakes/necontexts/desc/NegationAnnotator.xml
A         ctakes-ne-contexts-res/src/test
A         ctakes-ne-contexts-res/LICENSE
A         ctakes-pos-tagger-res
A         ctakes-pos-tagger-res/pom.xml
A         ctakes-pos-tagger-res/src
A         ctakes-pos-tagger-res/src/main
A         ctakes-pos-tagger-res/src/main/resources
A         ctakes-pos-tagger-res/src/main/resources/org
A         ctakes-pos-tagger-res/src/main/resources/org/apache
A         ctakes-pos-tagger-res/src/main/resources/org/apache/ctakes
A         ctakes-pos-tagger-res/src/main/resources/org/apache/ctakes/postagger
A         ctakes-pos-tagger-res/src/main/resources/org/apache/ctakes/postagger/models
A         ctakes-pos-tagger-res/src/main/resources/org/apache/ctakes/postagger/models/clearnlp
AU        ctakes-pos-tagger-res/src/main/resources/org/apache/ctakes/postagger/models/clearnlp/mayo-en-pos-1.3.0.jar
AU        ctakes-pos-tagger-res/src/main/resources/org/apache/ctakes/postagger/models/mayo-pos.zip
A         ctakes-pos-tagger-res/src/main/resources/org/apache/ctakes/postagger/models/README
A         ctakes-pos-tagger-res/src/test
A         ctakes-pos-tagger-res/LICENSE
A         ctakes-side-effect-res
A         ctakes-side-effect-res/pom.xml
A         ctakes-side-effect-res/src
A         ctakes-side-effect-res/src/main
A         ctakes-side-effect-res/src/main/resources
A         ctakes-side-effect-res/src/main/resources/org
A         ctakes-side-effect-res/src/main/resources/org/apache
A         ctakes-side-effect-res/src/main/resources/org/apache/ctakes
A         ctakes-side-effect-res/src/main/resources/org/apache/ctakes/sideeffect
A         ctakes-side-effect-res/src/main/resources/org/apache/ctakes/sideeffect/lookup
A         ctakes-side-effect-res/src/main/resources/org/apache/ctakes/sideeffect/lookup/LookupDesc_sideEffect.xml
A         ctakes-side-effect-res/src/main/resources/org/apache/ctakes/sideeffect/lookup/LookupDesc_sideEffectUMLS.xml
A         ctakes-side-effect-res/src/main/resources/org/apache/ctakes/sideeffect/lookup/sideEffect_dictionary.txt
A         ctakes-side-effect-res/src/main/resources/org/apache/ctakes/sideeffect/lookup/additionalNE_dictionary.csv
A         ctakes-side-effect-res/src/main/resources/org/apache/ctakes/sideeffect/classifier
A         ctakes-side-effect-res/src/main/resources/org/apache/ctakes/sideeffect/classifier/libsvm_model_onWholeSet
A         ctakes-side-effect-res/src/main/resources/org/apache/ctakes/sideeffect/data
A         ctakes-side-effect-res/src/main/resources/org/apache/ctakes/sideeffect/data/sentenceLevelMetaKeywords.txt
A         ctakes-side-effect-res/src/test
A         ctakes-side-effect-res/LICENSE
A         ctakes-smoking-status-res
A         ctakes-smoking-status-res/pom.xml
A         ctakes-smoking-status-res/src
A         ctakes-smoking-status-res/src/main
A         ctakes-smoking-status-res/src/main/resources
A         ctakes-smoking-status-res/src/main/resources/org
A         ctakes-smoking-status-res/src/main/resources/org/apache
A         ctakes-smoking-status-res/src/main/resources/org/apache/ctakes
A         ctakes-smoking-status-res/src/main/resources/org/apache/ctakes/smokingstatus
A         ctakes-smoking-status-res/src/main/resources/org/apache/ctakes/smokingstatus/analysis_engine
A         ctakes-smoking-status-res/src/main/resources/org/apache/ctakes/smokingstatus/analysis_engine/KuRuleBasedClassifierAnnotator.xml
A         ctakes-smoking-status-res/src/main/resources/org/apache/ctakes/smokingstatus/analysis_engine/ProductionPostSentenceAggregate_step2_libsvm.xml
A         ctakes-smoking-status-res/src/main/resources/org/apache/ctakes/smokingstatus/analysis_engine/SmokingStatusDictionaryLookupAnnotator.xml
A         ctakes-smoking-status-res/src/main/resources/org/apache/ctakes/smokingstatus/analysis_engine/ArtificialSentenceAnnotator.xml
A         ctakes-smoking-status-res/src/main/resources/org/apache/ctakes/smokingstatus/analysis_engine/ProductionPostSentenceAggregate_step1.xml
A         ctakes-smoking-status-res/src/main/resources/org/apache/ctakes/smokingstatus/analysis_engine/SentenceAdjuster.xml
A         ctakes-smoking-status-res/src/main/resources/org/apache/ctakes/smokingstatus/analysis_engine/PcsClassifierAnnotator_libsvm.xml
A         ctakes-smoking-status-res/src/main/resources/org/apache/ctakes/smokingstatus/data
A         ctakes-smoking-status-res/src/main/resources/org/apache/ctakes/smokingstatus/data/KU
A         ctakes-smoking-status-res/src/main/resources/org/apache/ctakes/smokingstatus/data/KU/keywords.txt
A         ctakes-smoking-status-res/src/main/resources/org/apache/ctakes/smokingstatus/data/KU/unknown_words.txt
A         ctakes-smoking-status-res/src/main/resources/org/apache/ctakes/smokingstatus/data/nonsmoker.dictionary
A         ctakes-smoking-status-res/src/main/resources/org/apache/ctakes/smokingstatus/data/context
A         ctakes-smoking-status-res/src/main/resources/org/apache/ctakes/smokingstatus/data/context/negationContradictionWords.txt
A         ctakes-smoking-status-res/src/main/resources/org/apache/ctakes/smokingstatus/data/context/boundaryData.txt
A         ctakes-smoking-status-res/src/main/resources/org/apache/ctakes/smokingstatus/data/smoker.dictionary
A         ctakes-smoking-status-res/src/main/resources/org/apache/ctakes/smokingstatus/data/PCS
A         ctakes-smoking-status-res/src/main/resources/org/apache/ctakes/smokingstatus/data/PCS/stopwords_PCS.txt
A         ctakes-smoking-status-res/src/main/resources/org/apache/ctakes/smokingstatus/data/PCS/pcs_libsvm-2.91.model
A         ctakes-smoking-status-res/src/main/resources/org/apache/ctakes/smokingstatus/data/PCS/keywords_PCS.txt
A         ctakes-smoking-status-res/src/main/resources/org/apache/ctakes/smokingstatus/data/SmokingStatusLookupConfig.xml
A         ctakes-smoking-status-res/src/test
A         ctakes-smoking-status-res/LICENSE
A         ctakes-template-filler
AU        ctakes-template-filler/pom.xml
A         ctakes-template-filler/desc
A         ctakes-template-filler/desc/analysis_engine
AU        ctakes-template-filler/desc/analysis_engine/AggregateTemplateFiller.xml
AU        ctakes-template-filler/desc/analysis_engine/RelationExtractorAggregateWithoutOrangeBook.xml
AU        ctakes-template-filler/desc/analysis_engine/TemplateFillerAnnotator.xml
A         ctakes-template-filler/src
A         ctakes-template-filler/src/main
A         ctakes-template-filler/src/main/java
A         ctakes-template-filler/src/main/java/org
A         ctakes-template-filler/src/main/java/org/apache
A         ctakes-template-filler/src/main/java/org/apache/ctakes
A         ctakes-template-filler/src/main/java/org/apache/ctakes/template
A         ctakes-template-filler/src/main/java/org/apache/ctakes/template/filler
A         ctakes-template-filler/src/main/java/org/apache/ctakes/template/filler/ae
AU        ctakes-template-filler/src/main/java/org/apache/ctakes/template/filler/ae/TemplateFillerAnnotator.java
A         ctakes-template-filler/src/main/resources
A         ctakes-template-filler/src/test
A         ctakes-template-filler/src/test/java
A         ctakes-template-filler/src/test/resources
A         README
AU        KEYS
A         NOTICE
A         LICENSE
 U        .
At revision 1874147

Parsing POMs
Modules changed, recalculating dependency graph
Established TCP socket on 38313
maven3-agent.jar already up to date
maven3-interceptor.jar already up to date
maven3-interceptor-commons.jar already up to date
[ctakes-trunk-compiletest] $ /home/jenkins/tools/java/latest1.8/bin/java -Xmx4g -Xms256m -XX:MaxPermSize=512m -cp /home/jenkins/jenkins-slave/maven3-agent.jar:/home/jenkins/tools/maven/apache-maven-3.0.5/boot/plexus-classworlds-2.4.jar org.jvnet.hudson.maven3.agent.Maven3Main /home/jenkins/tools/maven/apache-maven-3.0.5 /home/jenkins/jenkins-slave/remoting.jar /home/jenkins/jenkins-slave/maven3-interceptor.jar /home/jenkins/jenkins-slave/maven3-interceptor-commons.jar 38313
Java HotSpot(TM) 64-Bit Server VM warning: ignoring option MaxPermSize=512m; support was removed in 8.0
<===[JENKINS REMOTING CAPACITY]===>   channel started
Executing Maven:  -B -f <https://builds.apache.org/job/ctakes-trunk-compiletest/ws/pom.xml> -Dmaven.repo.local=/home/jenkins/jenkins-slave/maven-repositories/1 clean compile test
[INFO] Scanning for projects...
Downloading: http://repo.maven.apache.org/maven2/org/apache/maven/wagon/wagon-http-lightweight/2.2/wagon-http-lightweight-2.2.pom
[ERROR] The build could not read 1 project -> [Help 1]
[ERROR]   
[ERROR]   The project org.apache.ctakes:ctakes-ytex:4.0.1-SNAPSHOT (<https://builds.apache.org/job/ctakes-trunk-compiletest/ws/ctakes-ytex/pom.xml)> has 1 error
[ERROR]     Unresolveable build extension: Plugin org.apache.maven.wagon:wagon-http-lightweight:2.2 or one of its dependencies could not be resolved: Failed to collect dependencies for org.apache.maven.wagon:wagon-http-lightweight:jar:2.2 (): Failed to read artifact descriptor for org.apache.maven.wagon:wagon-http-lightweight:jar:2.2: Could not transfer artifact org.apache.maven.wagon:wagon-http-lightweight:pom:2.2 from/to central (http://repo.maven.apache.org/maven2): Failed to transfer file: http://repo.maven.apache.org/maven2/org/apache/maven/wagon/wagon-http-lightweight/2.2/wagon-http-lightweight-2.2.pom. Return code is: 501 , ReasonPhrase:HTTPS Required. -> [Help 2]
[ERROR] 
[ERROR] To see the full stack trace of the errors, re-run Maven with the -e switch.
[ERROR] Re-run Maven using the -X switch to enable full debug logging.
[ERROR] 
[ERROR] For more information about the errors and possible solutions, please read the following articles:
[ERROR] [Help 1] http://cwiki.apache.org/confluence/display/MAVEN/ProjectBuildingException
[ERROR] [Help 2] http://cwiki.apache.org/confluence/display/MAVEN/PluginResolutionException
No mail will be sent out, as 'ctakes-trunk-compiletest » Apache cTAKES fhir support #1265' does not have a result yet. Please make sure you set a proper result in case of pipeline/build scripts.
No mail will be sent out, as 'ctakes-trunk-compiletest » Apache cTAKES ctakes-clinical-pipeline #1265' does not have a result yet. Please make sure you set a proper result in case of pipeline/build scripts.
No mail will be sent out, as 'ctakes-trunk-compiletest » Apache cTAKES common type system #1265' does not have a result yet. Please make sure you set a proper result in case of pipeline/build scripts.
No mail will be sent out, as 'ctakes-trunk-compiletest » Apache cTAKES dictionary lookup #1265' does not have a result yet. Please make sure you set a proper result in case of pipeline/build scripts.
No mail will be sent out, as 'ctakes-trunk-compiletest » Apache cTAKES Constituency Parser #1265' does not have a result yet. Please make sure you set a proper result in case of pipeline/build scripts.
No mail will be sent out, as 'ctakes-trunk-compiletest » ctakes-examples-res #1265' does not have a result yet. Please make sure you set a proper result in case of pipeline/build scripts.
No mail will be sent out, as 'ctakes-trunk-compiletest » Apache cTAKES Temporal Information Extraction #1265' does not have a result yet. Please make sure you set a proper result in case of pipeline/build scripts.
No mail will be sent out, as 'ctakes-trunk-compiletest » Apache cTAKES Resources ctakes-chunker-res #1265' does not have a result yet. Please make sure you set a proper result in case of pipeline/build scripts.
No mail will be sent out, as 'ctakes-trunk-compiletest » Apache cTAKES Regression-test #1265' does not have a result yet. Please make sure you set a proper result in case of pipeline/build scripts.
No mail will be sent out, as 'ctakes-trunk-compiletest » Apache cTAKES Relation Extractor #1265' does not have a result yet. Please make sure you set a proper result in case of pipeline/build scripts.
No mail will be sent out, as 'ctakes-trunk-compiletest » ctakes-gui #1265' does not have a result yet. Please make sure you set a proper result in case of pipeline/build scripts.
No mail will be sent out, as 'ctakes-trunk-compiletest » Apache cTAKES document preprocessor #1265' does not have a result yet. Please make sure you set a proper result in case of pipeline/build scripts.
No mail will be sent out, as 'ctakes-trunk-compiletest » Apache cTAKES Resources assertion #1265' does not have a result yet. Please make sure you set a proper result in case of pipeline/build scripts.
No mail will be sent out, as 'ctakes-trunk-compiletest » Apache cTAKES Resources assertion-zoner #1265' does not have a result yet. Please make sure you set a proper result in case of pipeline/build scripts.
No mail will be sent out, as 'ctakes-trunk-compiletest » Apache cTAKES Assertion's zoner #1265' does not have a result yet. Please make sure you set a proper result in case of pipeline/build scripts.
No mail will be sent out, as 'ctakes-trunk-compiletest » Apache cTAKES Resources ne-contexts #1265' does not have a result yet. Please make sure you set a proper result in case of pipeline/build scripts.
No mail will be sent out, as 'ctakes-trunk-compiletest » Apache cTAKES Dockhand #1265' does not have a result yet. Please make sure you set a proper result in case of pipeline/build scripts.
No mail will be sent out, as 'ctakes-trunk-compiletest » Apache cTAKES Drug NER #1265' does not have a result yet. Please make sure you set a proper result in case of pipeline/build scripts.
No mail will be sent out, as 'ctakes-trunk-compiletest » Apache cTAKES YTEX Web #1265' does not have a result yet. Please make sure you set a proper result in case of pipeline/build scripts.
No mail will be sent out, as 'ctakes-trunk-compiletest » Apache cTAKES context dependent tokenizer #1265' does not have a result yet. Please make sure you set a proper result in case of pipeline/build scripts.
No mail will be sent out, as 'ctakes-trunk-compiletest » Apache cTAKES Resources side-effect #1265' does not have a result yet. Please make sure you set a proper result in case of pipeline/build scripts.
No mail will be sent out, as 'ctakes-trunk-compiletest » ctakes-examples #1265' does not have a result yet. Please make sure you set a proper result in case of pipeline/build scripts.
No mail will be sent out, as 'ctakes-trunk-compiletest » Apache cTAKES Resources dictionary-lookup-fast-res #1265' does not have a result yet. Please make sure you set a proper result in case of pipeline/build scripts.
No mail will be sent out, as 'ctakes-trunk-compiletest » Apache cTAKES dictionary lookup fast #1265' does not have a result yet. Please make sure you set a proper result in case of pipeline/build scripts.
No mail will be sent out, as 'ctakes-trunk-compiletest » Apache cTAKES named entity contexts #1265' does not have a result yet. Please make sure you set a proper result in case of pipeline/build scripts.
No mail will be sent out, as 'ctakes-trunk-compiletest » Apache cTAKES LVG lexical tools #1265' does not have a result yet. Please make sure you set a proper result in case of pipeline/build scripts.
No mail will be sent out, as 'ctakes-trunk-compiletest » Apache cTAKES Resources smoking-status #1265' does not have a result yet. Please make sure you set a proper result in case of pipeline/build scripts.
No mail will be sent out, as 'ctakes-trunk-compiletest » Apache cTAKES part-of-speech tagger #1265' does not have a result yet. Please make sure you set a proper result in case of pipeline/build scripts.
No mail will be sent out, as 'ctakes-trunk-compiletest » Apache cTAKES Side Effects #1265' does not have a result yet. Please make sure you set a proper result in case of pipeline/build scripts.
No mail will be sent out, as 'ctakes-trunk-compiletest » Apache cTAKES template filler #1265' does not have a result yet. Please make sure you set a proper result in case of pipeline/build scripts.
No mail will be sent out, as 'ctakes-trunk-compiletest » Apache cTAKES #1265' does not have a result yet. Please make sure you set a proper result in case of pipeline/build scripts.
No mail will be sent out, as 'ctakes-trunk-compiletest » Apache cTAKES chunker #1265' does not have a result yet. Please make sure you set a proper result in case of pipeline/build scripts.
No mail will be sent out, as 'ctakes-trunk-compiletest » Apache cTAKES Tiny Rest Service #1265' does not have a result yet. Please make sure you set a proper result in case of pipeline/build scripts.
No mail will be sent out, as 'ctakes-trunk-compiletest » Apache cTAKES Resources dependency-parser clearNLP #1265' does not have a result yet. Please make sure you set a proper result in case of pipeline/build scripts.
No mail will be sent out, as 'ctakes-trunk-compiletest » Apache cTAKES utils #1265' does not have a result yet. Please make sure you set a proper result in case of pipeline/build scripts.
No mail will be sent out, as 'ctakes-trunk-compiletest » Apache cTAKES Resources drug-ner #1265' does not have a result yet. Please make sure you set a proper result in case of pipeline/build scripts.
No mail will be sent out, as 'ctakes-trunk-compiletest » Apache cTAKES core #1265' does not have a result yet. Please make sure you set a proper result in case of pipeline/build scripts.
No mail will be sent out, as 'ctakes-trunk-compiletest » Apache cTAKES Dependency Parser #1265' does not have a result yet. Please make sure you set a proper result in case of pipeline/build scripts.
No mail will be sent out, as 'ctakes-trunk-compiletest » Apache cTAKES Distribution #1265' does not have a result yet. Please make sure you set a proper result in case of pipeline/build scripts.
No mail will be sent out, as 'ctakes-trunk-compiletest » Apache cTAKES Resources coreference #1265' does not have a result yet. Please make sure you set a proper result in case of pipeline/build scripts.
No mail will be sent out, as 'ctakes-trunk-compiletest » Apache cTAKES CoReference Resolver #1265' does not have a result yet. Please make sure you set a proper result in case of pipeline/build scripts.
No mail will be sent out, as 'ctakes-trunk-compiletest » Apache cTAKES Assertion #1265' does not have a result yet. Please make sure you set a proper result in case of pipeline/build scripts.
No mail will be sent out, as 'ctakes-trunk-compiletest » ctakes-clinical-pipeline-res #1265' does not have a result yet. Please make sure you set a proper result in case of pipeline/build scripts.
No mail will be sent out, as 'ctakes-trunk-compiletest » Apache cTAKES Resources ctakes-ytex-res #1265' does not have a result yet. Please make sure you set a proper result in case of pipeline/build scripts.
No mail will be sent out, as 'ctakes-trunk-compiletest » Apache cTAKES Resources dictionary-lookup #1265' does not have a result yet. Please make sure you set a proper result in case of pipeline/build scripts.
No mail will be sent out, as 'ctakes-trunk-compiletest » Apache cTAKES Resources temporal #1265' does not have a result yet. Please make sure you set a proper result in case of pipeline/build scripts.
No mail will be sent out, as 'ctakes-trunk-compiletest » ctakes-gui-res #1265' does not have a result yet. Please make sure you set a proper result in case of pipeline/build scripts.
No mail will be sent out, as 'ctakes-trunk-compiletest » Apache cTAKES Resources lvg #1265' does not have a result yet. Please make sure you set a proper result in case of pipeline/build scripts.
No mail will be sent out, as 'ctakes-trunk-compiletest » Apache cTAKES YTEX #1265' does not have a result yet. Please make sure you set a proper result in case of pipeline/build scripts.
No mail will be sent out, as 'ctakes-trunk-compiletest » Apache cTAKES Resources relation-extractor #1265' does not have a result yet. Please make sure you set a proper result in case of pipeline/build scripts.
No mail will be sent out, as 'ctakes-trunk-compiletest » Apache cTAKES Resources constituency-parser #1265' does not have a result yet. Please make sure you set a proper result in case of pipeline/build scripts.
No mail will be sent out, as 'ctakes-trunk-compiletest » Apache cTAKES Resources core #1265' does not have a result yet. Please make sure you set a proper result in case of pipeline/build scripts.
No mail will be sent out, as 'ctakes-trunk-compiletest » Apache cTAKES Resources dependency-parser #1265' does not have a result yet. Please make sure you set a proper result in case of pipeline/build scripts.
No mail will be sent out, as 'ctakes-trunk-compiletest » Apache cTAKES Smoking Status #1265' does not have a result yet. Please make sure you set a proper result in case of pipeline/build scripts.
No mail will be sent out, as 'ctakes-trunk-compiletest » Apache cTAKES Resources pos-tagger #1265' does not have a result yet. Please make sure you set a proper result in case of pipeline/build scripts.
No mail will be sent out, as 'ctakes-trunk-compiletest » Apache cTAKES YTEX UIMA #1265' does not have a result yet. Please make sure you set a proper result in case of pipeline/build scripts.
channel stopped
[ctakes-trunk-compiletest] $ /bin/bash -xe /tmp/jenkins5083045160629802290.sh
+ rm -fr '/tmp/ctakes-*'

Build failed in Jenkins: ctakes-trunk-compiletest #1264

Posted by Apache Jenkins Server <je...@builds.apache.org>.
See <https://builds.apache.org/job/ctakes-trunk-compiletest/1264/display/redirect?page=changes>

Changes:

[seanfinan] Don't add Simple_Segment title.
use addToIndexes.


------------------------------------------
[...truncated 397.76 KB...]
A         ctakes-constituency-parser-res/src/main/resources/org/apache/ctakes/constituency/parser/models
AU        ctakes-constituency-parser-res/src/main/resources/org/apache/ctakes/constituency/parser/models/thyme.bin
AU        ctakes-constituency-parser-res/src/main/resources/org/apache/ctakes/constituency/parser/models/sharpacq-3.1.bin
AU        ctakes-constituency-parser-res/src/main/resources/org/apache/ctakes/constituency/parser/models/sharpacq-1.5.bin
A         ctakes-constituency-parser-res/src/test
A         ctakes-constituency-parser-res/LICENSE
A         ctakes-context-tokenizer
A         ctakes-context-tokenizer/pom.xml
A         ctakes-context-tokenizer/src
A         ctakes-context-tokenizer/src/main
A         ctakes-context-tokenizer/src/main/java
A         ctakes-context-tokenizer/src/main/java/org
A         ctakes-context-tokenizer/src/main/java/org/apache
A         ctakes-context-tokenizer/src/main/java/org/apache/ctakes
A         ctakes-context-tokenizer/src/main/java/org/apache/ctakes/contexttokenizer
A         ctakes-context-tokenizer/src/main/java/org/apache/ctakes/contexttokenizer/ae
A         ctakes-context-tokenizer/src/main/java/org/apache/ctakes/contexttokenizer/ae/ContextDependentTokenizerAnnotator.java
A         ctakes-context-tokenizer/src/main/java/org/apache/ctakes/context
A         ctakes-context-tokenizer/src/test
A         ctakes-context-tokenizer/src/test/java
A         ctakes-context-tokenizer/src/test/java/org
A         ctakes-context-tokenizer/src/test/java/org/apache
A         ctakes-context-tokenizer/src/test/java/org/apache/ctakes
A         ctakes-context-tokenizer/src/test/java/org/apache/ctakes/contexttokenizer
A         ctakes-context-tokenizer/src/test/java/org/apache/ctakes/contexttokenizer/ae
AU        ctakes-context-tokenizer/src/test/java/org/apache/ctakes/contexttokenizer/ae/TestContextDependentTokenizerAnnotator.java
A         ctakes-context-tokenizer/desc
A         ctakes-context-tokenizer/desc/analysis_engine
A         ctakes-context-tokenizer/desc/analysis_engine/AggregateAE.xml
A         ctakes-context-tokenizer/desc/analysis_engine/TestTAE.xml
A         ctakes-context-tokenizer/desc/analysis_engine/ContextDependentTokenizerAnnotator.xml
A         ctakes-context-tokenizer/LICENSE
A         ctakes-context-tokenizer/data
A         ctakes-context-tokenizer/data/test
A         ctakes-context-tokenizer/data/test/output
A         ctakes-context-tokenizer/resources
A         ctakes-context-tokenizer/resources/launch
A         ctakes-context-tokenizer/README
A         ctakes-drug-ner-res
A         ctakes-drug-ner-res/pom.xml
A         ctakes-drug-ner-res/src
A         ctakes-drug-ner-res/src/main
A         ctakes-drug-ner-res/src/main/resources
A         ctakes-drug-ner-res/src/main/resources/org
A         ctakes-drug-ner-res/src/main/resources/org/apache
A         ctakes-drug-ner-res/src/main/resources/org/apache/ctakes
A         ctakes-drug-ner-res/src/main/resources/org/apache/ctakes/drugner
A         ctakes-drug-ner-res/src/main/resources/org/apache/ctakes/drugner/types
A         ctakes-drug-ner-res/src/main/resources/org/apache/ctakes/drugner/types/TypeSystem.xml
A         ctakes-drug-ner-res/src/main/resources/org/apache/ctakes/drugner/lookup
A         ctakes-drug-ner-res/src/main/resources/org/apache/ctakes/drugner/lookup/LookupDesc_DrugNER.xml
A         ctakes-drug-ner-res/src/main/resources/org/apache/ctakes/drugner/tokenizer
A         ctakes-drug-ner-res/src/main/resources/org/apache/ctakes/drugner/tokenizer/hyphen_freq.txt
A         ctakes-drug-ner-res/src/test
A         ctakes-drug-ner-res/LICENSE
A         ctakes-ne-contexts-res
A         ctakes-ne-contexts-res/pom.xml
A         ctakes-ne-contexts-res/src
A         ctakes-ne-contexts-res/src/main
A         ctakes-ne-contexts-res/src/main/resources
A         ctakes-ne-contexts-res/src/main/resources/org
A         ctakes-ne-contexts-res/src/main/resources/org/apache
A         ctakes-ne-contexts-res/src/main/resources/org/apache/ctakes
A         ctakes-ne-contexts-res/src/main/resources/org/apache/ctakes/necontexts
A         ctakes-ne-contexts-res/src/main/resources/org/apache/ctakes/necontexts/pipeline
A         ctakes-ne-contexts-res/src/main/resources/org/apache/ctakes/necontexts/pipeline/NeContextsSubPipe.piper
A         ctakes-ne-contexts-res/src/main/resources/org/apache/ctakes/necontexts/desc
A         ctakes-ne-contexts-res/src/main/resources/org/apache/ctakes/necontexts/desc/NegationAnnotator.xml
A         ctakes-ne-contexts-res/src/test
A         ctakes-ne-contexts-res/LICENSE
A         ctakes-pos-tagger-res
A         ctakes-pos-tagger-res/pom.xml
A         ctakes-pos-tagger-res/src
A         ctakes-pos-tagger-res/src/main
A         ctakes-pos-tagger-res/src/main/resources
A         ctakes-pos-tagger-res/src/main/resources/org
A         ctakes-pos-tagger-res/src/main/resources/org/apache
A         ctakes-pos-tagger-res/src/main/resources/org/apache/ctakes
A         ctakes-pos-tagger-res/src/main/resources/org/apache/ctakes/postagger
A         ctakes-pos-tagger-res/src/main/resources/org/apache/ctakes/postagger/models
A         ctakes-pos-tagger-res/src/main/resources/org/apache/ctakes/postagger/models/clearnlp
AU        ctakes-pos-tagger-res/src/main/resources/org/apache/ctakes/postagger/models/clearnlp/mayo-en-pos-1.3.0.jar
AU        ctakes-pos-tagger-res/src/main/resources/org/apache/ctakes/postagger/models/mayo-pos.zip
A         ctakes-pos-tagger-res/src/main/resources/org/apache/ctakes/postagger/models/README
A         ctakes-pos-tagger-res/src/test
A         ctakes-pos-tagger-res/LICENSE
A         ctakes-side-effect-res
A         ctakes-side-effect-res/pom.xml
A         ctakes-side-effect-res/src
A         ctakes-side-effect-res/src/main
A         ctakes-side-effect-res/src/main/resources
A         ctakes-side-effect-res/src/main/resources/org
A         ctakes-side-effect-res/src/main/resources/org/apache
A         ctakes-side-effect-res/src/main/resources/org/apache/ctakes
A         ctakes-side-effect-res/src/main/resources/org/apache/ctakes/sideeffect
A         ctakes-side-effect-res/src/main/resources/org/apache/ctakes/sideeffect/lookup
A         ctakes-side-effect-res/src/main/resources/org/apache/ctakes/sideeffect/lookup/LookupDesc_sideEffect.xml
A         ctakes-side-effect-res/src/main/resources/org/apache/ctakes/sideeffect/lookup/LookupDesc_sideEffectUMLS.xml
A         ctakes-side-effect-res/src/main/resources/org/apache/ctakes/sideeffect/lookup/sideEffect_dictionary.txt
A         ctakes-side-effect-res/src/main/resources/org/apache/ctakes/sideeffect/lookup/additionalNE_dictionary.csv
A         ctakes-side-effect-res/src/main/resources/org/apache/ctakes/sideeffect/classifier
A         ctakes-side-effect-res/src/main/resources/org/apache/ctakes/sideeffect/classifier/libsvm_model_onWholeSet
A         ctakes-side-effect-res/src/main/resources/org/apache/ctakes/sideeffect/data
A         ctakes-side-effect-res/src/main/resources/org/apache/ctakes/sideeffect/data/sentenceLevelMetaKeywords.txt
A         ctakes-side-effect-res/src/test
A         ctakes-side-effect-res/LICENSE
A         ctakes-smoking-status-res
A         ctakes-smoking-status-res/pom.xml
A         ctakes-smoking-status-res/src
A         ctakes-smoking-status-res/src/main
A         ctakes-smoking-status-res/src/main/resources
A         ctakes-smoking-status-res/src/main/resources/org
A         ctakes-smoking-status-res/src/main/resources/org/apache
A         ctakes-smoking-status-res/src/main/resources/org/apache/ctakes
A         ctakes-smoking-status-res/src/main/resources/org/apache/ctakes/smokingstatus
A         ctakes-smoking-status-res/src/main/resources/org/apache/ctakes/smokingstatus/analysis_engine
A         ctakes-smoking-status-res/src/main/resources/org/apache/ctakes/smokingstatus/analysis_engine/KuRuleBasedClassifierAnnotator.xml
A         ctakes-smoking-status-res/src/main/resources/org/apache/ctakes/smokingstatus/analysis_engine/ProductionPostSentenceAggregate_step2_libsvm.xml
A         ctakes-smoking-status-res/src/main/resources/org/apache/ctakes/smokingstatus/analysis_engine/SmokingStatusDictionaryLookupAnnotator.xml
A         ctakes-smoking-status-res/src/main/resources/org/apache/ctakes/smokingstatus/analysis_engine/ArtificialSentenceAnnotator.xml
A         ctakes-smoking-status-res/src/main/resources/org/apache/ctakes/smokingstatus/analysis_engine/ProductionPostSentenceAggregate_step1.xml
A         ctakes-smoking-status-res/src/main/resources/org/apache/ctakes/smokingstatus/analysis_engine/SentenceAdjuster.xml
A         ctakes-smoking-status-res/src/main/resources/org/apache/ctakes/smokingstatus/analysis_engine/PcsClassifierAnnotator_libsvm.xml
A         ctakes-smoking-status-res/src/main/resources/org/apache/ctakes/smokingstatus/data
A         ctakes-smoking-status-res/src/main/resources/org/apache/ctakes/smokingstatus/data/KU
A         ctakes-smoking-status-res/src/main/resources/org/apache/ctakes/smokingstatus/data/KU/keywords.txt
A         ctakes-smoking-status-res/src/main/resources/org/apache/ctakes/smokingstatus/data/KU/unknown_words.txt
A         ctakes-smoking-status-res/src/main/resources/org/apache/ctakes/smokingstatus/data/nonsmoker.dictionary
A         ctakes-smoking-status-res/src/main/resources/org/apache/ctakes/smokingstatus/data/context
A         ctakes-smoking-status-res/src/main/resources/org/apache/ctakes/smokingstatus/data/context/negationContradictionWords.txt
A         ctakes-smoking-status-res/src/main/resources/org/apache/ctakes/smokingstatus/data/context/boundaryData.txt
A         ctakes-smoking-status-res/src/main/resources/org/apache/ctakes/smokingstatus/data/smoker.dictionary
A         ctakes-smoking-status-res/src/main/resources/org/apache/ctakes/smokingstatus/data/PCS
A         ctakes-smoking-status-res/src/main/resources/org/apache/ctakes/smokingstatus/data/PCS/stopwords_PCS.txt
A         ctakes-smoking-status-res/src/main/resources/org/apache/ctakes/smokingstatus/data/PCS/pcs_libsvm-2.91.model
A         ctakes-smoking-status-res/src/main/resources/org/apache/ctakes/smokingstatus/data/PCS/keywords_PCS.txt
A         ctakes-smoking-status-res/src/main/resources/org/apache/ctakes/smokingstatus/data/SmokingStatusLookupConfig.xml
A         ctakes-smoking-status-res/src/test
A         ctakes-smoking-status-res/LICENSE
A         ctakes-template-filler
AU        ctakes-template-filler/pom.xml
A         ctakes-template-filler/desc
A         ctakes-template-filler/desc/analysis_engine
AU        ctakes-template-filler/desc/analysis_engine/AggregateTemplateFiller.xml
AU        ctakes-template-filler/desc/analysis_engine/RelationExtractorAggregateWithoutOrangeBook.xml
AU        ctakes-template-filler/desc/analysis_engine/TemplateFillerAnnotator.xml
A         ctakes-template-filler/src
A         ctakes-template-filler/src/main
A         ctakes-template-filler/src/main/java
A         ctakes-template-filler/src/main/java/org
A         ctakes-template-filler/src/main/java/org/apache
A         ctakes-template-filler/src/main/java/org/apache/ctakes
A         ctakes-template-filler/src/main/java/org/apache/ctakes/template
A         ctakes-template-filler/src/main/java/org/apache/ctakes/template/filler
A         ctakes-template-filler/src/main/java/org/apache/ctakes/template/filler/ae
AU        ctakes-template-filler/src/main/java/org/apache/ctakes/template/filler/ae/TemplateFillerAnnotator.java
A         ctakes-template-filler/src/main/resources
A         ctakes-template-filler/src/test
A         ctakes-template-filler/src/test/java
A         ctakes-template-filler/src/test/resources
A         README
AU        KEYS
A         NOTICE
A         LICENSE
 U        .
At revision 1874145

Parsing POMs
Modules changed, recalculating dependency graph
Established TCP socket on 35115
maven3-agent.jar already up to date
maven3-interceptor.jar already up to date
maven3-interceptor-commons.jar already up to date
[ctakes-trunk-compiletest] $ /home/jenkins/tools/java/latest1.8/bin/java -Xmx4g -Xms256m -XX:MaxPermSize=512m -cp /home/jenkins/jenkins-slave/maven3-agent.jar:/home/jenkins/tools/maven/apache-maven-3.0.5/boot/plexus-classworlds-2.4.jar org.jvnet.hudson.maven3.agent.Maven3Main /home/jenkins/tools/maven/apache-maven-3.0.5 /home/jenkins/jenkins-slave/remoting.jar /home/jenkins/jenkins-slave/maven3-interceptor.jar /home/jenkins/jenkins-slave/maven3-interceptor-commons.jar 35115
Java HotSpot(TM) 64-Bit Server VM warning: ignoring option MaxPermSize=512m; support was removed in 8.0
<===[JENKINS REMOTING CAPACITY]===>   channel started
Executing Maven:  -B -f <https://builds.apache.org/job/ctakes-trunk-compiletest/ws/pom.xml> -Dmaven.repo.local=/home/jenkins/jenkins-slave/maven-repositories/1 clean compile test
[INFO] Scanning for projects...
Downloading: http://repo.maven.apache.org/maven2/org/apache/maven/wagon/wagon-http-lightweight/2.2/wagon-http-lightweight-2.2.pom
[ERROR] The build could not read 1 project -> [Help 1]
[ERROR]   
[ERROR]   The project org.apache.ctakes:ctakes-ytex:4.0.1-SNAPSHOT (<https://builds.apache.org/job/ctakes-trunk-compiletest/ws/ctakes-ytex/pom.xml)> has 1 error
[ERROR]     Unresolveable build extension: Plugin org.apache.maven.wagon:wagon-http-lightweight:2.2 or one of its dependencies could not be resolved: Failed to collect dependencies for org.apache.maven.wagon:wagon-http-lightweight:jar:2.2 (): Failed to read artifact descriptor for org.apache.maven.wagon:wagon-http-lightweight:jar:2.2: Could not transfer artifact org.apache.maven.wagon:wagon-http-lightweight:pom:2.2 from/to central (http://repo.maven.apache.org/maven2): Failed to transfer file: http://repo.maven.apache.org/maven2/org/apache/maven/wagon/wagon-http-lightweight/2.2/wagon-http-lightweight-2.2.pom. Return code is: 501 , ReasonPhrase:HTTPS Required. -> [Help 2]
[ERROR] 
[ERROR] To see the full stack trace of the errors, re-run Maven with the -e switch.
[ERROR] Re-run Maven using the -X switch to enable full debug logging.
[ERROR] 
[ERROR] For more information about the errors and possible solutions, please read the following articles:
[ERROR] [Help 1] http://cwiki.apache.org/confluence/display/MAVEN/ProjectBuildingException
[ERROR] [Help 2] http://cwiki.apache.org/confluence/display/MAVEN/PluginResolutionException
No mail will be sent out, as 'ctakes-trunk-compiletest » Apache cTAKES fhir support #1264' does not have a result yet. Please make sure you set a proper result in case of pipeline/build scripts.
No mail will be sent out, as 'ctakes-trunk-compiletest » Apache cTAKES ctakes-clinical-pipeline #1264' does not have a result yet. Please make sure you set a proper result in case of pipeline/build scripts.
No mail will be sent out, as 'ctakes-trunk-compiletest » Apache cTAKES common type system #1264' does not have a result yet. Please make sure you set a proper result in case of pipeline/build scripts.
No mail will be sent out, as 'ctakes-trunk-compiletest » Apache cTAKES dictionary lookup #1264' does not have a result yet. Please make sure you set a proper result in case of pipeline/build scripts.
No mail will be sent out, as 'ctakes-trunk-compiletest » Apache cTAKES Constituency Parser #1264' does not have a result yet. Please make sure you set a proper result in case of pipeline/build scripts.
No mail will be sent out, as 'ctakes-trunk-compiletest » ctakes-examples-res #1264' does not have a result yet. Please make sure you set a proper result in case of pipeline/build scripts.
No mail will be sent out, as 'ctakes-trunk-compiletest » Apache cTAKES Temporal Information Extraction #1264' does not have a result yet. Please make sure you set a proper result in case of pipeline/build scripts.
No mail will be sent out, as 'ctakes-trunk-compiletest » Apache cTAKES Resources ctakes-chunker-res #1264' does not have a result yet. Please make sure you set a proper result in case of pipeline/build scripts.
No mail will be sent out, as 'ctakes-trunk-compiletest » Apache cTAKES Regression-test #1264' does not have a result yet. Please make sure you set a proper result in case of pipeline/build scripts.
No mail will be sent out, as 'ctakes-trunk-compiletest » Apache cTAKES Relation Extractor #1264' does not have a result yet. Please make sure you set a proper result in case of pipeline/build scripts.
No mail will be sent out, as 'ctakes-trunk-compiletest » ctakes-gui #1264' does not have a result yet. Please make sure you set a proper result in case of pipeline/build scripts.
No mail will be sent out, as 'ctakes-trunk-compiletest » Apache cTAKES document preprocessor #1264' does not have a result yet. Please make sure you set a proper result in case of pipeline/build scripts.
No mail will be sent out, as 'ctakes-trunk-compiletest » Apache cTAKES Resources assertion #1264' does not have a result yet. Please make sure you set a proper result in case of pipeline/build scripts.
No mail will be sent out, as 'ctakes-trunk-compiletest » Apache cTAKES Resources assertion-zoner #1264' does not have a result yet. Please make sure you set a proper result in case of pipeline/build scripts.
No mail will be sent out, as 'ctakes-trunk-compiletest » Apache cTAKES Assertion's zoner #1264' does not have a result yet. Please make sure you set a proper result in case of pipeline/build scripts.
No mail will be sent out, as 'ctakes-trunk-compiletest » Apache cTAKES Resources ne-contexts #1264' does not have a result yet. Please make sure you set a proper result in case of pipeline/build scripts.
No mail will be sent out, as 'ctakes-trunk-compiletest » Apache cTAKES Dockhand #1264' does not have a result yet. Please make sure you set a proper result in case of pipeline/build scripts.
No mail will be sent out, as 'ctakes-trunk-compiletest » Apache cTAKES Drug NER #1264' does not have a result yet. Please make sure you set a proper result in case of pipeline/build scripts.
No mail will be sent out, as 'ctakes-trunk-compiletest » Apache cTAKES YTEX Web #1264' does not have a result yet. Please make sure you set a proper result in case of pipeline/build scripts.
No mail will be sent out, as 'ctakes-trunk-compiletest » Apache cTAKES context dependent tokenizer #1264' does not have a result yet. Please make sure you set a proper result in case of pipeline/build scripts.
No mail will be sent out, as 'ctakes-trunk-compiletest » Apache cTAKES Resources side-effect #1264' does not have a result yet. Please make sure you set a proper result in case of pipeline/build scripts.
No mail will be sent out, as 'ctakes-trunk-compiletest » ctakes-examples #1264' does not have a result yet. Please make sure you set a proper result in case of pipeline/build scripts.
No mail will be sent out, as 'ctakes-trunk-compiletest » Apache cTAKES Resources dictionary-lookup-fast-res #1264' does not have a result yet. Please make sure you set a proper result in case of pipeline/build scripts.
No mail will be sent out, as 'ctakes-trunk-compiletest » Apache cTAKES dictionary lookup fast #1264' does not have a result yet. Please make sure you set a proper result in case of pipeline/build scripts.
No mail will be sent out, as 'ctakes-trunk-compiletest » Apache cTAKES named entity contexts #1264' does not have a result yet. Please make sure you set a proper result in case of pipeline/build scripts.
No mail will be sent out, as 'ctakes-trunk-compiletest » Apache cTAKES LVG lexical tools #1264' does not have a result yet. Please make sure you set a proper result in case of pipeline/build scripts.
No mail will be sent out, as 'ctakes-trunk-compiletest » Apache cTAKES Resources smoking-status #1264' does not have a result yet. Please make sure you set a proper result in case of pipeline/build scripts.
No mail will be sent out, as 'ctakes-trunk-compiletest » Apache cTAKES part-of-speech tagger #1264' does not have a result yet. Please make sure you set a proper result in case of pipeline/build scripts.
No mail will be sent out, as 'ctakes-trunk-compiletest » Apache cTAKES Side Effects #1264' does not have a result yet. Please make sure you set a proper result in case of pipeline/build scripts.
No mail will be sent out, as 'ctakes-trunk-compiletest » Apache cTAKES template filler #1264' does not have a result yet. Please make sure you set a proper result in case of pipeline/build scripts.
No mail will be sent out, as 'ctakes-trunk-compiletest » Apache cTAKES #1264' does not have a result yet. Please make sure you set a proper result in case of pipeline/build scripts.
No mail will be sent out, as 'ctakes-trunk-compiletest » Apache cTAKES chunker #1264' does not have a result yet. Please make sure you set a proper result in case of pipeline/build scripts.
No mail will be sent out, as 'ctakes-trunk-compiletest » Apache cTAKES Tiny Rest Service #1264' does not have a result yet. Please make sure you set a proper result in case of pipeline/build scripts.
No mail will be sent out, as 'ctakes-trunk-compiletest » Apache cTAKES Resources dependency-parser clearNLP #1264' does not have a result yet. Please make sure you set a proper result in case of pipeline/build scripts.
No mail will be sent out, as 'ctakes-trunk-compiletest » Apache cTAKES utils #1264' does not have a result yet. Please make sure you set a proper result in case of pipeline/build scripts.
No mail will be sent out, as 'ctakes-trunk-compiletest » Apache cTAKES Resources drug-ner #1264' does not have a result yet. Please make sure you set a proper result in case of pipeline/build scripts.
No mail will be sent out, as 'ctakes-trunk-compiletest » Apache cTAKES core #1264' does not have a result yet. Please make sure you set a proper result in case of pipeline/build scripts.
No mail will be sent out, as 'ctakes-trunk-compiletest » Apache cTAKES Dependency Parser #1264' does not have a result yet. Please make sure you set a proper result in case of pipeline/build scripts.
No mail will be sent out, as 'ctakes-trunk-compiletest » Apache cTAKES Distribution #1264' does not have a result yet. Please make sure you set a proper result in case of pipeline/build scripts.
No mail will be sent out, as 'ctakes-trunk-compiletest » Apache cTAKES Resources coreference #1264' does not have a result yet. Please make sure you set a proper result in case of pipeline/build scripts.
No mail will be sent out, as 'ctakes-trunk-compiletest » Apache cTAKES CoReference Resolver #1264' does not have a result yet. Please make sure you set a proper result in case of pipeline/build scripts.
No mail will be sent out, as 'ctakes-trunk-compiletest » Apache cTAKES Assertion #1264' does not have a result yet. Please make sure you set a proper result in case of pipeline/build scripts.
No mail will be sent out, as 'ctakes-trunk-compiletest » ctakes-clinical-pipeline-res #1264' does not have a result yet. Please make sure you set a proper result in case of pipeline/build scripts.
No mail will be sent out, as 'ctakes-trunk-compiletest » Apache cTAKES Resources ctakes-ytex-res #1264' does not have a result yet. Please make sure you set a proper result in case of pipeline/build scripts.
No mail will be sent out, as 'ctakes-trunk-compiletest » Apache cTAKES Resources dictionary-lookup #1264' does not have a result yet. Please make sure you set a proper result in case of pipeline/build scripts.
No mail will be sent out, as 'ctakes-trunk-compiletest » Apache cTAKES Resources temporal #1264' does not have a result yet. Please make sure you set a proper result in case of pipeline/build scripts.
No mail will be sent out, as 'ctakes-trunk-compiletest » ctakes-gui-res #1264' does not have a result yet. Please make sure you set a proper result in case of pipeline/build scripts.
No mail will be sent out, as 'ctakes-trunk-compiletest » Apache cTAKES Resources lvg #1264' does not have a result yet. Please make sure you set a proper result in case of pipeline/build scripts.
No mail will be sent out, as 'ctakes-trunk-compiletest » Apache cTAKES YTEX #1264' does not have a result yet. Please make sure you set a proper result in case of pipeline/build scripts.
No mail will be sent out, as 'ctakes-trunk-compiletest » Apache cTAKES Resources relation-extractor #1264' does not have a result yet. Please make sure you set a proper result in case of pipeline/build scripts.
No mail will be sent out, as 'ctakes-trunk-compiletest » Apache cTAKES Resources constituency-parser #1264' does not have a result yet. Please make sure you set a proper result in case of pipeline/build scripts.
No mail will be sent out, as 'ctakes-trunk-compiletest » Apache cTAKES Resources core #1264' does not have a result yet. Please make sure you set a proper result in case of pipeline/build scripts.
No mail will be sent out, as 'ctakes-trunk-compiletest » Apache cTAKES Resources dependency-parser #1264' does not have a result yet. Please make sure you set a proper result in case of pipeline/build scripts.
No mail will be sent out, as 'ctakes-trunk-compiletest » Apache cTAKES Smoking Status #1264' does not have a result yet. Please make sure you set a proper result in case of pipeline/build scripts.
No mail will be sent out, as 'ctakes-trunk-compiletest » Apache cTAKES Resources pos-tagger #1264' does not have a result yet. Please make sure you set a proper result in case of pipeline/build scripts.
No mail will be sent out, as 'ctakes-trunk-compiletest » Apache cTAKES YTEX UIMA #1264' does not have a result yet. Please make sure you set a proper result in case of pipeline/build scripts.
channel stopped
[ctakes-trunk-compiletest] $ /bin/bash -xe /tmp/jenkins2169263223455717024.sh
+ rm -fr '/tmp/ctakes-*'

Build failed in Jenkins: ctakes-trunk-compiletest #1263

Posted by Apache Jenkins Server <je...@builds.apache.org>.
See <https://builds.apache.org/job/ctakes-trunk-compiletest/1263/display/redirect?page=changes>

Changes:

[tmill] Move relationLookup into a protected method so that implementers can do it differently (for training ML models - used by the ctakes-ade module).


------------------------------------------
[...truncated 397.76 KB...]
A         ctakes-constituency-parser-res/src/main/resources/org/apache/ctakes/constituency/parser/models
AU        ctakes-constituency-parser-res/src/main/resources/org/apache/ctakes/constituency/parser/models/thyme.bin
AU        ctakes-constituency-parser-res/src/main/resources/org/apache/ctakes/constituency/parser/models/sharpacq-3.1.bin
AU        ctakes-constituency-parser-res/src/main/resources/org/apache/ctakes/constituency/parser/models/sharpacq-1.5.bin
A         ctakes-constituency-parser-res/src/test
A         ctakes-constituency-parser-res/LICENSE
A         ctakes-context-tokenizer
A         ctakes-context-tokenizer/pom.xml
A         ctakes-context-tokenizer/src
A         ctakes-context-tokenizer/src/main
A         ctakes-context-tokenizer/src/main/java
A         ctakes-context-tokenizer/src/main/java/org
A         ctakes-context-tokenizer/src/main/java/org/apache
A         ctakes-context-tokenizer/src/main/java/org/apache/ctakes
A         ctakes-context-tokenizer/src/main/java/org/apache/ctakes/contexttokenizer
A         ctakes-context-tokenizer/src/main/java/org/apache/ctakes/contexttokenizer/ae
A         ctakes-context-tokenizer/src/main/java/org/apache/ctakes/contexttokenizer/ae/ContextDependentTokenizerAnnotator.java
A         ctakes-context-tokenizer/src/main/java/org/apache/ctakes/context
A         ctakes-context-tokenizer/src/test
A         ctakes-context-tokenizer/src/test/java
A         ctakes-context-tokenizer/src/test/java/org
A         ctakes-context-tokenizer/src/test/java/org/apache
A         ctakes-context-tokenizer/src/test/java/org/apache/ctakes
A         ctakes-context-tokenizer/src/test/java/org/apache/ctakes/contexttokenizer
A         ctakes-context-tokenizer/src/test/java/org/apache/ctakes/contexttokenizer/ae
AU        ctakes-context-tokenizer/src/test/java/org/apache/ctakes/contexttokenizer/ae/TestContextDependentTokenizerAnnotator.java
A         ctakes-context-tokenizer/desc
A         ctakes-context-tokenizer/desc/analysis_engine
A         ctakes-context-tokenizer/desc/analysis_engine/AggregateAE.xml
A         ctakes-context-tokenizer/desc/analysis_engine/TestTAE.xml
A         ctakes-context-tokenizer/desc/analysis_engine/ContextDependentTokenizerAnnotator.xml
A         ctakes-context-tokenizer/LICENSE
A         ctakes-context-tokenizer/data
A         ctakes-context-tokenizer/data/test
A         ctakes-context-tokenizer/data/test/output
A         ctakes-context-tokenizer/resources
A         ctakes-context-tokenizer/resources/launch
A         ctakes-context-tokenizer/README
A         ctakes-drug-ner-res
A         ctakes-drug-ner-res/pom.xml
A         ctakes-drug-ner-res/src
A         ctakes-drug-ner-res/src/main
A         ctakes-drug-ner-res/src/main/resources
A         ctakes-drug-ner-res/src/main/resources/org
A         ctakes-drug-ner-res/src/main/resources/org/apache
A         ctakes-drug-ner-res/src/main/resources/org/apache/ctakes
A         ctakes-drug-ner-res/src/main/resources/org/apache/ctakes/drugner
A         ctakes-drug-ner-res/src/main/resources/org/apache/ctakes/drugner/types
A         ctakes-drug-ner-res/src/main/resources/org/apache/ctakes/drugner/types/TypeSystem.xml
A         ctakes-drug-ner-res/src/main/resources/org/apache/ctakes/drugner/lookup
A         ctakes-drug-ner-res/src/main/resources/org/apache/ctakes/drugner/lookup/LookupDesc_DrugNER.xml
A         ctakes-drug-ner-res/src/main/resources/org/apache/ctakes/drugner/tokenizer
A         ctakes-drug-ner-res/src/main/resources/org/apache/ctakes/drugner/tokenizer/hyphen_freq.txt
A         ctakes-drug-ner-res/src/test
A         ctakes-drug-ner-res/LICENSE
A         ctakes-ne-contexts-res
A         ctakes-ne-contexts-res/pom.xml
A         ctakes-ne-contexts-res/src
A         ctakes-ne-contexts-res/src/main
A         ctakes-ne-contexts-res/src/main/resources
A         ctakes-ne-contexts-res/src/main/resources/org
A         ctakes-ne-contexts-res/src/main/resources/org/apache
A         ctakes-ne-contexts-res/src/main/resources/org/apache/ctakes
A         ctakes-ne-contexts-res/src/main/resources/org/apache/ctakes/necontexts
A         ctakes-ne-contexts-res/src/main/resources/org/apache/ctakes/necontexts/pipeline
A         ctakes-ne-contexts-res/src/main/resources/org/apache/ctakes/necontexts/pipeline/NeContextsSubPipe.piper
A         ctakes-ne-contexts-res/src/main/resources/org/apache/ctakes/necontexts/desc
A         ctakes-ne-contexts-res/src/main/resources/org/apache/ctakes/necontexts/desc/NegationAnnotator.xml
A         ctakes-ne-contexts-res/src/test
A         ctakes-ne-contexts-res/LICENSE
A         ctakes-pos-tagger-res
A         ctakes-pos-tagger-res/pom.xml
A         ctakes-pos-tagger-res/src
A         ctakes-pos-tagger-res/src/main
A         ctakes-pos-tagger-res/src/main/resources
A         ctakes-pos-tagger-res/src/main/resources/org
A         ctakes-pos-tagger-res/src/main/resources/org/apache
A         ctakes-pos-tagger-res/src/main/resources/org/apache/ctakes
A         ctakes-pos-tagger-res/src/main/resources/org/apache/ctakes/postagger
A         ctakes-pos-tagger-res/src/main/resources/org/apache/ctakes/postagger/models
A         ctakes-pos-tagger-res/src/main/resources/org/apache/ctakes/postagger/models/clearnlp
AU        ctakes-pos-tagger-res/src/main/resources/org/apache/ctakes/postagger/models/clearnlp/mayo-en-pos-1.3.0.jar
AU        ctakes-pos-tagger-res/src/main/resources/org/apache/ctakes/postagger/models/mayo-pos.zip
A         ctakes-pos-tagger-res/src/main/resources/org/apache/ctakes/postagger/models/README
A         ctakes-pos-tagger-res/src/test
A         ctakes-pos-tagger-res/LICENSE
A         ctakes-side-effect-res
A         ctakes-side-effect-res/pom.xml
A         ctakes-side-effect-res/src
A         ctakes-side-effect-res/src/main
A         ctakes-side-effect-res/src/main/resources
A         ctakes-side-effect-res/src/main/resources/org
A         ctakes-side-effect-res/src/main/resources/org/apache
A         ctakes-side-effect-res/src/main/resources/org/apache/ctakes
A         ctakes-side-effect-res/src/main/resources/org/apache/ctakes/sideeffect
A         ctakes-side-effect-res/src/main/resources/org/apache/ctakes/sideeffect/lookup
A         ctakes-side-effect-res/src/main/resources/org/apache/ctakes/sideeffect/lookup/LookupDesc_sideEffect.xml
A         ctakes-side-effect-res/src/main/resources/org/apache/ctakes/sideeffect/lookup/LookupDesc_sideEffectUMLS.xml
A         ctakes-side-effect-res/src/main/resources/org/apache/ctakes/sideeffect/lookup/sideEffect_dictionary.txt
A         ctakes-side-effect-res/src/main/resources/org/apache/ctakes/sideeffect/lookup/additionalNE_dictionary.csv
A         ctakes-side-effect-res/src/main/resources/org/apache/ctakes/sideeffect/classifier
A         ctakes-side-effect-res/src/main/resources/org/apache/ctakes/sideeffect/classifier/libsvm_model_onWholeSet
A         ctakes-side-effect-res/src/main/resources/org/apache/ctakes/sideeffect/data
A         ctakes-side-effect-res/src/main/resources/org/apache/ctakes/sideeffect/data/sentenceLevelMetaKeywords.txt
A         ctakes-side-effect-res/src/test
A         ctakes-side-effect-res/LICENSE
A         ctakes-smoking-status-res
A         ctakes-smoking-status-res/pom.xml
A         ctakes-smoking-status-res/src
A         ctakes-smoking-status-res/src/main
A         ctakes-smoking-status-res/src/main/resources
A         ctakes-smoking-status-res/src/main/resources/org
A         ctakes-smoking-status-res/src/main/resources/org/apache
A         ctakes-smoking-status-res/src/main/resources/org/apache/ctakes
A         ctakes-smoking-status-res/src/main/resources/org/apache/ctakes/smokingstatus
A         ctakes-smoking-status-res/src/main/resources/org/apache/ctakes/smokingstatus/analysis_engine
A         ctakes-smoking-status-res/src/main/resources/org/apache/ctakes/smokingstatus/analysis_engine/KuRuleBasedClassifierAnnotator.xml
A         ctakes-smoking-status-res/src/main/resources/org/apache/ctakes/smokingstatus/analysis_engine/ProductionPostSentenceAggregate_step2_libsvm.xml
A         ctakes-smoking-status-res/src/main/resources/org/apache/ctakes/smokingstatus/analysis_engine/SmokingStatusDictionaryLookupAnnotator.xml
A         ctakes-smoking-status-res/src/main/resources/org/apache/ctakes/smokingstatus/analysis_engine/ArtificialSentenceAnnotator.xml
A         ctakes-smoking-status-res/src/main/resources/org/apache/ctakes/smokingstatus/analysis_engine/ProductionPostSentenceAggregate_step1.xml
A         ctakes-smoking-status-res/src/main/resources/org/apache/ctakes/smokingstatus/analysis_engine/SentenceAdjuster.xml
A         ctakes-smoking-status-res/src/main/resources/org/apache/ctakes/smokingstatus/analysis_engine/PcsClassifierAnnotator_libsvm.xml
A         ctakes-smoking-status-res/src/main/resources/org/apache/ctakes/smokingstatus/data
A         ctakes-smoking-status-res/src/main/resources/org/apache/ctakes/smokingstatus/data/KU
A         ctakes-smoking-status-res/src/main/resources/org/apache/ctakes/smokingstatus/data/KU/keywords.txt
A         ctakes-smoking-status-res/src/main/resources/org/apache/ctakes/smokingstatus/data/KU/unknown_words.txt
A         ctakes-smoking-status-res/src/main/resources/org/apache/ctakes/smokingstatus/data/nonsmoker.dictionary
A         ctakes-smoking-status-res/src/main/resources/org/apache/ctakes/smokingstatus/data/context
A         ctakes-smoking-status-res/src/main/resources/org/apache/ctakes/smokingstatus/data/context/negationContradictionWords.txt
A         ctakes-smoking-status-res/src/main/resources/org/apache/ctakes/smokingstatus/data/context/boundaryData.txt
A         ctakes-smoking-status-res/src/main/resources/org/apache/ctakes/smokingstatus/data/smoker.dictionary
A         ctakes-smoking-status-res/src/main/resources/org/apache/ctakes/smokingstatus/data/PCS
A         ctakes-smoking-status-res/src/main/resources/org/apache/ctakes/smokingstatus/data/PCS/stopwords_PCS.txt
A         ctakes-smoking-status-res/src/main/resources/org/apache/ctakes/smokingstatus/data/PCS/pcs_libsvm-2.91.model
A         ctakes-smoking-status-res/src/main/resources/org/apache/ctakes/smokingstatus/data/PCS/keywords_PCS.txt
A         ctakes-smoking-status-res/src/main/resources/org/apache/ctakes/smokingstatus/data/SmokingStatusLookupConfig.xml
A         ctakes-smoking-status-res/src/test
A         ctakes-smoking-status-res/LICENSE
A         ctakes-template-filler
AU        ctakes-template-filler/pom.xml
A         ctakes-template-filler/desc
A         ctakes-template-filler/desc/analysis_engine
AU        ctakes-template-filler/desc/analysis_engine/AggregateTemplateFiller.xml
AU        ctakes-template-filler/desc/analysis_engine/RelationExtractorAggregateWithoutOrangeBook.xml
AU        ctakes-template-filler/desc/analysis_engine/TemplateFillerAnnotator.xml
A         ctakes-template-filler/src
A         ctakes-template-filler/src/main
A         ctakes-template-filler/src/main/java
A         ctakes-template-filler/src/main/java/org
A         ctakes-template-filler/src/main/java/org/apache
A         ctakes-template-filler/src/main/java/org/apache/ctakes
A         ctakes-template-filler/src/main/java/org/apache/ctakes/template
A         ctakes-template-filler/src/main/java/org/apache/ctakes/template/filler
A         ctakes-template-filler/src/main/java/org/apache/ctakes/template/filler/ae
AU        ctakes-template-filler/src/main/java/org/apache/ctakes/template/filler/ae/TemplateFillerAnnotator.java
A         ctakes-template-filler/src/main/resources
A         ctakes-template-filler/src/test
A         ctakes-template-filler/src/test/java
A         ctakes-template-filler/src/test/resources
A         README
AU        KEYS
A         NOTICE
A         LICENSE
 U        .
At revision 1872885

Parsing POMs
Modules changed, recalculating dependency graph
Established TCP socket on 44505
maven3-agent.jar already up to date
maven3-interceptor.jar already up to date
maven3-interceptor-commons.jar already up to date
[ctakes-trunk-compiletest] $ /home/jenkins/tools/java/latest1.8/bin/java -Xmx4g -Xms256m -XX:MaxPermSize=512m -cp /home/jenkins/jenkins-slave/maven3-agent.jar:/home/jenkins/tools/maven/apache-maven-3.0.5/boot/plexus-classworlds-2.4.jar org.jvnet.hudson.maven3.agent.Maven3Main /home/jenkins/tools/maven/apache-maven-3.0.5 /home/jenkins/jenkins-slave/remoting.jar /home/jenkins/jenkins-slave/maven3-interceptor.jar /home/jenkins/jenkins-slave/maven3-interceptor-commons.jar 44505
Java HotSpot(TM) 64-Bit Server VM warning: ignoring option MaxPermSize=512m; support was removed in 8.0
<===[JENKINS REMOTING CAPACITY]===>   channel started
Executing Maven:  -B -f <https://builds.apache.org/job/ctakes-trunk-compiletest/ws/pom.xml> -Dmaven.repo.local=/home/jenkins/jenkins-slave/maven-repositories/1 clean compile test
[INFO] Scanning for projects...
Downloading: http://repo.maven.apache.org/maven2/org/apache/maven/wagon/wagon-http-lightweight/2.2/wagon-http-lightweight-2.2.pom
[ERROR] The build could not read 1 project -> [Help 1]
[ERROR]   
[ERROR]   The project org.apache.ctakes:ctakes-ytex:4.0.1-SNAPSHOT (<https://builds.apache.org/job/ctakes-trunk-compiletest/ws/ctakes-ytex/pom.xml)> has 1 error
[ERROR]     Unresolveable build extension: Plugin org.apache.maven.wagon:wagon-http-lightweight:2.2 or one of its dependencies could not be resolved: Failed to collect dependencies for org.apache.maven.wagon:wagon-http-lightweight:jar:2.2 (): Failed to read artifact descriptor for org.apache.maven.wagon:wagon-http-lightweight:jar:2.2: Could not transfer artifact org.apache.maven.wagon:wagon-http-lightweight:pom:2.2 from/to central (http://repo.maven.apache.org/maven2): Failed to transfer file: http://repo.maven.apache.org/maven2/org/apache/maven/wagon/wagon-http-lightweight/2.2/wagon-http-lightweight-2.2.pom. Return code is: 501 , ReasonPhrase:HTTPS Required. -> [Help 2]
[ERROR] 
[ERROR] To see the full stack trace of the errors, re-run Maven with the -e switch.
[ERROR] Re-run Maven using the -X switch to enable full debug logging.
[ERROR] 
[ERROR] For more information about the errors and possible solutions, please read the following articles:
[ERROR] [Help 1] http://cwiki.apache.org/confluence/display/MAVEN/ProjectBuildingException
[ERROR] [Help 2] http://cwiki.apache.org/confluence/display/MAVEN/PluginResolutionException
No mail will be sent out, as 'ctakes-trunk-compiletest » Apache cTAKES fhir support #1263' does not have a result yet. Please make sure you set a proper result in case of pipeline/build scripts.
No mail will be sent out, as 'ctakes-trunk-compiletest » Apache cTAKES ctakes-clinical-pipeline #1263' does not have a result yet. Please make sure you set a proper result in case of pipeline/build scripts.
No mail will be sent out, as 'ctakes-trunk-compiletest » Apache cTAKES common type system #1263' does not have a result yet. Please make sure you set a proper result in case of pipeline/build scripts.
No mail will be sent out, as 'ctakes-trunk-compiletest » Apache cTAKES dictionary lookup #1263' does not have a result yet. Please make sure you set a proper result in case of pipeline/build scripts.
No mail will be sent out, as 'ctakes-trunk-compiletest » Apache cTAKES Constituency Parser #1263' does not have a result yet. Please make sure you set a proper result in case of pipeline/build scripts.
No mail will be sent out, as 'ctakes-trunk-compiletest » ctakes-examples-res #1263' does not have a result yet. Please make sure you set a proper result in case of pipeline/build scripts.
No mail will be sent out, as 'ctakes-trunk-compiletest » Apache cTAKES Temporal Information Extraction #1263' does not have a result yet. Please make sure you set a proper result in case of pipeline/build scripts.
No mail will be sent out, as 'ctakes-trunk-compiletest » Apache cTAKES Resources ctakes-chunker-res #1263' does not have a result yet. Please make sure you set a proper result in case of pipeline/build scripts.
No mail will be sent out, as 'ctakes-trunk-compiletest » Apache cTAKES Regression-test #1263' does not have a result yet. Please make sure you set a proper result in case of pipeline/build scripts.
No mail will be sent out, as 'ctakes-trunk-compiletest » Apache cTAKES Relation Extractor #1263' does not have a result yet. Please make sure you set a proper result in case of pipeline/build scripts.
No mail will be sent out, as 'ctakes-trunk-compiletest » ctakes-gui #1263' does not have a result yet. Please make sure you set a proper result in case of pipeline/build scripts.
No mail will be sent out, as 'ctakes-trunk-compiletest » Apache cTAKES document preprocessor #1263' does not have a result yet. Please make sure you set a proper result in case of pipeline/build scripts.
No mail will be sent out, as 'ctakes-trunk-compiletest » Apache cTAKES Resources assertion #1263' does not have a result yet. Please make sure you set a proper result in case of pipeline/build scripts.
No mail will be sent out, as 'ctakes-trunk-compiletest » Apache cTAKES Resources assertion-zoner #1263' does not have a result yet. Please make sure you set a proper result in case of pipeline/build scripts.
No mail will be sent out, as 'ctakes-trunk-compiletest » Apache cTAKES Assertion's zoner #1263' does not have a result yet. Please make sure you set a proper result in case of pipeline/build scripts.
No mail will be sent out, as 'ctakes-trunk-compiletest » Apache cTAKES Resources ne-contexts #1263' does not have a result yet. Please make sure you set a proper result in case of pipeline/build scripts.
No mail will be sent out, as 'ctakes-trunk-compiletest » Apache cTAKES Dockhand #1263' does not have a result yet. Please make sure you set a proper result in case of pipeline/build scripts.
No mail will be sent out, as 'ctakes-trunk-compiletest » Apache cTAKES Drug NER #1263' does not have a result yet. Please make sure you set a proper result in case of pipeline/build scripts.
No mail will be sent out, as 'ctakes-trunk-compiletest » Apache cTAKES YTEX Web #1263' does not have a result yet. Please make sure you set a proper result in case of pipeline/build scripts.
No mail will be sent out, as 'ctakes-trunk-compiletest » Apache cTAKES context dependent tokenizer #1263' does not have a result yet. Please make sure you set a proper result in case of pipeline/build scripts.
No mail will be sent out, as 'ctakes-trunk-compiletest » Apache cTAKES Resources side-effect #1263' does not have a result yet. Please make sure you set a proper result in case of pipeline/build scripts.
No mail will be sent out, as 'ctakes-trunk-compiletest » ctakes-examples #1263' does not have a result yet. Please make sure you set a proper result in case of pipeline/build scripts.
No mail will be sent out, as 'ctakes-trunk-compiletest » Apache cTAKES Resources dictionary-lookup-fast-res #1263' does not have a result yet. Please make sure you set a proper result in case of pipeline/build scripts.
No mail will be sent out, as 'ctakes-trunk-compiletest » Apache cTAKES dictionary lookup fast #1263' does not have a result yet. Please make sure you set a proper result in case of pipeline/build scripts.
No mail will be sent out, as 'ctakes-trunk-compiletest » Apache cTAKES named entity contexts #1263' does not have a result yet. Please make sure you set a proper result in case of pipeline/build scripts.
No mail will be sent out, as 'ctakes-trunk-compiletest » Apache cTAKES LVG lexical tools #1263' does not have a result yet. Please make sure you set a proper result in case of pipeline/build scripts.
No mail will be sent out, as 'ctakes-trunk-compiletest » Apache cTAKES Resources smoking-status #1263' does not have a result yet. Please make sure you set a proper result in case of pipeline/build scripts.
No mail will be sent out, as 'ctakes-trunk-compiletest » Apache cTAKES part-of-speech tagger #1263' does not have a result yet. Please make sure you set a proper result in case of pipeline/build scripts.
No mail will be sent out, as 'ctakes-trunk-compiletest » Apache cTAKES Side Effects #1263' does not have a result yet. Please make sure you set a proper result in case of pipeline/build scripts.
No mail will be sent out, as 'ctakes-trunk-compiletest » Apache cTAKES template filler #1263' does not have a result yet. Please make sure you set a proper result in case of pipeline/build scripts.
No mail will be sent out, as 'ctakes-trunk-compiletest » Apache cTAKES #1263' does not have a result yet. Please make sure you set a proper result in case of pipeline/build scripts.
No mail will be sent out, as 'ctakes-trunk-compiletest » Apache cTAKES chunker #1263' does not have a result yet. Please make sure you set a proper result in case of pipeline/build scripts.
No mail will be sent out, as 'ctakes-trunk-compiletest » Apache cTAKES Tiny Rest Service #1263' does not have a result yet. Please make sure you set a proper result in case of pipeline/build scripts.
No mail will be sent out, as 'ctakes-trunk-compiletest » Apache cTAKES Resources dependency-parser clearNLP #1263' does not have a result yet. Please make sure you set a proper result in case of pipeline/build scripts.
No mail will be sent out, as 'ctakes-trunk-compiletest » Apache cTAKES utils #1263' does not have a result yet. Please make sure you set a proper result in case of pipeline/build scripts.
No mail will be sent out, as 'ctakes-trunk-compiletest » Apache cTAKES Resources drug-ner #1263' does not have a result yet. Please make sure you set a proper result in case of pipeline/build scripts.
No mail will be sent out, as 'ctakes-trunk-compiletest » Apache cTAKES core #1263' does not have a result yet. Please make sure you set a proper result in case of pipeline/build scripts.
No mail will be sent out, as 'ctakes-trunk-compiletest » Apache cTAKES Dependency Parser #1263' does not have a result yet. Please make sure you set a proper result in case of pipeline/build scripts.
No mail will be sent out, as 'ctakes-trunk-compiletest » Apache cTAKES Distribution #1263' does not have a result yet. Please make sure you set a proper result in case of pipeline/build scripts.
No mail will be sent out, as 'ctakes-trunk-compiletest » Apache cTAKES Resources coreference #1263' does not have a result yet. Please make sure you set a proper result in case of pipeline/build scripts.
No mail will be sent out, as 'ctakes-trunk-compiletest » Apache cTAKES CoReference Resolver #1263' does not have a result yet. Please make sure you set a proper result in case of pipeline/build scripts.
No mail will be sent out, as 'ctakes-trunk-compiletest » Apache cTAKES Assertion #1263' does not have a result yet. Please make sure you set a proper result in case of pipeline/build scripts.
No mail will be sent out, as 'ctakes-trunk-compiletest » ctakes-clinical-pipeline-res #1263' does not have a result yet. Please make sure you set a proper result in case of pipeline/build scripts.
No mail will be sent out, as 'ctakes-trunk-compiletest » Apache cTAKES Resources ctakes-ytex-res #1263' does not have a result yet. Please make sure you set a proper result in case of pipeline/build scripts.
No mail will be sent out, as 'ctakes-trunk-compiletest » Apache cTAKES Resources dictionary-lookup #1263' does not have a result yet. Please make sure you set a proper result in case of pipeline/build scripts.
No mail will be sent out, as 'ctakes-trunk-compiletest » Apache cTAKES Resources temporal #1263' does not have a result yet. Please make sure you set a proper result in case of pipeline/build scripts.
No mail will be sent out, as 'ctakes-trunk-compiletest » ctakes-gui-res #1263' does not have a result yet. Please make sure you set a proper result in case of pipeline/build scripts.
No mail will be sent out, as 'ctakes-trunk-compiletest » Apache cTAKES Resources lvg #1263' does not have a result yet. Please make sure you set a proper result in case of pipeline/build scripts.
No mail will be sent out, as 'ctakes-trunk-compiletest » Apache cTAKES YTEX #1263' does not have a result yet. Please make sure you set a proper result in case of pipeline/build scripts.
No mail will be sent out, as 'ctakes-trunk-compiletest » Apache cTAKES Resources relation-extractor #1263' does not have a result yet. Please make sure you set a proper result in case of pipeline/build scripts.
No mail will be sent out, as 'ctakes-trunk-compiletest » Apache cTAKES Resources constituency-parser #1263' does not have a result yet. Please make sure you set a proper result in case of pipeline/build scripts.
No mail will be sent out, as 'ctakes-trunk-compiletest » Apache cTAKES Resources core #1263' does not have a result yet. Please make sure you set a proper result in case of pipeline/build scripts.
No mail will be sent out, as 'ctakes-trunk-compiletest » Apache cTAKES Resources dependency-parser #1263' does not have a result yet. Please make sure you set a proper result in case of pipeline/build scripts.
No mail will be sent out, as 'ctakes-trunk-compiletest » Apache cTAKES Smoking Status #1263' does not have a result yet. Please make sure you set a proper result in case of pipeline/build scripts.
No mail will be sent out, as 'ctakes-trunk-compiletest » Apache cTAKES Resources pos-tagger #1263' does not have a result yet. Please make sure you set a proper result in case of pipeline/build scripts.
No mail will be sent out, as 'ctakes-trunk-compiletest » Apache cTAKES YTEX UIMA #1263' does not have a result yet. Please make sure you set a proper result in case of pipeline/build scripts.
channel stopped
[ctakes-trunk-compiletest] $ /bin/bash -xe /tmp/jenkins7121670440895333788.sh
+ rm -fr '/tmp/ctakes-*'