You are viewing a plain text version of this content. The canonical link for it is here.
Posted to builds@beam.apache.org by Apache Jenkins Server <je...@builds.apache.org> on 2022/02/18 00:26:27 UTC
Build failed in Jenkins: beam_PostCommit_Python_Examples_Dataflow #54
See <https://ci-beam.apache.org/job/beam_PostCommit_Python_Examples_Dataflow/54/display/redirect?page=changes>
Changes:
[Pablo Estrada] Simplify README for new users
[laraschmidt] Fix final allowskew error to properly handle a large allowedSkew
[noreply] [BEAM-13946] Add get_dummies(), a non-deferred column operation on
------------------------------------------
[...truncated 19.91 KB...]
Using cached google_cloud_bigtable-1.7.0-py2.py3-none-any.whl (267 kB)
Collecting google-cloud-spanner<2,>=1.13.0
Using cached google_cloud_spanner-1.19.1-py2.py3-none-any.whl (255 kB)
Collecting grpcio-gcp<1,>=0.2.2
Using cached grpcio_gcp-0.2.2-py2.py3-none-any.whl (9.4 kB)
Collecting google-cloud-dlp<4,>=3.0.0
Using cached google_cloud_dlp-3.6.0-py2.py3-none-any.whl (111 kB)
Collecting google-cloud-language<2,>=1.3.0
Using cached google_cloud_language-1.3.0-py2.py3-none-any.whl (83 kB)
Collecting google-cloud-videointelligence<2,>=1.8.0
Using cached google_cloud_videointelligence-1.16.1-py2.py3-none-any.whl (183 kB)
Collecting google-cloud-vision<2,>=0.38.0
Using cached google_cloud_vision-1.0.0-py2.py3-none-any.whl (435 kB)
Collecting google-cloud-recommendations-ai<=0.2.0,>=0.1.0
Using cached google_cloud_recommendations_ai-0.2.0-py2.py3-none-any.whl (180 kB)
Collecting boto3>=1.9
Using cached boto3-1.21.2-py3-none-any.whl (132 kB)
Collecting freezegun>=0.3.12
Using cached freezegun-1.1.0-py2.py3-none-any.whl (16 kB)
Collecting mock<3.0.0,>=1.0.1
Using cached mock-2.0.0-py2.py3-none-any.whl (56 kB)
Collecting parameterized<0.8.0,>=0.7.1
Using cached parameterized-0.7.5-py2.py3-none-any.whl (17 kB)
Collecting pyhamcrest!=1.10.0,<2.0.0,>=1.9
Using cached PyHamcrest-1.10.1-py3-none-any.whl (48 kB)
Collecting pyyaml<7.0.0,>=3.12
Using cached PyYAML-6.0-cp38-cp38-manylinux_2_5_x86_64.manylinux1_x86_64.manylinux_2_12_x86_64.manylinux2010_x86_64.whl (701 kB)
Collecting requests_mock<2.0,>=1.7
Using cached requests_mock-1.9.3-py2.py3-none-any.whl (27 kB)
Collecting tenacity<6.0,>=5.0.2
Using cached tenacity-5.1.5-py2.py3-none-any.whl (34 kB)
Collecting pytest<5.0,>=4.4.0
Using cached pytest-4.6.11-py2.py3-none-any.whl (231 kB)
Collecting pytest-xdist<2,>=1.29.0
Using cached pytest_xdist-1.34.0-py2.py3-none-any.whl (36 kB)
Collecting pytest-timeout<2,>=1.3.3
Using cached pytest_timeout-1.4.2-py2.py3-none-any.whl (10 kB)
Collecting sqlalchemy<2.0,>=1.3
Using cached SQLAlchemy-1.4.31-cp38-cp38-manylinux_2_5_x86_64.manylinux1_x86_64.manylinux_2_17_x86_64.manylinux2014_x86_64.whl (1.6 MB)
Collecting psycopg2-binary<3.0.0,>=2.8.5
Using cached psycopg2_binary-2.9.3-cp38-cp38-manylinux_2_17_x86_64.manylinux2014_x86_64.whl (3.0 MB)
Collecting testcontainers[mysql]<4.0.0,>=3.0.3
Using cached testcontainers-3.4.2-py2.py3-none-any.whl (31 kB)
Collecting cryptography>=36.0.0
Using cached cryptography-36.0.1-cp36-abi3-manylinux_2_24_x86_64.whl (3.6 MB)
Requirement already satisfied: six>=1.11.0 in /home/jenkins/jenkins-slave/workspace/beam_PostCommit_Python_Examples_Dataflow/src/build/gradleenv/-1734967051/lib/python3.8/site-packages (from azure-core>=1.7.0->apache-beam==2.38.0.dev0) (1.16.0)
Collecting msrest>=0.6.21
Using cached msrest-0.6.21-py2.py3-none-any.whl (85 kB)
Collecting jmespath<1.0.0,>=0.7.1
Using cached jmespath-0.10.0-py2.py3-none-any.whl (24 kB)
Collecting botocore<1.25.0,>=1.24.2
Using cached botocore-1.24.2-py3-none-any.whl (8.5 MB)
Collecting s3transfer<0.6.0,>=0.5.0
Using cached s3transfer-0.5.1-py3-none-any.whl (79 kB)
Collecting cffi>=1.12
Using cached cffi-1.15.0-cp38-cp38-manylinux_2_12_x86_64.manylinux2010_x86_64.whl (446 kB)
Collecting fasteners>=0.14
Using cached fasteners-0.17.3-py3-none-any.whl (18 kB)
Collecting pyasn1-modules>=0.2.1
Using cached pyasn1_modules-0.2.8-py2.py3-none-any.whl (155 kB)
Collecting rsa<5,>=3.1.4
Using cached rsa-4.8-py3-none-any.whl (39 kB)
Requirement already satisfied: packaging>=14.3 in /home/jenkins/jenkins-slave/workspace/beam_PostCommit_Python_Examples_Dataflow/src/build/gradleenv/-1734967051/lib/python3.8/site-packages (from google-cloud-bigquery<3,>=1.6.0->apache-beam==2.38.0.dev0) (21.3)
Collecting google-api-core[grpc]<3.0.0dev,>=1.29.0
Using cached google_api_core-2.5.0-py2.py3-none-any.whl (111 kB)
Collecting google-resumable-media<3.0dev,>=0.6.0
Using cached google_resumable_media-2.2.1-py2.py3-none-any.whl (75 kB)
Collecting libcst>=0.2.5
Using cached libcst-0.4.1-cp38-cp38-manylinux_2_17_x86_64.manylinux2014_x86_64.whl (2.7 MB)
Collecting grpc-google-iam-v1<0.13dev,>=0.12.3
Using cached grpc_google_iam_v1-0.12.3-py3-none-any.whl
Collecting google-api-core[grpc]<3.0.0dev,>=1.29.0
Using cached google_api_core-1.31.5-py2.py3-none-any.whl (93 kB)
Collecting google-auth<3,>=1.18.0
Using cached google_auth-1.35.0-py2.py3-none-any.whl (152 kB)
Requirement already satisfied: setuptools>=40.3.0 in /home/jenkins/jenkins-slave/workspace/beam_PostCommit_Python_Examples_Dataflow/src/build/gradleenv/-1734967051/lib/python3.8/site-packages (from google-auth<3,>=1.18.0->apache-beam==2.38.0.dev0) (60.9.2)
Collecting overrides<7.0.0,>=6.0.1
Using cached overrides-6.1.0-py3-none-any.whl (14 kB)
Collecting grpcio-status>=1.18.0
Using cached grpcio_status-1.44.0-py3-none-any.whl (10.0 kB)
Collecting docopt
Using cached docopt-0.6.2-py2.py3-none-any.whl
Collecting pyparsing<3,>=2.4.2
Using cached pyparsing-2.4.7-py2.py3-none-any.whl (67 kB)
Collecting pbr>=0.11
Using cached pbr-5.8.1-py2.py3-none-any.whl (113 kB)
Collecting pyasn1>=0.1.7
Using cached pyasn1-0.4.8-py2.py3-none-any.whl (77 kB)
Requirement already satisfied: py>=1.5.0 in /home/jenkins/jenkins-slave/workspace/beam_PostCommit_Python_Examples_Dataflow/src/build/gradleenv/-1734967051/lib/python3.8/site-packages (from pytest<5.0,>=4.4.0->apache-beam==2.38.0.dev0) (1.11.0)
Collecting pluggy<1.0,>=0.12
Using cached pluggy-0.13.1-py2.py3-none-any.whl (18 kB)
Collecting attrs>=17.4.0
Using cached attrs-21.4.0-py2.py3-none-any.whl (60 kB)
Collecting more-itertools>=4.0.0
Using cached more_itertools-8.12.0-py3-none-any.whl (54 kB)
Collecting atomicwrites>=1.0
Using cached atomicwrites-1.4.0-py2.py3-none-any.whl (6.8 kB)
Collecting wcwidth
Using cached wcwidth-0.2.5-py2.py3-none-any.whl (30 kB)
Collecting pytest-forked
Using cached pytest_forked-1.4.0-py3-none-any.whl (4.9 kB)
Collecting execnet>=1.1
Using cached execnet-1.9.0-py2.py3-none-any.whl (39 kB)
Collecting charset-normalizer~=2.0.0
Using cached charset_normalizer-2.0.12-py3-none-any.whl (39 kB)
Collecting certifi>=2017.4.17
Using cached certifi-2021.10.8-py2.py3-none-any.whl (149 kB)
Collecting urllib3<1.27,>=1.21.1
Using cached urllib3-1.26.8-py2.py3-none-any.whl (138 kB)
Collecting idna<4,>=2.5
Using cached idna-3.3-py3-none-any.whl (61 kB)
Collecting greenlet!=0.4.17
Using cached greenlet-1.1.2-cp38-cp38-manylinux_2_17_x86_64.manylinux2014_x86_64.whl (156 kB)
Collecting deprecation
Using cached deprecation-2.1.0-py2.py3-none-any.whl (11 kB)
Collecting wrapt
Using cached wrapt-1.13.3-cp38-cp38-manylinux_2_5_x86_64.manylinux1_x86_64.manylinux_2_12_x86_64.manylinux2010_x86_64.whl (84 kB)
Collecting docker
Using cached docker-5.0.3-py2.py3-none-any.whl (146 kB)
Collecting pymysql
Using cached PyMySQL-1.0.2-py3-none-any.whl (43 kB)
Collecting pycparser
Using cached pycparser-2.21-py2.py3-none-any.whl (118 kB)
Collecting googleapis-common-protos<2.0dev,>=1.6.0
Using cached googleapis_common_protos-1.54.0-py2.py3-none-any.whl (207 kB)
Collecting google-crc32c<2.0dev,>=1.0
Using cached google_crc32c-1.3.0-cp38-cp38-manylinux_2_12_x86_64.manylinux2010_x86_64.whl (37 kB)
Collecting typing-inspect>=0.4.0
Using cached typing_inspect-0.7.1-py3-none-any.whl (8.4 kB)
Collecting isodate>=0.6.0
Using cached isodate-0.6.1-py2.py3-none-any.whl (41 kB)
Collecting requests-oauthlib>=0.5.0
Using cached requests_oauthlib-1.3.1-py2.py3-none-any.whl (23 kB)
Collecting typing-utils>=0.0.3
Using cached typing_utils-0.1.0-py3-none-any.whl (10 kB)
Collecting websocket-client>=0.32.0
Using cached websocket_client-1.2.3-py3-none-any.whl (53 kB)
Collecting oauthlib>=3.0.0
Using cached oauthlib-3.2.0-py3-none-any.whl (151 kB)
Collecting mypy-extensions>=0.3.0
Using cached mypy_extensions-0.4.3-py2.py3-none-any.whl (4.5 kB)
Building wheels for collected packages: apache-beam
Building wheel for apache-beam (setup.py): started
Building wheel for apache-beam (setup.py): finished with status 'done'
Created wheel for apache-beam: filename=apache_beam-2.38.0.dev0-py3-none-any.whl size=2661809 sha256=ec31c430e913f89038f96b342b606f934c982c8ebe6be3d9541aa9384a68c79d
Stored in directory: /home/jenkins/.cache/pip/wheels/67/0f/0c/bce1bfbf03152e083f20e586a27fed6496174151b99a55498f
Successfully built apache-beam
Installing collected packages: wcwidth, pytz, pyasn1, parameterized, mypy-extensions, docopt, crcmod, certifi, wrapt, websocket-client, urllib3, typing-utils, typing-extensions, tenacity, rsa, pyyaml, python-dateutil, pyparsing, pymysql, pymongo, pyhamcrest, pycparser, pyasn1-modules, psycopg2-binary, proto-plus, pluggy, pbr, orjson, oauthlib, numpy, more-itertools, jmespath, isodate, idna, greenlet, googleapis-common-protos, google-crc32c, fasteners, fastavro, execnet, dill, cloudpickle, charset-normalizer, cachetools, attrs, atomicwrites, typing-inspect, sqlalchemy, requests, pydot, pyarrow, pandas, overrides, mock, httplib2, grpcio-status, grpcio-gcp, google-resumable-media, google-auth, freezegun, cffi, botocore, s3transfer, requests-oauthlib, requests_mock, pytest, oauth2client, libcst, hdfs, grpc-google-iam-v1, google-api-core, docker, deprecation, cryptography, azure-core, testcontainers, pytest-timeout, pytest-forked, msrest, google-cloud-core, google-apitools, boto3, apache-beam, pytest-xdist, google-cloud-vision, google-cloud-videointelligence, google-cloud-spanner, google-cloud-recommendations-ai, google-cloud-pubsub, google-cloud-language, google-cloud-dlp, google-cloud-datastore, google-cloud-bigtable, google-cloud-bigquery-storage, google-cloud-bigquery, azure-storage-blob, google-cloud-pubsublite
Attempting uninstall: pyparsing
Found existing installation: pyparsing 3.0.7
Uninstalling pyparsing-3.0.7:
Successfully uninstalled pyparsing-3.0.7
Attempting uninstall: pluggy
Found existing installation: pluggy 1.0.0
Uninstalling pluggy-1.0.0:
Successfully uninstalled pluggy-1.0.0
Successfully installed apache-beam-2.38.0.dev0 atomicwrites-1.4.0 attrs-21.4.0 azure-core-1.22.1 azure-storage-blob-12.9.0 boto3-1.21.2 botocore-1.24.2 cachetools-4.2.4 certifi-2021.10.8 cffi-1.15.0 charset-normalizer-2.0.12 cloudpickle-2.0.0 crcmod-1.7 cryptography-36.0.1 deprecation-2.1.0 dill-0.3.1.1 docker-5.0.3 docopt-0.6.2 execnet-1.9.0 fastavro-1.4.9 fasteners-0.17.3 freezegun-1.1.0 google-api-core-1.31.5 google-apitools-0.5.31 google-auth-1.35.0 google-cloud-bigquery-2.33.0 google-cloud-bigquery-storage-2.11.0 google-cloud-bigtable-1.7.0 google-cloud-core-1.7.2 google-cloud-datastore-1.15.3 google-cloud-dlp-3.6.0 google-cloud-language-1.3.0 google-cloud-pubsub-2.9.0 google-cloud-pubsublite-1.3.0 google-cloud-recommendations-ai-0.2.0 google-cloud-spanner-1.19.1 google-cloud-videointelligence-1.16.1 google-cloud-vision-1.0.0 google-crc32c-1.3.0 google-resumable-media-2.2.1 googleapis-common-protos-1.54.0 greenlet-1.1.2 grpc-google-iam-v1-0.12.3 grpcio-gcp-0.2.2 grpcio-status-1.44.0 hdfs-2.6.0 httplib2-0.19.1 idna-3.3 isodate-0.6.1 jmespath-0.10.0 libcst-0.4.1 mock-2.0.0 more-itertools-8.12.0 msrest-0.6.21 mypy-extensions-0.4.3 numpy-1.21.5 oauth2client-4.1.3 oauthlib-3.2.0 orjson-3.6.7 overrides-6.1.0 pandas-1.4.1 parameterized-0.7.5 pbr-5.8.1 pluggy-0.13.1 proto-plus-1.20.2 psycopg2-binary-2.9.3 pyarrow-6.0.1 pyasn1-0.4.8 pyasn1-modules-0.2.8 pycparser-2.21 pydot-1.4.2 pyhamcrest-1.10.1 pymongo-3.12.3 pymysql-1.0.2 pyparsing-2.4.7 pytest-4.6.11 pytest-forked-1.4.0 pytest-timeout-1.4.2 pytest-xdist-1.34.0 python-dateutil-2.8.2 pytz-2021.3 pyyaml-6.0 requests-2.27.1 requests-oauthlib-1.3.1 requests_mock-1.9.3 rsa-4.8 s3transfer-0.5.1 sqlalchemy-1.4.31 tenacity-5.1.5 testcontainers-3.4.2 typing-extensions-4.1.1 typing-inspect-0.7.1 typing-utils-0.1.0 urllib3-1.26.8 wcwidth-0.2.5 websocket-client-1.2.3 wrapt-1.13.3
> Task :sdks:python:test-suites:dataflow:py38:examples
>>> RUNNING integration tests with pipeline options: --runner=TestDataflowRunner --project=apache-beam-testing --region=us-central1 --staging_location=gs://temp-storage-for-end-to-end-tests/staging-it --temp_location=gs://temp-storage-for-end-to-end-tests/temp-it --output=gs://temp-storage-for-end-to-end-tests/py-it-cloud/output --sdk_location=/home/jenkins/jenkins-slave/workspace/beam_PostCommit_Python_Examples_Dataflow/src/sdks/python/build/apache-beam.tar.gz --requirements_file=postcommit_requirements.txt --num_workers=1 --sleep_secs=20 --experiments=use_runner_v2 --experiments=shuffle_mode=appliance --experiments=beam_fn_api --kms_key_name=projects/apache-beam-testing/locations/global/keyRings/beam-it/cryptoKeys/test --dataflow_kms_key=projects/apache-beam-testing/locations/global/keyRings/beam-it/cryptoKeys/test
>>> pytest options: --capture=no --timeout=4500 --color=yes --log-cli-level=INFO --numprocesses=8 --dist=loadfile
>>> collect markers: -m=examples_postcommit and not no_xdist
[1m============================= test session starts ==============================[0m
platform linux -- Python 3.8.10, pytest-4.6.11, py-1.11.0, pluggy-0.13.1
rootdir: /home/jenkins/jenkins-slave/workspace/beam_PostCommit_Python_Examples_Dataflow/src/sdks/python, inifile: pytest.ini
plugins: xdist-1.34.0, timeout-1.4.2, forked-1.4.0, requests-mock-1.9.3
timeout: 4500.0s
timeout method: signal
timeout func_only: False
gw0 I / gw1 I / gw2 I / gw3 I / gw4 I / gw5 I / gw6 I / gw7 I
[1m[gw0] Python 3.8.10 (default, Nov 26 2021, 20:14:08) -- [GCC 9.3.0]
[0m[1m[gw3] Python 3.8.10 (default, Nov 26 2021, 20:14:08) -- [GCC 9.3.0]
[0m[1m[gw1] Python 3.8.10 (default, Nov 26 2021, 20:14:08) -- [GCC 9.3.0]
[0m[1m[gw7] Python 3.8.10 (default, Nov 26 2021, 20:14:08) -- [GCC 9.3.0]
[0m[1m[gw2] Python 3.8.10 (default, Nov 26 2021, 20:14:08) -- [GCC 9.3.0]
[0m[1m[gw4] Python 3.8.10 (default, Nov 26 2021, 20:14:08) -- [GCC 9.3.0]
[0m[1m[gw5] Python 3.8.10 (default, Nov 26 2021, 20:14:08) -- [GCC 9.3.0]
[0m[1m[gw6] Python 3.8.10 (default, Nov 26 2021, 20:14:08) -- [GCC 9.3.0]
[0mgw0 [18] / gw1 [18] / gw2 [18] / gw3 [18] / gw4 [18] / gw5 [18] / gw6 [18] / gw7 [18]
scheduling tests via LoadFileScheduling
apache_beam/examples/wordcount_debugging_test.py::WordCountDebuggingTest::test_basics
apache_beam/examples/wordcount_minimal_test.py::WordCountMinimalTest::test_basics
apache_beam/examples/wordcount_test.py::WordCountTest::test_basics
apache_beam/examples/complete/tfidf_test.py::TfIdfTest::test_basics
apache_beam/examples/complete/game/game_stats_it_test.py::GameStatsIT::test_game_stats_it
apache_beam/examples/complete/game/leader_board_it_test.py::LeaderBoardIT::test_leader_board_it
apache_beam/examples/complete/distribopt_test.py::DistribOptimizationTest::test_basics
apache_beam/examples/complete/juliaset/juliaset/juliaset_test.py::JuliaSetTest::test_generate_fractal_image
[gw6] [33mSKIPPED[0m apache_beam/examples/complete/juliaset/juliaset/juliaset_test.py::JuliaSetTest::test_generate_fractal_image
apache_beam/examples/complete/juliaset/juliaset/juliaset_test.py::JuliaSetTest::test_output_file_format
[gw2] [32mPASSED[0m apache_beam/examples/complete/tfidf_test.py::TfIdfTest::test_basics
apache_beam/examples/cookbook/mergecontacts_test.py::MergeContactsTest::test_mergecontacts
[gw7] [32mPASSED[0m apache_beam/examples/complete/distribopt_test.py::DistribOptimizationTest::test_basics
apache_beam/examples/cookbook/group_with_coder_test.py::GroupWithCoderTest::test_basics_with_type_check
[gw6] [32mPASSED[0m apache_beam/examples/complete/juliaset/juliaset/juliaset_test.py::JuliaSetTest::test_output_file_format
apache_beam/examples/dataframe/wordcount_test.py::WordCountTest::test_basics E0218 00:02:11.138268364 867228 fork_posix.cc:70] Fork support is only compatible with the epoll1 and poll polling strategies
E0218 00:02:12.090301729 867220 fork_posix.cc:70] Fork support is only compatible with the epoll1 and poll polling strategies
[gw2] [32mPASSED[0m apache_beam/examples/cookbook/mergecontacts_test.py::MergeContactsTest::test_mergecontacts
[gw7] [32mPASSED[0m apache_beam/examples/cookbook/group_with_coder_test.py::GroupWithCoderTest::test_basics_with_type_check
apache_beam/examples/cookbook/group_with_coder_test.py::GroupWithCoderTest::test_basics_without_type_check
[gw6] [32mPASSED[0m apache_beam/examples/dataframe/wordcount_test.py::WordCountTest::test_basics
[gw0] [32mPASSED[0m apache_beam/examples/wordcount_debugging_test.py::WordCountDebuggingTest::test_basics
apache_beam/examples/cookbook/bigquery_tornadoes_it_test.py::BigqueryTornadoesIT::test_bigquery_tornadoes_it
[gw1] [32mPASSED[0m apache_beam/examples/wordcount_test.py::WordCountTest::test_basics
apache_beam/examples/cookbook/filters_test.py::FiltersTest::test_filters_output_bigquery_matcher
[gw3] [32mPASSED[0m apache_beam/examples/wordcount_minimal_test.py::WordCountMinimalTest::test_basics
apache_beam/examples/cookbook/custom_ptransform_test.py::CustomCountTest::test_custom_ptransform_output_files_on_small_input
[gw3] [32mPASSED[0m apache_beam/examples/cookbook/custom_ptransform_test.py::CustomCountTest::test_custom_ptransform_output_files_on_small_input
[gw7] [32mPASSED[0m apache_beam/examples/cookbook/group_with_coder_test.py::GroupWithCoderTest::test_basics_without_type_check
[gw0] [32mPASSED[0m apache_beam/examples/cookbook/bigquery_tornadoes_it_test.py::BigqueryTornadoesIT::test_bigquery_tornadoes_it
[gw1] [32mPASSED[0m apache_beam/examples/cookbook/filters_test.py::FiltersTest::test_filters_output_bigquery_matcher
[gw5] [32mPASSED[0m apache_beam/examples/complete/game/leader_board_it_test.py::LeaderBoardIT::test_leader_board_it
apache_beam/examples/dataframe/flight_delays_it_test.py::FlightDelaysTest::test_flight_delays E0218 00:15:18.240066281 867228 fork_posix.cc:70] Fork support is only compatible with the epoll1 and poll polling strategies
[gw4] [32mPASSED[0m apache_beam/examples/complete/game/game_stats_it_test.py::GameStatsIT::test_game_stats_it
apache_beam/examples/cookbook/multiple_output_pardo_test.py::MultipleOutputParDo::test_multiple_output_pardo
[gw4] [32mPASSED[0m apache_beam/examples/cookbook/multiple_output_pardo_test.py::MultipleOutputParDo::test_multiple_output_pardo FATAL: command execution failed
java.io.IOException: Backing channel 'apache-beam-jenkins-8' is disconnected.
at hudson.remoting.RemoteInvocationHandler.channelOrFail(RemoteInvocationHandler.java:216)
at hudson.remoting.RemoteInvocationHandler.invoke(RemoteInvocationHandler.java:286)
at com.sun.proxy.$Proxy126.isAlive(Unknown Source)
at hudson.Launcher$RemoteLauncher$ProcImpl.isAlive(Launcher.java:1213)
at hudson.Launcher$RemoteLauncher$ProcImpl.join(Launcher.java:1205)
at hudson.Launcher$ProcStarter.join(Launcher.java:522)
at hudson.plugins.gradle.Gradle.perform(Gradle.java:317)
at hudson.tasks.BuildStepMonitor$1.perform(BuildStepMonitor.java:20)
at hudson.model.AbstractBuild$AbstractBuildExecution.perform(AbstractBuild.java:806)
at hudson.model.Build$BuildExecution.build(Build.java:198)
at hudson.model.Build$BuildExecution.doRun(Build.java:163)
at hudson.model.AbstractBuild$AbstractBuildExecution.run(AbstractBuild.java:514)
at hudson.model.Run.execute(Run.java:1888)
at hudson.model.FreeStyleBuild.run(FreeStyleBuild.java:43)
at hudson.model.ResourceController.execute(ResourceController.java:99)
at hudson.model.Executor.run(Executor.java:432)
Caused by: java.io.IOException: Pipe closed after 0 cycles
at org.apache.sshd.common.channel.ChannelPipedInputStream.read(ChannelPipedInputStream.java:126)
at org.apache.sshd.common.channel.ChannelPipedInputStream.read(ChannelPipedInputStream.java:105)
at hudson.remoting.FlightRecorderInputStream.read(FlightRecorderInputStream.java:93)
at hudson.remoting.ChunkedInputStream.readHeader(ChunkedInputStream.java:74)
at hudson.remoting.ChunkedInputStream.readUntilBreak(ChunkedInputStream.java:104)
at hudson.remoting.ChunkedCommandTransport.readBlock(ChunkedCommandTransport.java:39)
at hudson.remoting.AbstractSynchronousByteArrayCommandTransport.read(AbstractSynchronousByteArrayCommandTransport.java:34)
at hudson.remoting.SynchronousCommandTransport$ReaderThread.run(SynchronousCommandTransport.java:61)
Build step 'Invoke Gradle script' changed build result to FAILURE
Build step 'Invoke Gradle script' marked build as failure
ERROR: apache-beam-jenkins-8 is offline; cannot locate jdk_1.8_latest
---------------------------------------------------------------------
To unsubscribe, e-mail: builds-unsubscribe@beam.apache.org
For additional commands, e-mail: builds-help@beam.apache.org
Jenkins build is back to normal : beam_PostCommit_Python_Examples_Dataflow #58
Posted by Apache Jenkins Server <je...@builds.apache.org>.
See <https://ci-beam.apache.org/job/beam_PostCommit_Python_Examples_Dataflow/58/display/redirect?page=changes>
---------------------------------------------------------------------
To unsubscribe, e-mail: builds-unsubscribe@beam.apache.org
For additional commands, e-mail: builds-help@beam.apache.org
Build failed in Jenkins: beam_PostCommit_Python_Examples_Dataflow #57
Posted by Apache Jenkins Server <je...@builds.apache.org>.
See <https://ci-beam.apache.org/job/beam_PostCommit_Python_Examples_Dataflow/57/display/redirect>
Changes:
------------------------------------------
[...truncated 521.06 KB...]
[1m result = result_file.read().strip()[0m
[1m [0m
[1m self.assertEqual([0m
[1m> sorted(self.EXPECTED_RESULT), sorted(self.format_result(result)))[0m
[1m[31mapache_beam/examples/cookbook/coders_test.py[0m:98:
_ _ _ _ _ _ _ _ _ _ _ _ _ _ _ _ _ _ _ _ _ _ _ _ _ _ _ _ _ _ _ _ _ _ _ _ _ _ _ _
[1m[31mapache_beam/examples/cookbook/coders_test.py[0m:60: in format_result
[1m result_list = list([0m
[1m[31mapache_beam/examples/cookbook/coders_test.py[0m:62: in <lambda>
[1m lambda result_elem: format_tuple(result_elem.split(',')),[0m
_ _ _ _ _ _ _ _ _ _ _ _ _ _ _ _ _ _ _ _ _ _ _ _ _ _ _ _ _ _ _ _ _ _ _ _ _ _ _ _
result_elem_list = ['']
[1m def format_tuple(result_elem_list):[0m
[1m> [country, counter] = result_elem_list[0m
[1m[31mE ValueError: not enough values to unpack (expected 2, got 1)[0m
[1m[31mapache_beam/examples/cookbook/coders_test.py[0m:57: ValueError
------------------------------ Captured log call -------------------------------
[32mINFO [0m root:coders_test.py:51 Creating temp file: /tmp/tmpd83f7spo/input.txt
[32mINFO [0m apache_beam.runners.portability.stager:stager.py:754 Executing command: ['<https://ci-beam.apache.org/job/beam_PostCommit_Python_Examples_Dataflow/ws/src/build/gradleenv/-1734967051/bin/python3.8',> '-m', 'pip', 'download', '--dest', '/tmp/dataflow-requirements-cache', '-r', '/tmp/tmpkaq0h57a/tmp_requirements.txt', '--exists-action', 'i', '--no-deps', '--implementation', 'cp', '--abi', 'cp38', '--platform', 'manylinux2014_x86_64']
[32mINFO [0m apache_beam.runners.portability.stager:stager.py:325 Copying Beam SDK "<https://ci-beam.apache.org/job/beam_PostCommit_Python_Examples_Dataflow/ws/src/sdks/python/build/apache-beam.tar.gz"> to staging location.
[33mWARNING [0m root:environments.py:371 Make sure that locally built Python SDK docker image has Python 3.8 interpreter.
[32mINFO [0m root:environments.py:380 Default Python SDK image for environment is apache/beam_python3.8_sdk:2.38.0.dev
[32mINFO [0m root:environments.py:295 Using provided Python SDK container image: gcr.io/cloud-dataflow/v1beta3/python38-fnapi:beam-master-20220208
[32mINFO [0m root:environments.py:302 Python SDK container image set to "gcr.io/cloud-dataflow/v1beta3/python38-fnapi:beam-master-20220208" for Docker environment
[32mINFO [0m apache_beam.runners.portability.fn_api_runner.translations:translations.py:678 ==================== <function pack_combiners at 0x7fadaa807820> ====================
[32mINFO [0m apache_beam.runners.portability.fn_api_runner.translations:translations.py:678 ==================== <function sort_stages at 0x7fadaa80a040> ====================
[32mINFO [0m apache_beam.runners.dataflow.internal.apiclient:apiclient.py:706 Starting GCS upload to gs://temp-storage-for-end-to-end-tests/staging-it/beamapp-jenkins-0218194546-771037-i0m7rf6v.1645213546.771196/requirements.txt...
[32mINFO [0m apache_beam.runners.dataflow.internal.apiclient:apiclient.py:722 Completed GCS upload to gs://temp-storage-for-end-to-end-tests/staging-it/beamapp-jenkins-0218194546-771037-i0m7rf6v.1645213546.771196/requirements.txt in 0 seconds.
[32mINFO [0m apache_beam.runners.dataflow.internal.apiclient:apiclient.py:706 Starting GCS upload to gs://temp-storage-for-end-to-end-tests/staging-it/beamapp-jenkins-0218194546-771037-i0m7rf6v.1645213546.771196/pickled_main_session...
[32mINFO [0m apache_beam.runners.dataflow.internal.apiclient:apiclient.py:722 Completed GCS upload to gs://temp-storage-for-end-to-end-tests/staging-it/beamapp-jenkins-0218194546-771037-i0m7rf6v.1645213546.771196/pickled_main_session in 0 seconds.
[32mINFO [0m apache_beam.runners.dataflow.internal.apiclient:apiclient.py:706 Starting GCS upload to gs://temp-storage-for-end-to-end-tests/staging-it/beamapp-jenkins-0218194546-771037-i0m7rf6v.1645213546.771196/pbr-5.8.1.tar.gz...
[32mINFO [0m apache_beam.runners.dataflow.internal.apiclient:apiclient.py:722 Completed GCS upload to gs://temp-storage-for-end-to-end-tests/staging-it/beamapp-jenkins-0218194546-771037-i0m7rf6v.1645213546.771196/pbr-5.8.1.tar.gz in 0 seconds.
[32mINFO [0m apache_beam.runners.dataflow.internal.apiclient:apiclient.py:706 Starting GCS upload to gs://temp-storage-for-end-to-end-tests/staging-it/beamapp-jenkins-0218194546-771037-i0m7rf6v.1645213546.771196/mock-2.0.0.tar.gz...
[32mINFO [0m apache_beam.runners.dataflow.internal.apiclient:apiclient.py:722 Completed GCS upload to gs://temp-storage-for-end-to-end-tests/staging-it/beamapp-jenkins-0218194546-771037-i0m7rf6v.1645213546.771196/mock-2.0.0.tar.gz in 0 seconds.
[32mINFO [0m apache_beam.runners.dataflow.internal.apiclient:apiclient.py:706 Starting GCS upload to gs://temp-storage-for-end-to-end-tests/staging-it/beamapp-jenkins-0218194546-771037-i0m7rf6v.1645213546.771196/six-1.16.0.tar.gz...
[32mINFO [0m apache_beam.runners.dataflow.internal.apiclient:apiclient.py:722 Completed GCS upload to gs://temp-storage-for-end-to-end-tests/staging-it/beamapp-jenkins-0218194546-771037-i0m7rf6v.1645213546.771196/six-1.16.0.tar.gz in 0 seconds.
[32mINFO [0m apache_beam.runners.dataflow.internal.apiclient:apiclient.py:706 Starting GCS upload to gs://temp-storage-for-end-to-end-tests/staging-it/beamapp-jenkins-0218194546-771037-i0m7rf6v.1645213546.771196/soupsieve-2.3.1.tar.gz...
[32mINFO [0m apache_beam.runners.dataflow.internal.apiclient:apiclient.py:722 Completed GCS upload to gs://temp-storage-for-end-to-end-tests/staging-it/beamapp-jenkins-0218194546-771037-i0m7rf6v.1645213546.771196/soupsieve-2.3.1.tar.gz in 0 seconds.
[32mINFO [0m apache_beam.runners.dataflow.internal.apiclient:apiclient.py:706 Starting GCS upload to gs://temp-storage-for-end-to-end-tests/staging-it/beamapp-jenkins-0218194546-771037-i0m7rf6v.1645213546.771196/PyHamcrest-1.10.1.tar.gz...
[32mINFO [0m apache_beam.runners.dataflow.internal.apiclient:apiclient.py:722 Completed GCS upload to gs://temp-storage-for-end-to-end-tests/staging-it/beamapp-jenkins-0218194546-771037-i0m7rf6v.1645213546.771196/PyHamcrest-1.10.1.tar.gz in 0 seconds.
[32mINFO [0m apache_beam.runners.dataflow.internal.apiclient:apiclient.py:706 Starting GCS upload to gs://temp-storage-for-end-to-end-tests/staging-it/beamapp-jenkins-0218194546-771037-i0m7rf6v.1645213546.771196/parameterized-0.7.5.tar.gz...
[32mINFO [0m apache_beam.runners.dataflow.internal.apiclient:apiclient.py:722 Completed GCS upload to gs://temp-storage-for-end-to-end-tests/staging-it/beamapp-jenkins-0218194546-771037-i0m7rf6v.1645213546.771196/parameterized-0.7.5.tar.gz in 0 seconds.
[32mINFO [0m apache_beam.runners.dataflow.internal.apiclient:apiclient.py:706 Starting GCS upload to gs://temp-storage-for-end-to-end-tests/staging-it/beamapp-jenkins-0218194546-771037-i0m7rf6v.1645213546.771196/beautifulsoup4-4.10.0.tar.gz...
[32mINFO [0m apache_beam.runners.dataflow.internal.apiclient:apiclient.py:722 Completed GCS upload to gs://temp-storage-for-end-to-end-tests/staging-it/beamapp-jenkins-0218194546-771037-i0m7rf6v.1645213546.771196/beautifulsoup4-4.10.0.tar.gz in 0 seconds.
[32mINFO [0m apache_beam.runners.dataflow.internal.apiclient:apiclient.py:706 Starting GCS upload to gs://temp-storage-for-end-to-end-tests/staging-it/beamapp-jenkins-0218194546-771037-i0m7rf6v.1645213546.771196/mock-2.0.0-py2.py3-none-any.whl...
[32mINFO [0m apache_beam.runners.dataflow.internal.apiclient:apiclient.py:722 Completed GCS upload to gs://temp-storage-for-end-to-end-tests/staging-it/beamapp-jenkins-0218194546-771037-i0m7rf6v.1645213546.771196/mock-2.0.0-py2.py3-none-any.whl in 0 seconds.
[32mINFO [0m apache_beam.runners.dataflow.internal.apiclient:apiclient.py:706 Starting GCS upload to gs://temp-storage-for-end-to-end-tests/staging-it/beamapp-jenkins-0218194546-771037-i0m7rf6v.1645213546.771196/seaborn-0.11.2-py3-none-any.whl...
[32mINFO [0m apache_beam.runners.dataflow.internal.apiclient:apiclient.py:722 Completed GCS upload to gs://temp-storage-for-end-to-end-tests/staging-it/beamapp-jenkins-0218194546-771037-i0m7rf6v.1645213546.771196/seaborn-0.11.2-py3-none-any.whl in 0 seconds.
[32mINFO [0m apache_beam.runners.dataflow.internal.apiclient:apiclient.py:706 Starting GCS upload to gs://temp-storage-for-end-to-end-tests/staging-it/beamapp-jenkins-0218194546-771037-i0m7rf6v.1645213546.771196/PyHamcrest-1.10.1-py3-none-any.whl...
[32mINFO [0m apache_beam.runners.dataflow.internal.apiclient:apiclient.py:722 Completed GCS upload to gs://temp-storage-for-end-to-end-tests/staging-it/beamapp-jenkins-0218194546-771037-i0m7rf6v.1645213546.771196/PyHamcrest-1.10.1-py3-none-any.whl in 0 seconds.
[32mINFO [0m apache_beam.runners.dataflow.internal.apiclient:apiclient.py:706 Starting GCS upload to gs://temp-storage-for-end-to-end-tests/staging-it/beamapp-jenkins-0218194546-771037-i0m7rf6v.1645213546.771196/beautifulsoup4-4.10.0-py3-none-any.whl...
[32mINFO [0m apache_beam.runners.dataflow.internal.apiclient:apiclient.py:722 Completed GCS upload to gs://temp-storage-for-end-to-end-tests/staging-it/beamapp-jenkins-0218194546-771037-i0m7rf6v.1645213546.771196/beautifulsoup4-4.10.0-py3-none-any.whl in 0 seconds.
[32mINFO [0m apache_beam.runners.dataflow.internal.apiclient:apiclient.py:706 Starting GCS upload to gs://temp-storage-for-end-to-end-tests/staging-it/beamapp-jenkins-0218194546-771037-i0m7rf6v.1645213546.771196/parameterized-0.7.5-py2.py3-none-any.whl...
[32mINFO [0m apache_beam.runners.dataflow.internal.apiclient:apiclient.py:722 Completed GCS upload to gs://temp-storage-for-end-to-end-tests/staging-it/beamapp-jenkins-0218194546-771037-i0m7rf6v.1645213546.771196/parameterized-0.7.5-py2.py3-none-any.whl in 0 seconds.
[32mINFO [0m apache_beam.runners.dataflow.internal.apiclient:apiclient.py:706 Starting GCS upload to gs://temp-storage-for-end-to-end-tests/staging-it/beamapp-jenkins-0218194546-771037-i0m7rf6v.1645213546.771196/matplotlib-3.5.1-cp38-cp38-manylinux_2_5_x86_64.manylinux1_x86_64.whl...
[32mINFO [0m apache_beam.runners.dataflow.internal.apiclient:apiclient.py:722 Completed GCS upload to gs://temp-storage-for-end-to-end-tests/staging-it/beamapp-jenkins-0218194546-771037-i0m7rf6v.1645213546.771196/matplotlib-3.5.1-cp38-cp38-manylinux_2_5_x86_64.manylinux1_x86_64.whl in 0 seconds.
[32mINFO [0m apache_beam.runners.dataflow.internal.apiclient:apiclient.py:706 Starting GCS upload to gs://temp-storage-for-end-to-end-tests/staging-it/beamapp-jenkins-0218194546-771037-i0m7rf6v.1645213546.771196/matplotlib-3.5.1-cp39-cp39-manylinux_2_5_x86_64.manylinux1_x86_64.whl...
[32mINFO [0m apache_beam.runners.dataflow.internal.apiclient:apiclient.py:722 Completed GCS upload to gs://temp-storage-for-end-to-end-tests/staging-it/beamapp-jenkins-0218194546-771037-i0m7rf6v.1645213546.771196/matplotlib-3.5.1-cp39-cp39-manylinux_2_5_x86_64.manylinux1_x86_64.whl in 0 seconds.
[32mINFO [0m apache_beam.runners.dataflow.internal.apiclient:apiclient.py:706 Starting GCS upload to gs://temp-storage-for-end-to-end-tests/staging-it/beamapp-jenkins-0218194546-771037-i0m7rf6v.1645213546.771196/matplotlib-3.5.1-cp37-cp37m-manylinux_2_5_x86_64.manylinux1_x86_64.whl...
[32mINFO [0m apache_beam.runners.dataflow.internal.apiclient:apiclient.py:722 Completed GCS upload to gs://temp-storage-for-end-to-end-tests/staging-it/beamapp-jenkins-0218194546-771037-i0m7rf6v.1645213546.771196/matplotlib-3.5.1-cp37-cp37m-manylinux_2_5_x86_64.manylinux1_x86_64.whl in 0 seconds.
[32mINFO [0m apache_beam.runners.dataflow.internal.apiclient:apiclient.py:706 Starting GCS upload to gs://temp-storage-for-end-to-end-tests/staging-it/beamapp-jenkins-0218194546-771037-i0m7rf6v.1645213546.771196/dataflow_python_sdk.tar...
[32mINFO [0m apache_beam.runners.dataflow.internal.apiclient:apiclient.py:722 Completed GCS upload to gs://temp-storage-for-end-to-end-tests/staging-it/beamapp-jenkins-0218194546-771037-i0m7rf6v.1645213546.771196/dataflow_python_sdk.tar in 0 seconds.
[32mINFO [0m apache_beam.runners.dataflow.internal.apiclient:apiclient.py:706 Starting GCS upload to gs://temp-storage-for-end-to-end-tests/staging-it/beamapp-jenkins-0218194546-771037-i0m7rf6v.1645213546.771196/pipeline.pb...
[32mINFO [0m apache_beam.runners.dataflow.internal.apiclient:apiclient.py:722 Completed GCS upload to gs://temp-storage-for-end-to-end-tests/staging-it/beamapp-jenkins-0218194546-771037-i0m7rf6v.1645213546.771196/pipeline.pb in 0 seconds.
[33mWARNING [0m apache_beam.options.pipeline_options:pipeline_options.py:309 Discarding unparseable args: ['--sleep_secs=20', '--kms_key_name=projects/apache-beam-testing/locations/global/keyRings/beam-it/cryptoKeys/test']
[33mWARNING [0m apache_beam.options.pipeline_options:pipeline_options.py:309 Discarding unparseable args: ['--sleep_secs=20', '--kms_key_name=projects/apache-beam-testing/locations/global/keyRings/beam-it/cryptoKeys/test']
[32mINFO [0m apache_beam.runners.dataflow.internal.apiclient:apiclient.py:886 Create job: <Job
clientRequestId: '20220218194546772073-2337'
createTime: '2022-02-18T19:45:51.389009Z'
currentStateTime: '1970-01-01T00:00:00Z'
id: '2022-02-18_11_45_50-12395888003596793215'
location: 'us-central1'
name: 'beamapp-jenkins-0218194546-771037-i0m7rf6v'
projectId: 'apache-beam-testing'
stageStates: []
startTime: '2022-02-18T19:45:51.389009Z'
steps: []
tempFiles: []
type: TypeValueValuesEnum(JOB_TYPE_BATCH, 1)>
[32mINFO [0m apache_beam.runners.dataflow.internal.apiclient:apiclient.py:888 Created job with id: [2022-02-18_11_45_50-12395888003596793215]
[32mINFO [0m apache_beam.runners.dataflow.internal.apiclient:apiclient.py:889 Submitted job: 2022-02-18_11_45_50-12395888003596793215
[32mINFO [0m apache_beam.runners.dataflow.internal.apiclient:apiclient.py:890 To access the Dataflow monitoring console, please navigate to https://console.cloud.google.com/dataflow/jobs/us-central1/2022-02-18_11_45_50-12395888003596793215?project=apache-beam-testing
[32mINFO [0m apache_beam.runners.dataflow.dataflow_runner:dataflow_runner.py:191 Job 2022-02-18_11_45_50-12395888003596793215 is in state JOB_STATE_RUNNING
[32mINFO [0m apache_beam.runners.dataflow.dataflow_runner:dataflow_runner.py:236 2022-02-18T19:45:57.372Z: JOB_MESSAGE_DETAILED: Autoscaling is enabled for job 2022-02-18_11_45_50-12395888003596793215. The number of workers will be between 1 and 1000.
[32mINFO [0m apache_beam.runners.dataflow.dataflow_runner:dataflow_runner.py:236 2022-02-18T19:45:57.689Z: JOB_MESSAGE_DETAILED: Autoscaling was automatically enabled for job 2022-02-18_11_45_50-12395888003596793215.
[32mINFO [0m apache_beam.runners.dataflow.dataflow_runner:dataflow_runner.py:236 2022-02-18T19:46:00.258Z: JOB_MESSAGE_BASIC: Worker configuration: e2-standard-2 in us-central1-b.
[32mINFO [0m apache_beam.runners.dataflow.dataflow_runner:dataflow_runner.py:236 2022-02-18T19:46:00.975Z: JOB_MESSAGE_DETAILED: Expanding SplittableParDo operations into optimizable parts.
[32mINFO [0m apache_beam.runners.dataflow.dataflow_runner:dataflow_runner.py:236 2022-02-18T19:46:01.005Z: JOB_MESSAGE_DETAILED: Expanding CollectionToSingleton operations into optimizable parts.
[32mINFO [0m apache_beam.runners.dataflow.dataflow_runner:dataflow_runner.py:236 2022-02-18T19:46:01.074Z: JOB_MESSAGE_DETAILED: Expanding CoGroupByKey operations into optimizable parts.
[32mINFO [0m apache_beam.runners.dataflow.dataflow_runner:dataflow_runner.py:236 2022-02-18T19:46:01.139Z: JOB_MESSAGE_DEBUG: Combiner lifting skipped for step write/Write/WriteImpl/GroupByKey: GroupByKey not followed by a combiner.
[32mINFO [0m apache_beam.runners.dataflow.dataflow_runner:dataflow_runner.py:236 2022-02-18T19:46:01.211Z: JOB_MESSAGE_DETAILED: Expanding GroupByKey operations into optimizable parts.
[32mINFO [0m apache_beam.runners.dataflow.dataflow_runner:dataflow_runner.py:236 2022-02-18T19:46:01.249Z: JOB_MESSAGE_DEBUG: Annotating graph with Autotuner information.
[32mINFO [0m apache_beam.runners.dataflow.dataflow_runner:dataflow_runner.py:236 2022-02-18T19:46:01.294Z: JOB_MESSAGE_DETAILED: Fusing adjacent ParDo, Read, Write, and Flatten operations
[32mINFO [0m apache_beam.runners.dataflow.dataflow_runner:dataflow_runner.py:236 2022-02-18T19:46:01.319Z: JOB_MESSAGE_DETAILED: Fusing consumer write/Write/WriteImpl/InitializeWrite into write/Write/WriteImpl/DoOnce/Map(decode)
[32mINFO [0m apache_beam.runners.dataflow.dataflow_runner:dataflow_runner.py:236 2022-02-18T19:46:01.355Z: JOB_MESSAGE_DETAILED: Fusing consumer read/Read/Map(<lambda at iobase.py:898>) into read/Read/Impulse
[32mINFO [0m apache_beam.runners.dataflow.dataflow_runner:dataflow_runner.py:236 2022-02-18T19:46:01.399Z: JOB_MESSAGE_DETAILED: Fusing consumer ref_AppliedPTransform_read-Read-SDFBoundedSourceReader-ParDo-SDFBoundedSourceDoFn-_7/PairWithRestriction into read/Read/Map(<lambda at iobase.py:898>)
[32mINFO [0m apache_beam.runners.dataflow.dataflow_runner:dataflow_runner.py:236 2022-02-18T19:46:01.434Z: JOB_MESSAGE_DETAILED: Fusing consumer ref_AppliedPTransform_read-Read-SDFBoundedSourceReader-ParDo-SDFBoundedSourceDoFn-_7/SplitWithSizing into ref_AppliedPTransform_read-Read-SDFBoundedSourceReader-ParDo-SDFBoundedSourceDoFn-_7/PairWithRestriction
[32mINFO [0m apache_beam.runners.dataflow.dataflow_runner:dataflow_runner.py:236 2022-02-18T19:46:01.462Z: JOB_MESSAGE_DETAILED: Fusing consumer points into ref_AppliedPTransform_read-Read-SDFBoundedSourceReader-ParDo-SDFBoundedSourceDoFn-_7/ProcessElementAndRestrictionWithSizing
[32mINFO [0m apache_beam.runners.dataflow.dataflow_runner:dataflow_runner.py:236 2022-02-18T19:46:01.502Z: JOB_MESSAGE_DETAILED: Fusing consumer CombinePerKey(sum)/GroupByKey+CombinePerKey(sum)/Combine/Partial into points
[32mINFO [0m apache_beam.runners.dataflow.dataflow_runner:dataflow_runner.py:236 2022-02-18T19:46:01.534Z: JOB_MESSAGE_DETAILED: Fusing consumer CombinePerKey(sum)/GroupByKey/Write into CombinePerKey(sum)/GroupByKey+CombinePerKey(sum)/Combine/Partial
[32mINFO [0m apache_beam.runners.dataflow.dataflow_runner:dataflow_runner.py:236 2022-02-18T19:46:01.560Z: JOB_MESSAGE_DETAILED: Fusing consumer CombinePerKey(sum)/Combine into CombinePerKey(sum)/GroupByKey/Read
[32mINFO [0m apache_beam.runners.dataflow.dataflow_runner:dataflow_runner.py:236 2022-02-18T19:46:01.595Z: JOB_MESSAGE_DETAILED: Fusing consumer CombinePerKey(sum)/Combine/Extract into CombinePerKey(sum)/Combine
[32mINFO [0m apache_beam.runners.dataflow.dataflow_runner:dataflow_runner.py:236 2022-02-18T19:46:01.627Z: JOB_MESSAGE_DETAILED: Fusing consumer write/Write/WriteImpl/WindowInto(WindowIntoFn) into CombinePerKey(sum)/Combine/Extract
[32mINFO [0m apache_beam.runners.dataflow.dataflow_runner:dataflow_runner.py:236 2022-02-18T19:46:01.651Z: JOB_MESSAGE_DETAILED: Fusing consumer write/Write/WriteImpl/DoOnce/FlatMap(<lambda at core.py:3229>) into write/Write/WriteImpl/DoOnce/Impulse
[32mINFO [0m apache_beam.runners.dataflow.dataflow_runner:dataflow_runner.py:236 2022-02-18T19:46:01.684Z: JOB_MESSAGE_DETAILED: Fusing consumer write/Write/WriteImpl/DoOnce/Map(decode) into write/Write/WriteImpl/DoOnce/FlatMap(<lambda at core.py:3229>)
[32mINFO [0m apache_beam.runners.dataflow.dataflow_runner:dataflow_runner.py:236 2022-02-18T19:46:01.745Z: JOB_MESSAGE_DETAILED: Fusing consumer write/Write/WriteImpl/WriteBundles into write/Write/WriteImpl/WindowInto(WindowIntoFn)
[32mINFO [0m apache_beam.runners.dataflow.dataflow_runner:dataflow_runner.py:236 2022-02-18T19:46:01.779Z: JOB_MESSAGE_DETAILED: Fusing consumer write/Write/WriteImpl/Pair into write/Write/WriteImpl/WriteBundles
[32mINFO [0m apache_beam.runners.dataflow.dataflow_runner:dataflow_runner.py:236 2022-02-18T19:46:01.801Z: JOB_MESSAGE_DETAILED: Fusing consumer write/Write/WriteImpl/GroupByKey/Write into write/Write/WriteImpl/Pair
[32mINFO [0m apache_beam.runners.dataflow.dataflow_runner:dataflow_runner.py:236 2022-02-18T19:46:01.851Z: JOB_MESSAGE_DETAILED: Fusing consumer write/Write/WriteImpl/Extract into write/Write/WriteImpl/GroupByKey/Read
[32mINFO [0m apache_beam.runners.dataflow.dataflow_runner:dataflow_runner.py:236 2022-02-18T19:46:01.899Z: JOB_MESSAGE_DEBUG: Workflow config is missing a default resource spec.
[32mINFO [0m apache_beam.runners.dataflow.dataflow_runner:dataflow_runner.py:236 2022-02-18T19:46:01.928Z: JOB_MESSAGE_DEBUG: Adding StepResource setup and teardown to workflow graph.
[32mINFO [0m apache_beam.runners.dataflow.dataflow_runner:dataflow_runner.py:236 2022-02-18T19:46:01.962Z: JOB_MESSAGE_DEBUG: Adding workflow start and stop steps.
[32mINFO [0m apache_beam.runners.dataflow.dataflow_runner:dataflow_runner.py:236 2022-02-18T19:46:01.997Z: JOB_MESSAGE_DEBUG: Assigning stage ids.
[32mINFO [0m apache_beam.runners.dataflow.dataflow_runner:dataflow_runner.py:236 2022-02-18T19:46:02.149Z: JOB_MESSAGE_DEBUG: Executing wait step start34
[32mINFO [0m apache_beam.runners.dataflow.dataflow_runner:dataflow_runner.py:236 2022-02-18T19:46:02.222Z: JOB_MESSAGE_BASIC: Executing operation write/Write/WriteImpl/DoOnce/Impulse+write/Write/WriteImpl/DoOnce/FlatMap(<lambda at core.py:3229>)+write/Write/WriteImpl/DoOnce/Map(decode)+write/Write/WriteImpl/InitializeWrite
[32mINFO [0m apache_beam.runners.dataflow.dataflow_runner:dataflow_runner.py:236 2022-02-18T19:46:02.259Z: JOB_MESSAGE_BASIC: Executing operation read/Read/Impulse+read/Read/Map(<lambda at iobase.py:898>)+ref_AppliedPTransform_read-Read-SDFBoundedSourceReader-ParDo-SDFBoundedSourceDoFn-_7/PairWithRestriction+ref_AppliedPTransform_read-Read-SDFBoundedSourceReader-ParDo-SDFBoundedSourceDoFn-_7/SplitWithSizing
[32mINFO [0m apache_beam.runners.dataflow.dataflow_runner:dataflow_runner.py:236 2022-02-18T19:46:02.273Z: JOB_MESSAGE_DEBUG: Starting worker pool setup.
[32mINFO [0m apache_beam.runners.dataflow.dataflow_runner:dataflow_runner.py:236 2022-02-18T19:46:02.292Z: JOB_MESSAGE_BASIC: Executing operation CombinePerKey(sum)/GroupByKey/Create
[32mINFO [0m apache_beam.runners.dataflow.dataflow_runner:dataflow_runner.py:236 2022-02-18T19:46:02.311Z: JOB_MESSAGE_BASIC: Starting 1 workers in us-central1-b...
[32mINFO [0m apache_beam.runners.dataflow.dataflow_runner:dataflow_runner.py:236 2022-02-18T19:46:02.322Z: JOB_MESSAGE_BASIC: Executing operation write/Write/WriteImpl/GroupByKey/Create
[32mINFO [0m apache_beam.runners.dataflow.dataflow_runner:dataflow_runner.py:236 2022-02-18T19:46:02.373Z: JOB_MESSAGE_BASIC: Finished operation write/Write/WriteImpl/GroupByKey/Create
[32mINFO [0m apache_beam.runners.dataflow.dataflow_runner:dataflow_runner.py:236 2022-02-18T19:46:02.373Z: JOB_MESSAGE_BASIC: Finished operation CombinePerKey(sum)/GroupByKey/Create
[32mINFO [0m apache_beam.runners.dataflow.dataflow_runner:dataflow_runner.py:236 2022-02-18T19:46:02.432Z: JOB_MESSAGE_DEBUG: Value "CombinePerKey(sum)/GroupByKey/Session" materialized.
[32mINFO [0m apache_beam.runners.dataflow.dataflow_runner:dataflow_runner.py:236 2022-02-18T19:46:02.464Z: JOB_MESSAGE_DEBUG: Value "write/Write/WriteImpl/GroupByKey/Session" materialized.
[32mINFO [0m apache_beam.runners.dataflow.dataflow_runner:dataflow_runner.py:236 2022-02-18T19:46:14.962Z: JOB_MESSAGE_BASIC: Your project already contains 100 Dataflow-created metric descriptors, so new user metrics of the form custom.googleapis.com/* will not be created. However, all user metrics are also available in the metric dataflow.googleapis.com/job/user_counter. If you rely on the custom metrics, you can delete old / unused metric descriptors. See https://developers.google.com/apis-explorer/#p/monitoring/v3/monitoring.projects.metricDescriptors.list and https://developers.google.com/apis-explorer/#p/monitoring/v3/monitoring.projects.metricDescriptors.delete
[32mINFO [0m apache_beam.runners.dataflow.dataflow_runner:dataflow_runner.py:236 2022-02-18T19:46:46.344Z: JOB_MESSAGE_DETAILED: Autoscaling: Raised the number of workers to 1 based on the rate of progress in the currently running stage(s).
[32mINFO [0m apache_beam.runners.dataflow.dataflow_runner:dataflow_runner.py:236 2022-02-18T19:47:05.712Z: JOB_MESSAGE_DETAILED: Workers have started successfully.
[32mINFO [0m apache_beam.runners.dataflow.dataflow_runner:dataflow_runner.py:236 2022-02-18T19:47:05.746Z: JOB_MESSAGE_DETAILED: Workers have started successfully.
[32mINFO [0m apache_beam.runners.dataflow.dataflow_runner:dataflow_runner.py:236 2022-02-18T19:54:17.398Z: JOB_MESSAGE_BASIC: Finished operation read/Read/Impulse+read/Read/Map(<lambda at iobase.py:898>)+ref_AppliedPTransform_read-Read-SDFBoundedSourceReader-ParDo-SDFBoundedSourceDoFn-_7/PairWithRestriction+ref_AppliedPTransform_read-Read-SDFBoundedSourceReader-ParDo-SDFBoundedSourceDoFn-_7/SplitWithSizing
[32mINFO [0m apache_beam.runners.dataflow.dataflow_runner:dataflow_runner.py:236 2022-02-18T19:54:17.458Z: JOB_MESSAGE_DEBUG: Value "ref_AppliedPTransform_read-Read-SDFBoundedSourceReader-ParDo-SDFBoundedSourceDoFn-_7-split-with-sizing-out3" materialized.
[32mINFO [0m apache_beam.runners.dataflow.dataflow_runner:dataflow_runner.py:236 2022-02-18T19:54:17.531Z: JOB_MESSAGE_BASIC: Executing operation ref_AppliedPTransform_read-Read-SDFBoundedSourceReader-ParDo-SDFBoundedSourceDoFn-_7/ProcessElementAndRestrictionWithSizing+points+CombinePerKey(sum)/GroupByKey+CombinePerKey(sum)/Combine/Partial+CombinePerKey(sum)/GroupByKey/Write
[32mINFO [0m apache_beam.runners.dataflow.dataflow_runner:dataflow_runner.py:236 2022-02-18T19:54:17.547Z: JOB_MESSAGE_BASIC: Finished operation write/Write/WriteImpl/DoOnce/Impulse+write/Write/WriteImpl/DoOnce/FlatMap(<lambda at core.py:3229>)+write/Write/WriteImpl/DoOnce/Map(decode)+write/Write/WriteImpl/InitializeWrite
[32mINFO [0m apache_beam.runners.dataflow.dataflow_runner:dataflow_runner.py:236 2022-02-18T19:54:17.606Z: JOB_MESSAGE_DEBUG: Value "write/Write/WriteImpl/DoOnce/Map(decode).None" materialized.
[32mINFO [0m apache_beam.runners.dataflow.dataflow_runner:dataflow_runner.py:236 2022-02-18T19:54:17.634Z: JOB_MESSAGE_DEBUG: Value "write/Write/WriteImpl/InitializeWrite.None" materialized.
[32mINFO [0m apache_beam.runners.dataflow.dataflow_runner:dataflow_runner.py:236 2022-02-18T19:54:17.691Z: JOB_MESSAGE_BASIC: Executing operation write/Write/WriteImpl/FinalizeWrite/View-python_side_input0-write/Write/WriteImpl/FinalizeWrite
[32mINFO [0m apache_beam.runners.dataflow.dataflow_runner:dataflow_runner.py:236 2022-02-18T19:54:17.715Z: JOB_MESSAGE_BASIC: Executing operation write/Write/WriteImpl/WriteBundles/View-python_side_input0-write/Write/WriteImpl/WriteBundles
[32mINFO [0m apache_beam.runners.dataflow.dataflow_runner:dataflow_runner.py:236 2022-02-18T19:54:17.743Z: JOB_MESSAGE_BASIC: Finished operation write/Write/WriteImpl/FinalizeWrite/View-python_side_input0-write/Write/WriteImpl/FinalizeWrite
[32mINFO [0m apache_beam.runners.dataflow.dataflow_runner:dataflow_runner.py:236 2022-02-18T19:54:17.751Z: JOB_MESSAGE_BASIC: Executing operation write/Write/WriteImpl/PreFinalize/View-python_side_input0-write/Write/WriteImpl/PreFinalize
[32mINFO [0m apache_beam.runners.dataflow.dataflow_runner:dataflow_runner.py:236 2022-02-18T19:54:17.763Z: JOB_MESSAGE_BASIC: Finished operation write/Write/WriteImpl/WriteBundles/View-python_side_input0-write/Write/WriteImpl/WriteBundles
[32mINFO [0m apache_beam.runners.dataflow.dataflow_runner:dataflow_runner.py:236 2022-02-18T19:54:17.797Z: JOB_MESSAGE_DEBUG: Value "write/Write/WriteImpl/FinalizeWrite/View-python_side_input0-write/Write/WriteImpl/FinalizeWrite.out" materialized.
[32mINFO [0m apache_beam.runners.dataflow.dataflow_runner:dataflow_runner.py:236 2022-02-18T19:54:17.815Z: JOB_MESSAGE_BASIC: Finished operation write/Write/WriteImpl/PreFinalize/View-python_side_input0-write/Write/WriteImpl/PreFinalize
[32mINFO [0m apache_beam.runners.dataflow.dataflow_runner:dataflow_runner.py:236 2022-02-18T19:54:17.837Z: JOB_MESSAGE_DEBUG: Value "write/Write/WriteImpl/WriteBundles/View-python_side_input0-write/Write/WriteImpl/WriteBundles.out" materialized.
[32mINFO [0m apache_beam.runners.dataflow.dataflow_runner:dataflow_runner.py:236 2022-02-18T19:54:17.911Z: JOB_MESSAGE_DEBUG: Value "write/Write/WriteImpl/PreFinalize/View-python_side_input0-write/Write/WriteImpl/PreFinalize.out" materialized.
[32mINFO [0m apache_beam.runners.dataflow.dataflow_runner:dataflow_runner.py:236 2022-02-18T19:54:23.207Z: JOB_MESSAGE_BASIC: Finished operation ref_AppliedPTransform_read-Read-SDFBoundedSourceReader-ParDo-SDFBoundedSourceDoFn-_7/ProcessElementAndRestrictionWithSizing+points+CombinePerKey(sum)/GroupByKey+CombinePerKey(sum)/Combine/Partial+CombinePerKey(sum)/GroupByKey/Write
[32mINFO [0m apache_beam.runners.dataflow.dataflow_runner:dataflow_runner.py:236 2022-02-18T19:54:23.278Z: JOB_MESSAGE_BASIC: Executing operation CombinePerKey(sum)/GroupByKey/Close
[32mINFO [0m apache_beam.runners.dataflow.dataflow_runner:dataflow_runner.py:236 2022-02-18T19:54:23.328Z: JOB_MESSAGE_BASIC: Finished operation CombinePerKey(sum)/GroupByKey/Close
[32mINFO [0m apache_beam.runners.dataflow.dataflow_runner:dataflow_runner.py:236 2022-02-18T19:54:23.392Z: JOB_MESSAGE_BASIC: Executing operation CombinePerKey(sum)/GroupByKey/Read+CombinePerKey(sum)/Combine+CombinePerKey(sum)/Combine/Extract+write/Write/WriteImpl/WindowInto(WindowIntoFn)+write/Write/WriteImpl/WriteBundles+write/Write/WriteImpl/Pair+write/Write/WriteImpl/GroupByKey/Write
[32mINFO [0m apache_beam.runners.dataflow.dataflow_runner:dataflow_runner.py:236 2022-02-18T19:54:24.542Z: JOB_MESSAGE_BASIC: Finished operation CombinePerKey(sum)/GroupByKey/Read+CombinePerKey(sum)/Combine+CombinePerKey(sum)/Combine/Extract+write/Write/WriteImpl/WindowInto(WindowIntoFn)+write/Write/WriteImpl/WriteBundles+write/Write/WriteImpl/Pair+write/Write/WriteImpl/GroupByKey/Write
[32mINFO [0m apache_beam.runners.dataflow.dataflow_runner:dataflow_runner.py:236 2022-02-18T19:54:24.603Z: JOB_MESSAGE_BASIC: Executing operation write/Write/WriteImpl/GroupByKey/Close
[32mINFO [0m apache_beam.runners.dataflow.dataflow_runner:dataflow_runner.py:236 2022-02-18T19:54:24.650Z: JOB_MESSAGE_BASIC: Finished operation write/Write/WriteImpl/GroupByKey/Close
[32mINFO [0m apache_beam.runners.dataflow.dataflow_runner:dataflow_runner.py:236 2022-02-18T19:54:24.719Z: JOB_MESSAGE_BASIC: Executing operation write/Write/WriteImpl/GroupByKey/Read+write/Write/WriteImpl/Extract
[32mINFO [0m apache_beam.runners.dataflow.dataflow_runner:dataflow_runner.py:236 2022-02-18T19:54:26.987Z: JOB_MESSAGE_BASIC: Finished operation write/Write/WriteImpl/GroupByKey/Read+write/Write/WriteImpl/Extract
[32mINFO [0m apache_beam.runners.dataflow.dataflow_runner:dataflow_runner.py:236 2022-02-18T19:54:27.054Z: JOB_MESSAGE_DEBUG: Value "write/Write/WriteImpl/Extract.None" materialized.
[32mINFO [0m apache_beam.runners.dataflow.dataflow_runner:dataflow_runner.py:236 2022-02-18T19:54:27.115Z: JOB_MESSAGE_BASIC: Executing operation write/Write/WriteImpl/FinalizeWrite/View-python_side_input1-write/Write/WriteImpl/FinalizeWrite
[32mINFO [0m apache_beam.runners.dataflow.dataflow_runner:dataflow_runner.py:236 2022-02-18T19:54:27.142Z: JOB_MESSAGE_BASIC: Executing operation write/Write/WriteImpl/PreFinalize/View-python_side_input1-write/Write/WriteImpl/PreFinalize
[32mINFO [0m apache_beam.runners.dataflow.dataflow_runner:dataflow_runner.py:236 2022-02-18T19:54:27.165Z: JOB_MESSAGE_BASIC: Finished operation write/Write/WriteImpl/FinalizeWrite/View-python_side_input1-write/Write/WriteImpl/FinalizeWrite
[32mINFO [0m apache_beam.runners.dataflow.dataflow_runner:dataflow_runner.py:236 2022-02-18T19:54:27.211Z: JOB_MESSAGE_BASIC: Finished operation write/Write/WriteImpl/PreFinalize/View-python_side_input1-write/Write/WriteImpl/PreFinalize
[32mINFO [0m apache_beam.runners.dataflow.dataflow_runner:dataflow_runner.py:236 2022-02-18T19:54:27.232Z: JOB_MESSAGE_DEBUG: Value "write/Write/WriteImpl/FinalizeWrite/View-python_side_input1-write/Write/WriteImpl/FinalizeWrite.out" materialized.
[32mINFO [0m apache_beam.runners.dataflow.dataflow_runner:dataflow_runner.py:236 2022-02-18T19:54:27.280Z: JOB_MESSAGE_DEBUG: Value "write/Write/WriteImpl/PreFinalize/View-python_side_input1-write/Write/WriteImpl/PreFinalize.out" materialized.
[32mINFO [0m apache_beam.runners.dataflow.dataflow_runner:dataflow_runner.py:236 2022-02-18T19:54:27.345Z: JOB_MESSAGE_BASIC: Executing operation write/Write/WriteImpl/PreFinalize
[32mINFO [0m apache_beam.runners.dataflow.dataflow_runner:dataflow_runner.py:236 2022-02-18T19:54:30.002Z: JOB_MESSAGE_BASIC: Finished operation write/Write/WriteImpl/PreFinalize
[32mINFO [0m apache_beam.runners.dataflow.dataflow_runner:dataflow_runner.py:236 2022-02-18T19:54:30.071Z: JOB_MESSAGE_DEBUG: Value "write/Write/WriteImpl/PreFinalize.None" materialized.
[32mINFO [0m apache_beam.runners.dataflow.dataflow_runner:dataflow_runner.py:236 2022-02-18T19:54:30.133Z: JOB_MESSAGE_BASIC: Executing operation write/Write/WriteImpl/FinalizeWrite/View-python_side_input2-write/Write/WriteImpl/FinalizeWrite
[32mINFO [0m apache_beam.runners.dataflow.dataflow_runner:dataflow_runner.py:236 2022-02-18T19:54:30.193Z: JOB_MESSAGE_BASIC: Finished operation write/Write/WriteImpl/FinalizeWrite/View-python_side_input2-write/Write/WriteImpl/FinalizeWrite
[32mINFO [0m apache_beam.runners.dataflow.dataflow_runner:dataflow_runner.py:236 2022-02-18T19:54:30.264Z: JOB_MESSAGE_DEBUG: Value "write/Write/WriteImpl/FinalizeWrite/View-python_side_input2-write/Write/WriteImpl/FinalizeWrite.out" materialized.
[32mINFO [0m apache_beam.runners.dataflow.dataflow_runner:dataflow_runner.py:236 2022-02-18T19:54:30.335Z: JOB_MESSAGE_BASIC: Executing operation write/Write/WriteImpl/FinalizeWrite
[32mINFO [0m apache_beam.runners.dataflow.dataflow_runner:dataflow_runner.py:236 2022-02-18T19:54:32.235Z: JOB_MESSAGE_BASIC: Finished operation write/Write/WriteImpl/FinalizeWrite
[32mINFO [0m apache_beam.runners.dataflow.dataflow_runner:dataflow_runner.py:236 2022-02-18T19:54:32.282Z: JOB_MESSAGE_DEBUG: Executing success step success32
[32mINFO [0m apache_beam.runners.dataflow.dataflow_runner:dataflow_runner.py:236 2022-02-18T19:54:32.359Z: JOB_MESSAGE_DETAILED: Cleaning up.
[32mINFO [0m apache_beam.runners.dataflow.dataflow_runner:dataflow_runner.py:236 2022-02-18T19:54:32.461Z: JOB_MESSAGE_DEBUG: Starting worker pool teardown.
[32mINFO [0m apache_beam.runners.dataflow.dataflow_runner:dataflow_runner.py:236 2022-02-18T19:54:32.499Z: JOB_MESSAGE_BASIC: Stopping worker pool...
[32mINFO [0m apache_beam.runners.dataflow.dataflow_runner:dataflow_runner.py:236 2022-02-18T19:57:04.304Z: JOB_MESSAGE_DETAILED: Autoscaling: Resized worker pool from 1 to 0.
[32mINFO [0m apache_beam.runners.dataflow.dataflow_runner:dataflow_runner.py:236 2022-02-18T19:57:04.350Z: JOB_MESSAGE_BASIC: Worker pool stopped.
[32mINFO [0m apache_beam.runners.dataflow.dataflow_runner:dataflow_runner.py:236 2022-02-18T19:57:04.375Z: JOB_MESSAGE_DEBUG: Tearing down pending resources...
[32mINFO [0m apache_beam.runners.dataflow.dataflow_runner:dataflow_runner.py:191 Job 2022-02-18_11_45_50-12395888003596793215 is in state JOB_STATE_DONE
[33m=============================== warnings summary ===============================[0m
<https://ci-beam.apache.org/job/beam_PostCommit_Python_Examples_Dataflow/ws/src/build/gradleenv/-1734967051/lib/python3.8/site-packages/tenacity/_asyncio.py>:42
<https://ci-beam.apache.org/job/beam_PostCommit_Python_Examples_Dataflow/ws/src/build/gradleenv/-1734967051/lib/python3.8/site-packages/tenacity/_asyncio.py>:42: DeprecationWarning: "@coroutine" decorator is deprecated since Python 3.8, use "async def" instead
def call(self, fn, *args, **kwargs):
apache_beam/examples/complete/game/hourly_team_score_it_test.py::HourlyTeamScoreIT::test_hourly_team_score_output_checksum_on_small_input
<https://ci-beam.apache.org/job/beam_PostCommit_Python_Examples_Dataflow/ws/src/sdks/python/apache_beam/io/gcp/tests/utils.py>:63: PendingDeprecationWarning: Client.dataset is deprecated and will be removed in a future version. Use a string like 'my_project.my_dataset' or a cloud.google.bigquery.DatasetReference object, instead.
dataset_ref = client.dataset(unique_dataset_name, project=project)
apache_beam/examples/complete/game/hourly_team_score_it_test.py::HourlyTeamScoreIT::test_hourly_team_score_output_checksum_on_small_input
<https://ci-beam.apache.org/job/beam_PostCommit_Python_Examples_Dataflow/ws/src/sdks/python/apache_beam/io/gcp/bigquery.py>:2138: BeamDeprecationWarning: options is deprecated since First stable release. References to <pipeline>.options will not be supported
is_streaming_pipeline = p.options.view_as(StandardOptions).streaming
apache_beam/examples/complete/game/hourly_team_score_it_test.py::HourlyTeamScoreIT::test_hourly_team_score_output_checksum_on_small_input
<https://ci-beam.apache.org/job/beam_PostCommit_Python_Examples_Dataflow/ws/src/sdks/python/apache_beam/io/gcp/bigquery.py>:2144: BeamDeprecationWarning: options is deprecated since First stable release. References to <pipeline>.options will not be supported
experiments = p.options.view_as(DebugOptions).experiments or []
apache_beam/examples/complete/game/hourly_team_score_it_test.py::HourlyTeamScoreIT::test_hourly_team_score_output_checksum_on_small_input
<https://ci-beam.apache.org/job/beam_PostCommit_Python_Examples_Dataflow/ws/src/sdks/python/apache_beam/io/gcp/bigquery_file_loads.py>:1128: BeamDeprecationWarning: options is deprecated since First stable release. References to <pipeline>.options will not be supported
temp_location = p.options.view_as(GoogleCloudOptions).temp_location
apache_beam/examples/complete/game/hourly_team_score_it_test.py::HourlyTeamScoreIT::test_hourly_team_score_output_checksum_on_small_input
<https://ci-beam.apache.org/job/beam_PostCommit_Python_Examples_Dataflow/ws/src/sdks/python/apache_beam/io/gcp/bigquery_file_loads.py>:1130: BeamDeprecationWarning: options is deprecated since First stable release. References to <pipeline>.options will not be supported
p.options.view_as(GoogleCloudOptions).job_name or 'AUTOMATIC_JOB_NAME')
apache_beam/examples/cookbook/bigquery_side_input_it_test.py::BigQuerySideInputIT::test_bigquery_side_input_it
apache_beam/examples/cookbook/bigquery_side_input_it_test.py::BigQuerySideInputIT::test_bigquery_side_input_it
<https://ci-beam.apache.org/job/beam_PostCommit_Python_Examples_Dataflow/ws/src/sdks/python/apache_beam/io/gcp/bigquery.py>:2437: BeamDeprecationWarning: options is deprecated since First stable release. References to <pipeline>.options will not be supported
temp_location = pcoll.pipeline.options.view_as(
apache_beam/examples/cookbook/bigquery_side_input_it_test.py::BigQuerySideInputIT::test_bigquery_side_input_it
apache_beam/examples/cookbook/bigquery_side_input_it_test.py::BigQuerySideInputIT::test_bigquery_side_input_it
<https://ci-beam.apache.org/job/beam_PostCommit_Python_Examples_Dataflow/ws/src/sdks/python/apache_beam/io/gcp/bigquery.py>:2439: BeamDeprecationWarning: options is deprecated since First stable release. References to <pipeline>.options will not be supported
job_name = pcoll.pipeline.options.view_as(GoogleCloudOptions).job_name
apache_beam/examples/cookbook/bigquery_side_input_it_test.py::BigQuerySideInputIT::test_bigquery_side_input_it
apache_beam/examples/cookbook/bigquery_side_input_it_test.py::BigQuerySideInputIT::test_bigquery_side_input_it
<https://ci-beam.apache.org/job/beam_PostCommit_Python_Examples_Dataflow/ws/src/sdks/python/apache_beam/io/gcp/bigquery.py>:2463: BeamDeprecationWarning: options is deprecated since First stable release. References to <pipeline>.options will not be supported
pipeline_options=pcoll.pipeline.options,
-- Docs: https://docs.pytest.org/en/latest/warnings.html
- generated xml file: <https://ci-beam.apache.org/job/beam_PostCommit_Python_Examples_Dataflow/ws/src/sdks/python/pytest_postCommitIT-df-py38-no-xdist.xml> -
[31m[1m===== 4 failed, 3 passed, 5213 deselected, 12 warnings in 5087.46 seconds ======[0m
> Task :sdks:python:test-suites:dataflow:py38:examples FAILED
FAILURE: Build failed with an exception.
* Where:
Script '<https://ci-beam.apache.org/job/beam_PostCommit_Python_Examples_Dataflow/ws/src/sdks/python/test-suites/dataflow/common.gradle'> line: 182
* What went wrong:
Execution failed for task ':sdks:python:test-suites:dataflow:py38:examples'.
> Process 'command 'sh'' finished with non-zero exit value 1
* Try:
> Run with --stacktrace option to get the stack trace.
> Run with --info or --debug option to get more log output.
> Run with --scan to get full insights.
* Get more help at https://help.gradle.org
BUILD FAILED in 1h 54m 28s
15 actionable tasks: 9 executed, 4 from cache, 2 up-to-date
Publishing build scan...
https://gradle.com/s/3ozhbnrq6iw32
Build step 'Invoke Gradle script' changed build result to FAILURE
Build step 'Invoke Gradle script' marked build as failure
---------------------------------------------------------------------
To unsubscribe, e-mail: builds-unsubscribe@beam.apache.org
For additional commands, e-mail: builds-help@beam.apache.org
Build failed in Jenkins: beam_PostCommit_Python_Examples_Dataflow #56
Posted by Apache Jenkins Server <je...@builds.apache.org>.
See <https://ci-beam.apache.org/job/beam_PostCommit_Python_Examples_Dataflow/56/display/redirect?page=changes>
Changes:
[noreply] [adhoc] Avoid using SerializablePipelineOptions for testing to minimize
------------------------------------------
[...truncated 520.90 KB...]
[1m [0m
[1m self.assertEqual([0m
[1m> sorted(self.EXPECTED_RESULT), sorted(self.format_result(result)))[0m
[1m[31mapache_beam/examples/cookbook/coders_test.py[0m:98:
_ _ _ _ _ _ _ _ _ _ _ _ _ _ _ _ _ _ _ _ _ _ _ _ _ _ _ _ _ _ _ _ _ _ _ _ _ _ _ _
[1m[31mapache_beam/examples/cookbook/coders_test.py[0m:60: in format_result
[1m result_list = list([0m
[1m[31mapache_beam/examples/cookbook/coders_test.py[0m:62: in <lambda>
[1m lambda result_elem: format_tuple(result_elem.split(',')),[0m
_ _ _ _ _ _ _ _ _ _ _ _ _ _ _ _ _ _ _ _ _ _ _ _ _ _ _ _ _ _ _ _ _ _ _ _ _ _ _ _
result_elem_list = ['']
[1m def format_tuple(result_elem_list):[0m
[1m> [country, counter] = result_elem_list[0m
[1m[31mE ValueError: not enough values to unpack (expected 2, got 1)[0m
[1m[31mapache_beam/examples/cookbook/coders_test.py[0m:57: ValueError
------------------------------ Captured log call -------------------------------
[32mINFO [0m root:coders_test.py:51 Creating temp file: /tmp/tmpebh8splc/input.txt
[32mINFO [0m apache_beam.runners.portability.stager:stager.py:754 Executing command: ['<https://ci-beam.apache.org/job/beam_PostCommit_Python_Examples_Dataflow/ws/src/build/gradleenv/-1734967051/bin/python3.8',> '-m', 'pip', 'download', '--dest', '/tmp/dataflow-requirements-cache', '-r', '/tmp/tmpyvm_xrch/tmp_requirements.txt', '--exists-action', 'i', '--no-deps', '--implementation', 'cp', '--abi', 'cp38', '--platform', 'manylinux2014_x86_64']
[32mINFO [0m apache_beam.runners.portability.stager:stager.py:325 Copying Beam SDK "<https://ci-beam.apache.org/job/beam_PostCommit_Python_Examples_Dataflow/ws/src/sdks/python/build/apache-beam.tar.gz"> to staging location.
[33mWARNING [0m root:environments.py:371 Make sure that locally built Python SDK docker image has Python 3.8 interpreter.
[32mINFO [0m root:environments.py:380 Default Python SDK image for environment is apache/beam_python3.8_sdk:2.38.0.dev
[32mINFO [0m root:environments.py:295 Using provided Python SDK container image: gcr.io/cloud-dataflow/v1beta3/python38-fnapi:beam-master-20220208
[32mINFO [0m root:environments.py:302 Python SDK container image set to "gcr.io/cloud-dataflow/v1beta3/python38-fnapi:beam-master-20220208" for Docker environment
[32mINFO [0m apache_beam.runners.portability.fn_api_runner.translations:translations.py:678 ==================== <function pack_combiners at 0x7ff70c461820> ====================
[32mINFO [0m apache_beam.runners.portability.fn_api_runner.translations:translations.py:678 ==================== <function sort_stages at 0x7ff70c464040> ====================
[32mINFO [0m apache_beam.runners.dataflow.internal.apiclient:apiclient.py:706 Starting GCS upload to gs://temp-storage-for-end-to-end-tests/staging-it/beamapp-jenkins-0218133834-588042-i0m7rf6v.1645191514.588197/requirements.txt...
[32mINFO [0m apache_beam.runners.dataflow.internal.apiclient:apiclient.py:722 Completed GCS upload to gs://temp-storage-for-end-to-end-tests/staging-it/beamapp-jenkins-0218133834-588042-i0m7rf6v.1645191514.588197/requirements.txt in 0 seconds.
[32mINFO [0m apache_beam.runners.dataflow.internal.apiclient:apiclient.py:706 Starting GCS upload to gs://temp-storage-for-end-to-end-tests/staging-it/beamapp-jenkins-0218133834-588042-i0m7rf6v.1645191514.588197/pickled_main_session...
[32mINFO [0m apache_beam.runners.dataflow.internal.apiclient:apiclient.py:722 Completed GCS upload to gs://temp-storage-for-end-to-end-tests/staging-it/beamapp-jenkins-0218133834-588042-i0m7rf6v.1645191514.588197/pickled_main_session in 0 seconds.
[32mINFO [0m apache_beam.runners.dataflow.internal.apiclient:apiclient.py:706 Starting GCS upload to gs://temp-storage-for-end-to-end-tests/staging-it/beamapp-jenkins-0218133834-588042-i0m7rf6v.1645191514.588197/pbr-5.8.1.tar.gz...
[32mINFO [0m apache_beam.runners.dataflow.internal.apiclient:apiclient.py:722 Completed GCS upload to gs://temp-storage-for-end-to-end-tests/staging-it/beamapp-jenkins-0218133834-588042-i0m7rf6v.1645191514.588197/pbr-5.8.1.tar.gz in 0 seconds.
[32mINFO [0m apache_beam.runners.dataflow.internal.apiclient:apiclient.py:706 Starting GCS upload to gs://temp-storage-for-end-to-end-tests/staging-it/beamapp-jenkins-0218133834-588042-i0m7rf6v.1645191514.588197/mock-2.0.0.tar.gz...
[32mINFO [0m apache_beam.runners.dataflow.internal.apiclient:apiclient.py:722 Completed GCS upload to gs://temp-storage-for-end-to-end-tests/staging-it/beamapp-jenkins-0218133834-588042-i0m7rf6v.1645191514.588197/mock-2.0.0.tar.gz in 0 seconds.
[32mINFO [0m apache_beam.runners.dataflow.internal.apiclient:apiclient.py:706 Starting GCS upload to gs://temp-storage-for-end-to-end-tests/staging-it/beamapp-jenkins-0218133834-588042-i0m7rf6v.1645191514.588197/six-1.16.0.tar.gz...
[32mINFO [0m apache_beam.runners.dataflow.internal.apiclient:apiclient.py:722 Completed GCS upload to gs://temp-storage-for-end-to-end-tests/staging-it/beamapp-jenkins-0218133834-588042-i0m7rf6v.1645191514.588197/six-1.16.0.tar.gz in 0 seconds.
[32mINFO [0m apache_beam.runners.dataflow.internal.apiclient:apiclient.py:706 Starting GCS upload to gs://temp-storage-for-end-to-end-tests/staging-it/beamapp-jenkins-0218133834-588042-i0m7rf6v.1645191514.588197/soupsieve-2.3.1.tar.gz...
[32mINFO [0m apache_beam.runners.dataflow.internal.apiclient:apiclient.py:722 Completed GCS upload to gs://temp-storage-for-end-to-end-tests/staging-it/beamapp-jenkins-0218133834-588042-i0m7rf6v.1645191514.588197/soupsieve-2.3.1.tar.gz in 0 seconds.
[32mINFO [0m apache_beam.runners.dataflow.internal.apiclient:apiclient.py:706 Starting GCS upload to gs://temp-storage-for-end-to-end-tests/staging-it/beamapp-jenkins-0218133834-588042-i0m7rf6v.1645191514.588197/PyHamcrest-1.10.1.tar.gz...
[32mINFO [0m apache_beam.runners.dataflow.internal.apiclient:apiclient.py:722 Completed GCS upload to gs://temp-storage-for-end-to-end-tests/staging-it/beamapp-jenkins-0218133834-588042-i0m7rf6v.1645191514.588197/PyHamcrest-1.10.1.tar.gz in 0 seconds.
[32mINFO [0m apache_beam.runners.dataflow.internal.apiclient:apiclient.py:706 Starting GCS upload to gs://temp-storage-for-end-to-end-tests/staging-it/beamapp-jenkins-0218133834-588042-i0m7rf6v.1645191514.588197/parameterized-0.7.5.tar.gz...
[32mINFO [0m apache_beam.runners.dataflow.internal.apiclient:apiclient.py:722 Completed GCS upload to gs://temp-storage-for-end-to-end-tests/staging-it/beamapp-jenkins-0218133834-588042-i0m7rf6v.1645191514.588197/parameterized-0.7.5.tar.gz in 0 seconds.
[32mINFO [0m apache_beam.runners.dataflow.internal.apiclient:apiclient.py:706 Starting GCS upload to gs://temp-storage-for-end-to-end-tests/staging-it/beamapp-jenkins-0218133834-588042-i0m7rf6v.1645191514.588197/beautifulsoup4-4.10.0.tar.gz...
[32mINFO [0m apache_beam.runners.dataflow.internal.apiclient:apiclient.py:722 Completed GCS upload to gs://temp-storage-for-end-to-end-tests/staging-it/beamapp-jenkins-0218133834-588042-i0m7rf6v.1645191514.588197/beautifulsoup4-4.10.0.tar.gz in 0 seconds.
[32mINFO [0m apache_beam.runners.dataflow.internal.apiclient:apiclient.py:706 Starting GCS upload to gs://temp-storage-for-end-to-end-tests/staging-it/beamapp-jenkins-0218133834-588042-i0m7rf6v.1645191514.588197/mock-2.0.0-py2.py3-none-any.whl...
[32mINFO [0m apache_beam.runners.dataflow.internal.apiclient:apiclient.py:722 Completed GCS upload to gs://temp-storage-for-end-to-end-tests/staging-it/beamapp-jenkins-0218133834-588042-i0m7rf6v.1645191514.588197/mock-2.0.0-py2.py3-none-any.whl in 0 seconds.
[32mINFO [0m apache_beam.runners.dataflow.internal.apiclient:apiclient.py:706 Starting GCS upload to gs://temp-storage-for-end-to-end-tests/staging-it/beamapp-jenkins-0218133834-588042-i0m7rf6v.1645191514.588197/seaborn-0.11.2-py3-none-any.whl...
[32mINFO [0m apache_beam.runners.dataflow.internal.apiclient:apiclient.py:722 Completed GCS upload to gs://temp-storage-for-end-to-end-tests/staging-it/beamapp-jenkins-0218133834-588042-i0m7rf6v.1645191514.588197/seaborn-0.11.2-py3-none-any.whl in 0 seconds.
[32mINFO [0m apache_beam.runners.dataflow.internal.apiclient:apiclient.py:706 Starting GCS upload to gs://temp-storage-for-end-to-end-tests/staging-it/beamapp-jenkins-0218133834-588042-i0m7rf6v.1645191514.588197/PyHamcrest-1.10.1-py3-none-any.whl...
[32mINFO [0m apache_beam.runners.dataflow.internal.apiclient:apiclient.py:722 Completed GCS upload to gs://temp-storage-for-end-to-end-tests/staging-it/beamapp-jenkins-0218133834-588042-i0m7rf6v.1645191514.588197/PyHamcrest-1.10.1-py3-none-any.whl in 0 seconds.
[32mINFO [0m apache_beam.runners.dataflow.internal.apiclient:apiclient.py:706 Starting GCS upload to gs://temp-storage-for-end-to-end-tests/staging-it/beamapp-jenkins-0218133834-588042-i0m7rf6v.1645191514.588197/beautifulsoup4-4.10.0-py3-none-any.whl...
[32mINFO [0m apache_beam.runners.dataflow.internal.apiclient:apiclient.py:722 Completed GCS upload to gs://temp-storage-for-end-to-end-tests/staging-it/beamapp-jenkins-0218133834-588042-i0m7rf6v.1645191514.588197/beautifulsoup4-4.10.0-py3-none-any.whl in 0 seconds.
[32mINFO [0m apache_beam.runners.dataflow.internal.apiclient:apiclient.py:706 Starting GCS upload to gs://temp-storage-for-end-to-end-tests/staging-it/beamapp-jenkins-0218133834-588042-i0m7rf6v.1645191514.588197/parameterized-0.7.5-py2.py3-none-any.whl...
[32mINFO [0m apache_beam.runners.dataflow.internal.apiclient:apiclient.py:722 Completed GCS upload to gs://temp-storage-for-end-to-end-tests/staging-it/beamapp-jenkins-0218133834-588042-i0m7rf6v.1645191514.588197/parameterized-0.7.5-py2.py3-none-any.whl in 0 seconds.
[32mINFO [0m apache_beam.runners.dataflow.internal.apiclient:apiclient.py:706 Starting GCS upload to gs://temp-storage-for-end-to-end-tests/staging-it/beamapp-jenkins-0218133834-588042-i0m7rf6v.1645191514.588197/matplotlib-3.5.1-cp38-cp38-manylinux_2_5_x86_64.manylinux1_x86_64.whl...
[32mINFO [0m apache_beam.runners.dataflow.internal.apiclient:apiclient.py:722 Completed GCS upload to gs://temp-storage-for-end-to-end-tests/staging-it/beamapp-jenkins-0218133834-588042-i0m7rf6v.1645191514.588197/matplotlib-3.5.1-cp38-cp38-manylinux_2_5_x86_64.manylinux1_x86_64.whl in 0 seconds.
[32mINFO [0m apache_beam.runners.dataflow.internal.apiclient:apiclient.py:706 Starting GCS upload to gs://temp-storage-for-end-to-end-tests/staging-it/beamapp-jenkins-0218133834-588042-i0m7rf6v.1645191514.588197/matplotlib-3.5.1-cp39-cp39-manylinux_2_5_x86_64.manylinux1_x86_64.whl...
[32mINFO [0m apache_beam.runners.dataflow.internal.apiclient:apiclient.py:722 Completed GCS upload to gs://temp-storage-for-end-to-end-tests/staging-it/beamapp-jenkins-0218133834-588042-i0m7rf6v.1645191514.588197/matplotlib-3.5.1-cp39-cp39-manylinux_2_5_x86_64.manylinux1_x86_64.whl in 0 seconds.
[32mINFO [0m apache_beam.runners.dataflow.internal.apiclient:apiclient.py:706 Starting GCS upload to gs://temp-storage-for-end-to-end-tests/staging-it/beamapp-jenkins-0218133834-588042-i0m7rf6v.1645191514.588197/matplotlib-3.5.1-cp37-cp37m-manylinux_2_5_x86_64.manylinux1_x86_64.whl...
[32mINFO [0m apache_beam.runners.dataflow.internal.apiclient:apiclient.py:722 Completed GCS upload to gs://temp-storage-for-end-to-end-tests/staging-it/beamapp-jenkins-0218133834-588042-i0m7rf6v.1645191514.588197/matplotlib-3.5.1-cp37-cp37m-manylinux_2_5_x86_64.manylinux1_x86_64.whl in 0 seconds.
[32mINFO [0m apache_beam.runners.dataflow.internal.apiclient:apiclient.py:706 Starting GCS upload to gs://temp-storage-for-end-to-end-tests/staging-it/beamapp-jenkins-0218133834-588042-i0m7rf6v.1645191514.588197/dataflow_python_sdk.tar...
[32mINFO [0m apache_beam.runners.dataflow.internal.apiclient:apiclient.py:722 Completed GCS upload to gs://temp-storage-for-end-to-end-tests/staging-it/beamapp-jenkins-0218133834-588042-i0m7rf6v.1645191514.588197/dataflow_python_sdk.tar in 0 seconds.
[32mINFO [0m apache_beam.runners.dataflow.internal.apiclient:apiclient.py:706 Starting GCS upload to gs://temp-storage-for-end-to-end-tests/staging-it/beamapp-jenkins-0218133834-588042-i0m7rf6v.1645191514.588197/pipeline.pb...
[32mINFO [0m apache_beam.runners.dataflow.internal.apiclient:apiclient.py:722 Completed GCS upload to gs://temp-storage-for-end-to-end-tests/staging-it/beamapp-jenkins-0218133834-588042-i0m7rf6v.1645191514.588197/pipeline.pb in 0 seconds.
[33mWARNING [0m apache_beam.options.pipeline_options:pipeline_options.py:309 Discarding unparseable args: ['--sleep_secs=20', '--kms_key_name=projects/apache-beam-testing/locations/global/keyRings/beam-it/cryptoKeys/test']
[33mWARNING [0m apache_beam.options.pipeline_options:pipeline_options.py:309 Discarding unparseable args: ['--sleep_secs=20', '--kms_key_name=projects/apache-beam-testing/locations/global/keyRings/beam-it/cryptoKeys/test']
[32mINFO [0m apache_beam.runners.dataflow.internal.apiclient:apiclient.py:886 Create job: <Job
clientRequestId: '20220218133834589106-2337'
createTime: '2022-02-18T13:38:39.407511Z'
currentStateTime: '1970-01-01T00:00:00Z'
id: '2022-02-18_05_38_38-17347386352841172129'
location: 'us-central1'
name: 'beamapp-jenkins-0218133834-588042-i0m7rf6v'
projectId: 'apache-beam-testing'
stageStates: []
startTime: '2022-02-18T13:38:39.407511Z'
steps: []
tempFiles: []
type: TypeValueValuesEnum(JOB_TYPE_BATCH, 1)>
[32mINFO [0m apache_beam.runners.dataflow.internal.apiclient:apiclient.py:888 Created job with id: [2022-02-18_05_38_38-17347386352841172129]
[32mINFO [0m apache_beam.runners.dataflow.internal.apiclient:apiclient.py:889 Submitted job: 2022-02-18_05_38_38-17347386352841172129
[32mINFO [0m apache_beam.runners.dataflow.internal.apiclient:apiclient.py:890 To access the Dataflow monitoring console, please navigate to https://console.cloud.google.com/dataflow/jobs/us-central1/2022-02-18_05_38_38-17347386352841172129?project=apache-beam-testing
[32mINFO [0m apache_beam.runners.dataflow.dataflow_runner:dataflow_runner.py:191 Job 2022-02-18_05_38_38-17347386352841172129 is in state JOB_STATE_RUNNING
[32mINFO [0m apache_beam.runners.dataflow.dataflow_runner:dataflow_runner.py:236 2022-02-18T13:38:43.966Z: JOB_MESSAGE_DETAILED: Autoscaling is enabled for job 2022-02-18_05_38_38-17347386352841172129. The number of workers will be between 1 and 1000.
[32mINFO [0m apache_beam.runners.dataflow.dataflow_runner:dataflow_runner.py:236 2022-02-18T13:38:44.117Z: JOB_MESSAGE_DETAILED: Autoscaling was automatically enabled for job 2022-02-18_05_38_38-17347386352841172129.
[32mINFO [0m apache_beam.runners.dataflow.dataflow_runner:dataflow_runner.py:236 2022-02-18T13:38:55.952Z: JOB_MESSAGE_BASIC: Worker configuration: e2-standard-2 in us-central1-b.
[32mINFO [0m apache_beam.runners.dataflow.dataflow_runner:dataflow_runner.py:236 2022-02-18T13:38:56.825Z: JOB_MESSAGE_DETAILED: Expanding SplittableParDo operations into optimizable parts.
[32mINFO [0m apache_beam.runners.dataflow.dataflow_runner:dataflow_runner.py:236 2022-02-18T13:38:56.854Z: JOB_MESSAGE_DETAILED: Expanding CollectionToSingleton operations into optimizable parts.
[32mINFO [0m apache_beam.runners.dataflow.dataflow_runner:dataflow_runner.py:236 2022-02-18T13:38:56.951Z: JOB_MESSAGE_DETAILED: Expanding CoGroupByKey operations into optimizable parts.
[32mINFO [0m apache_beam.runners.dataflow.dataflow_runner:dataflow_runner.py:236 2022-02-18T13:38:56.975Z: JOB_MESSAGE_DEBUG: Combiner lifting skipped for step write/Write/WriteImpl/GroupByKey: GroupByKey not followed by a combiner.
[32mINFO [0m apache_beam.runners.dataflow.dataflow_runner:dataflow_runner.py:236 2022-02-18T13:38:57.040Z: JOB_MESSAGE_DETAILED: Expanding GroupByKey operations into optimizable parts.
[32mINFO [0m apache_beam.runners.dataflow.dataflow_runner:dataflow_runner.py:236 2022-02-18T13:38:57.078Z: JOB_MESSAGE_DEBUG: Annotating graph with Autotuner information.
[32mINFO [0m apache_beam.runners.dataflow.dataflow_runner:dataflow_runner.py:236 2022-02-18T13:38:57.146Z: JOB_MESSAGE_DETAILED: Fusing adjacent ParDo, Read, Write, and Flatten operations
[32mINFO [0m apache_beam.runners.dataflow.dataflow_runner:dataflow_runner.py:236 2022-02-18T13:38:57.185Z: JOB_MESSAGE_DETAILED: Fusing consumer write/Write/WriteImpl/InitializeWrite into write/Write/WriteImpl/DoOnce/Map(decode)
[32mINFO [0m apache_beam.runners.dataflow.dataflow_runner:dataflow_runner.py:236 2022-02-18T13:38:57.222Z: JOB_MESSAGE_DETAILED: Fusing consumer read/Read/Map(<lambda at iobase.py:898>) into read/Read/Impulse
[32mINFO [0m apache_beam.runners.dataflow.dataflow_runner:dataflow_runner.py:236 2022-02-18T13:38:57.244Z: JOB_MESSAGE_DETAILED: Fusing consumer ref_AppliedPTransform_read-Read-SDFBoundedSourceReader-ParDo-SDFBoundedSourceDoFn-_7/PairWithRestriction into read/Read/Map(<lambda at iobase.py:898>)
[32mINFO [0m apache_beam.runners.dataflow.dataflow_runner:dataflow_runner.py:236 2022-02-18T13:38:57.283Z: JOB_MESSAGE_DETAILED: Fusing consumer ref_AppliedPTransform_read-Read-SDFBoundedSourceReader-ParDo-SDFBoundedSourceDoFn-_7/SplitWithSizing into ref_AppliedPTransform_read-Read-SDFBoundedSourceReader-ParDo-SDFBoundedSourceDoFn-_7/PairWithRestriction
[32mINFO [0m apache_beam.runners.dataflow.dataflow_runner:dataflow_runner.py:236 2022-02-18T13:38:57.318Z: JOB_MESSAGE_DETAILED: Fusing consumer points into ref_AppliedPTransform_read-Read-SDFBoundedSourceReader-ParDo-SDFBoundedSourceDoFn-_7/ProcessElementAndRestrictionWithSizing
[32mINFO [0m apache_beam.runners.dataflow.dataflow_runner:dataflow_runner.py:236 2022-02-18T13:38:57.354Z: JOB_MESSAGE_DETAILED: Fusing consumer CombinePerKey(sum)/GroupByKey+CombinePerKey(sum)/Combine/Partial into points
[32mINFO [0m apache_beam.runners.dataflow.dataflow_runner:dataflow_runner.py:236 2022-02-18T13:38:57.385Z: JOB_MESSAGE_DETAILED: Fusing consumer CombinePerKey(sum)/GroupByKey/Write into CombinePerKey(sum)/GroupByKey+CombinePerKey(sum)/Combine/Partial
[32mINFO [0m apache_beam.runners.dataflow.dataflow_runner:dataflow_runner.py:236 2022-02-18T13:38:57.411Z: JOB_MESSAGE_DETAILED: Fusing consumer CombinePerKey(sum)/Combine into CombinePerKey(sum)/GroupByKey/Read
[32mINFO [0m apache_beam.runners.dataflow.dataflow_runner:dataflow_runner.py:236 2022-02-18T13:38:57.443Z: JOB_MESSAGE_DETAILED: Fusing consumer CombinePerKey(sum)/Combine/Extract into CombinePerKey(sum)/Combine
[32mINFO [0m apache_beam.runners.dataflow.dataflow_runner:dataflow_runner.py:236 2022-02-18T13:38:57.501Z: JOB_MESSAGE_DETAILED: Fusing consumer write/Write/WriteImpl/WindowInto(WindowIntoFn) into CombinePerKey(sum)/Combine/Extract
[32mINFO [0m apache_beam.runners.dataflow.dataflow_runner:dataflow_runner.py:236 2022-02-18T13:38:57.527Z: JOB_MESSAGE_DETAILED: Fusing consumer write/Write/WriteImpl/DoOnce/FlatMap(<lambda at core.py:3229>) into write/Write/WriteImpl/DoOnce/Impulse
[32mINFO [0m apache_beam.runners.dataflow.dataflow_runner:dataflow_runner.py:236 2022-02-18T13:38:57.568Z: JOB_MESSAGE_DETAILED: Fusing consumer write/Write/WriteImpl/DoOnce/Map(decode) into write/Write/WriteImpl/DoOnce/FlatMap(<lambda at core.py:3229>)
[32mINFO [0m apache_beam.runners.dataflow.dataflow_runner:dataflow_runner.py:236 2022-02-18T13:38:57.605Z: JOB_MESSAGE_DETAILED: Fusing consumer write/Write/WriteImpl/WriteBundles into write/Write/WriteImpl/WindowInto(WindowIntoFn)
[32mINFO [0m apache_beam.runners.dataflow.dataflow_runner:dataflow_runner.py:236 2022-02-18T13:38:57.627Z: JOB_MESSAGE_DETAILED: Fusing consumer write/Write/WriteImpl/Pair into write/Write/WriteImpl/WriteBundles
[32mINFO [0m apache_beam.runners.dataflow.dataflow_runner:dataflow_runner.py:236 2022-02-18T13:38:57.670Z: JOB_MESSAGE_DETAILED: Fusing consumer write/Write/WriteImpl/GroupByKey/Write into write/Write/WriteImpl/Pair
[32mINFO [0m apache_beam.runners.dataflow.dataflow_runner:dataflow_runner.py:236 2022-02-18T13:38:57.704Z: JOB_MESSAGE_DETAILED: Fusing consumer write/Write/WriteImpl/Extract into write/Write/WriteImpl/GroupByKey/Read
[32mINFO [0m apache_beam.runners.dataflow.dataflow_runner:dataflow_runner.py:236 2022-02-18T13:38:57.738Z: JOB_MESSAGE_DEBUG: Workflow config is missing a default resource spec.
[32mINFO [0m apache_beam.runners.dataflow.dataflow_runner:dataflow_runner.py:236 2022-02-18T13:38:57.789Z: JOB_MESSAGE_DEBUG: Adding StepResource setup and teardown to workflow graph.
[32mINFO [0m apache_beam.runners.dataflow.dataflow_runner:dataflow_runner.py:236 2022-02-18T13:38:57.823Z: JOB_MESSAGE_DEBUG: Adding workflow start and stop steps.
[32mINFO [0m apache_beam.runners.dataflow.dataflow_runner:dataflow_runner.py:236 2022-02-18T13:38:57.852Z: JOB_MESSAGE_DEBUG: Assigning stage ids.
[32mINFO [0m apache_beam.runners.dataflow.dataflow_runner:dataflow_runner.py:236 2022-02-18T13:38:58.406Z: JOB_MESSAGE_DEBUG: Executing wait step start34
[32mINFO [0m apache_beam.runners.dataflow.dataflow_runner:dataflow_runner.py:236 2022-02-18T13:38:58.519Z: JOB_MESSAGE_BASIC: Executing operation write/Write/WriteImpl/DoOnce/Impulse+write/Write/WriteImpl/DoOnce/FlatMap(<lambda at core.py:3229>)+write/Write/WriteImpl/DoOnce/Map(decode)+write/Write/WriteImpl/InitializeWrite
[32mINFO [0m apache_beam.runners.dataflow.dataflow_runner:dataflow_runner.py:236 2022-02-18T13:38:58.578Z: JOB_MESSAGE_BASIC: Executing operation read/Read/Impulse+read/Read/Map(<lambda at iobase.py:898>)+ref_AppliedPTransform_read-Read-SDFBoundedSourceReader-ParDo-SDFBoundedSourceDoFn-_7/PairWithRestriction+ref_AppliedPTransform_read-Read-SDFBoundedSourceReader-ParDo-SDFBoundedSourceDoFn-_7/SplitWithSizing
[32mINFO [0m apache_beam.runners.dataflow.dataflow_runner:dataflow_runner.py:236 2022-02-18T13:38:58.612Z: JOB_MESSAGE_DEBUG: Starting worker pool setup.
[32mINFO [0m apache_beam.runners.dataflow.dataflow_runner:dataflow_runner.py:236 2022-02-18T13:38:58.651Z: JOB_MESSAGE_BASIC: Starting 1 workers in us-central1-b...
[32mINFO [0m apache_beam.runners.dataflow.dataflow_runner:dataflow_runner.py:236 2022-02-18T13:38:58.654Z: JOB_MESSAGE_BASIC: Executing operation CombinePerKey(sum)/GroupByKey/Create
[32mINFO [0m apache_beam.runners.dataflow.dataflow_runner:dataflow_runner.py:236 2022-02-18T13:38:58.692Z: JOB_MESSAGE_BASIC: Executing operation write/Write/WriteImpl/GroupByKey/Create
[32mINFO [0m apache_beam.runners.dataflow.dataflow_runner:dataflow_runner.py:236 2022-02-18T13:38:58.730Z: JOB_MESSAGE_BASIC: Finished operation CombinePerKey(sum)/GroupByKey/Create
[32mINFO [0m apache_beam.runners.dataflow.dataflow_runner:dataflow_runner.py:236 2022-02-18T13:38:58.730Z: JOB_MESSAGE_BASIC: Finished operation write/Write/WriteImpl/GroupByKey/Create
[32mINFO [0m apache_beam.runners.dataflow.dataflow_runner:dataflow_runner.py:236 2022-02-18T13:38:58.805Z: JOB_MESSAGE_DEBUG: Value "write/Write/WriteImpl/GroupByKey/Session" materialized.
[32mINFO [0m apache_beam.runners.dataflow.dataflow_runner:dataflow_runner.py:236 2022-02-18T13:38:58.841Z: JOB_MESSAGE_DEBUG: Value "CombinePerKey(sum)/GroupByKey/Session" materialized.
[32mINFO [0m apache_beam.runners.dataflow.dataflow_runner:dataflow_runner.py:236 2022-02-18T13:39:08.043Z: JOB_MESSAGE_BASIC: Your project already contains 100 Dataflow-created metric descriptors, so new user metrics of the form custom.googleapis.com/* will not be created. However, all user metrics are also available in the metric dataflow.googleapis.com/job/user_counter. If you rely on the custom metrics, you can delete old / unused metric descriptors. See https://developers.google.com/apis-explorer/#p/monitoring/v3/monitoring.projects.metricDescriptors.list and https://developers.google.com/apis-explorer/#p/monitoring/v3/monitoring.projects.metricDescriptors.delete
[32mINFO [0m apache_beam.runners.dataflow.dataflow_runner:dataflow_runner.py:236 2022-02-18T13:39:39.753Z: JOB_MESSAGE_DETAILED: Autoscaling: Raised the number of workers to 1 based on the rate of progress in the currently running stage(s).
[32mINFO [0m apache_beam.runners.dataflow.dataflow_runner:dataflow_runner.py:236 2022-02-18T13:39:54.959Z: JOB_MESSAGE_DETAILED: Workers have started successfully.
[32mINFO [0m apache_beam.runners.dataflow.dataflow_runner:dataflow_runner.py:236 2022-02-18T13:39:54.975Z: JOB_MESSAGE_DETAILED: Workers have started successfully.
[32mINFO [0m oauth2client.transport:transport.py:183 Refreshing due to a 401 (attempt 1/2)
[32mINFO [0m apache_beam.runners.dataflow.dataflow_runner:dataflow_runner.py:236 2022-02-18T13:46:18.035Z: JOB_MESSAGE_BASIC: Finished operation read/Read/Impulse+read/Read/Map(<lambda at iobase.py:898>)+ref_AppliedPTransform_read-Read-SDFBoundedSourceReader-ParDo-SDFBoundedSourceDoFn-_7/PairWithRestriction+ref_AppliedPTransform_read-Read-SDFBoundedSourceReader-ParDo-SDFBoundedSourceDoFn-_7/SplitWithSizing
[32mINFO [0m apache_beam.runners.dataflow.dataflow_runner:dataflow_runner.py:236 2022-02-18T13:46:18.123Z: JOB_MESSAGE_DEBUG: Value "ref_AppliedPTransform_read-Read-SDFBoundedSourceReader-ParDo-SDFBoundedSourceDoFn-_7-split-with-sizing-out3" materialized.
[32mINFO [0m apache_beam.runners.dataflow.dataflow_runner:dataflow_runner.py:236 2022-02-18T13:46:18.136Z: JOB_MESSAGE_BASIC: Finished operation write/Write/WriteImpl/DoOnce/Impulse+write/Write/WriteImpl/DoOnce/FlatMap(<lambda at core.py:3229>)+write/Write/WriteImpl/DoOnce/Map(decode)+write/Write/WriteImpl/InitializeWrite
[32mINFO [0m apache_beam.runners.dataflow.dataflow_runner:dataflow_runner.py:236 2022-02-18T13:46:18.206Z: JOB_MESSAGE_BASIC: Executing operation ref_AppliedPTransform_read-Read-SDFBoundedSourceReader-ParDo-SDFBoundedSourceDoFn-_7/ProcessElementAndRestrictionWithSizing+points+CombinePerKey(sum)/GroupByKey+CombinePerKey(sum)/Combine/Partial+CombinePerKey(sum)/GroupByKey/Write
[32mINFO [0m apache_beam.runners.dataflow.dataflow_runner:dataflow_runner.py:236 2022-02-18T13:46:18.258Z: JOB_MESSAGE_DEBUG: Value "write/Write/WriteImpl/DoOnce/Map(decode).None" materialized.
[32mINFO [0m apache_beam.runners.dataflow.dataflow_runner:dataflow_runner.py:236 2022-02-18T13:46:18.286Z: JOB_MESSAGE_DEBUG: Value "write/Write/WriteImpl/InitializeWrite.None" materialized.
[32mINFO [0m apache_beam.runners.dataflow.dataflow_runner:dataflow_runner.py:236 2022-02-18T13:46:18.369Z: JOB_MESSAGE_BASIC: Executing operation write/Write/WriteImpl/FinalizeWrite/View-python_side_input0-write/Write/WriteImpl/FinalizeWrite
[32mINFO [0m apache_beam.runners.dataflow.dataflow_runner:dataflow_runner.py:236 2022-02-18T13:46:18.409Z: JOB_MESSAGE_BASIC: Executing operation write/Write/WriteImpl/WriteBundles/View-python_side_input0-write/Write/WriteImpl/WriteBundles
[32mINFO [0m apache_beam.runners.dataflow.dataflow_runner:dataflow_runner.py:236 2022-02-18T13:46:18.433Z: JOB_MESSAGE_BASIC: Finished operation write/Write/WriteImpl/FinalizeWrite/View-python_side_input0-write/Write/WriteImpl/FinalizeWrite
[32mINFO [0m apache_beam.runners.dataflow.dataflow_runner:dataflow_runner.py:236 2022-02-18T13:46:18.466Z: JOB_MESSAGE_BASIC: Executing operation write/Write/WriteImpl/PreFinalize/View-python_side_input0-write/Write/WriteImpl/PreFinalize
[32mINFO [0m apache_beam.runners.dataflow.dataflow_runner:dataflow_runner.py:236 2022-02-18T13:46:18.473Z: JOB_MESSAGE_BASIC: Finished operation write/Write/WriteImpl/WriteBundles/View-python_side_input0-write/Write/WriteImpl/WriteBundles
[32mINFO [0m apache_beam.runners.dataflow.dataflow_runner:dataflow_runner.py:236 2022-02-18T13:46:18.504Z: JOB_MESSAGE_DEBUG: Value "write/Write/WriteImpl/FinalizeWrite/View-python_side_input0-write/Write/WriteImpl/FinalizeWrite.out" materialized.
[32mINFO [0m apache_beam.runners.dataflow.dataflow_runner:dataflow_runner.py:236 2022-02-18T13:46:18.528Z: JOB_MESSAGE_BASIC: Finished operation write/Write/WriteImpl/PreFinalize/View-python_side_input0-write/Write/WriteImpl/PreFinalize
[32mINFO [0m apache_beam.runners.dataflow.dataflow_runner:dataflow_runner.py:236 2022-02-18T13:46:18.541Z: JOB_MESSAGE_DEBUG: Value "write/Write/WriteImpl/WriteBundles/View-python_side_input0-write/Write/WriteImpl/WriteBundles.out" materialized.
[32mINFO [0m apache_beam.runners.dataflow.dataflow_runner:dataflow_runner.py:236 2022-02-18T13:46:18.610Z: JOB_MESSAGE_DEBUG: Value "write/Write/WriteImpl/PreFinalize/View-python_side_input0-write/Write/WriteImpl/PreFinalize.out" materialized.
[32mINFO [0m apache_beam.runners.dataflow.dataflow_runner:dataflow_runner.py:236 2022-02-18T13:46:23.755Z: JOB_MESSAGE_BASIC: Finished operation ref_AppliedPTransform_read-Read-SDFBoundedSourceReader-ParDo-SDFBoundedSourceDoFn-_7/ProcessElementAndRestrictionWithSizing+points+CombinePerKey(sum)/GroupByKey+CombinePerKey(sum)/Combine/Partial+CombinePerKey(sum)/GroupByKey/Write
[32mINFO [0m apache_beam.runners.dataflow.dataflow_runner:dataflow_runner.py:236 2022-02-18T13:46:23.816Z: JOB_MESSAGE_BASIC: Executing operation CombinePerKey(sum)/GroupByKey/Close
[32mINFO [0m apache_beam.runners.dataflow.dataflow_runner:dataflow_runner.py:236 2022-02-18T13:46:23.879Z: JOB_MESSAGE_BASIC: Finished operation CombinePerKey(sum)/GroupByKey/Close
[32mINFO [0m apache_beam.runners.dataflow.dataflow_runner:dataflow_runner.py:236 2022-02-18T13:46:23.939Z: JOB_MESSAGE_BASIC: Executing operation CombinePerKey(sum)/GroupByKey/Read+CombinePerKey(sum)/Combine+CombinePerKey(sum)/Combine/Extract+write/Write/WriteImpl/WindowInto(WindowIntoFn)+write/Write/WriteImpl/WriteBundles+write/Write/WriteImpl/Pair+write/Write/WriteImpl/GroupByKey/Write
[32mINFO [0m apache_beam.runners.dataflow.dataflow_runner:dataflow_runner.py:236 2022-02-18T13:46:25.127Z: JOB_MESSAGE_BASIC: Finished operation CombinePerKey(sum)/GroupByKey/Read+CombinePerKey(sum)/Combine+CombinePerKey(sum)/Combine/Extract+write/Write/WriteImpl/WindowInto(WindowIntoFn)+write/Write/WriteImpl/WriteBundles+write/Write/WriteImpl/Pair+write/Write/WriteImpl/GroupByKey/Write
[32mINFO [0m apache_beam.runners.dataflow.dataflow_runner:dataflow_runner.py:236 2022-02-18T13:46:25.199Z: JOB_MESSAGE_BASIC: Executing operation write/Write/WriteImpl/GroupByKey/Close
[32mINFO [0m apache_beam.runners.dataflow.dataflow_runner:dataflow_runner.py:236 2022-02-18T13:46:25.267Z: JOB_MESSAGE_BASIC: Finished operation write/Write/WriteImpl/GroupByKey/Close
[32mINFO [0m apache_beam.runners.dataflow.dataflow_runner:dataflow_runner.py:236 2022-02-18T13:46:25.322Z: JOB_MESSAGE_BASIC: Executing operation write/Write/WriteImpl/GroupByKey/Read+write/Write/WriteImpl/Extract
[32mINFO [0m apache_beam.runners.dataflow.dataflow_runner:dataflow_runner.py:236 2022-02-18T13:46:27.528Z: JOB_MESSAGE_BASIC: Finished operation write/Write/WriteImpl/GroupByKey/Read+write/Write/WriteImpl/Extract
[32mINFO [0m apache_beam.runners.dataflow.dataflow_runner:dataflow_runner.py:236 2022-02-18T13:46:27.617Z: JOB_MESSAGE_DEBUG: Value "write/Write/WriteImpl/Extract.None" materialized.
[32mINFO [0m apache_beam.runners.dataflow.dataflow_runner:dataflow_runner.py:236 2022-02-18T13:46:27.674Z: JOB_MESSAGE_BASIC: Executing operation write/Write/WriteImpl/FinalizeWrite/View-python_side_input1-write/Write/WriteImpl/FinalizeWrite
[32mINFO [0m apache_beam.runners.dataflow.dataflow_runner:dataflow_runner.py:236 2022-02-18T13:46:27.696Z: JOB_MESSAGE_BASIC: Executing operation write/Write/WriteImpl/PreFinalize/View-python_side_input1-write/Write/WriteImpl/PreFinalize
[32mINFO [0m apache_beam.runners.dataflow.dataflow_runner:dataflow_runner.py:236 2022-02-18T13:46:27.720Z: JOB_MESSAGE_BASIC: Finished operation write/Write/WriteImpl/FinalizeWrite/View-python_side_input1-write/Write/WriteImpl/FinalizeWrite
[32mINFO [0m apache_beam.runners.dataflow.dataflow_runner:dataflow_runner.py:236 2022-02-18T13:46:27.744Z: JOB_MESSAGE_BASIC: Finished operation write/Write/WriteImpl/PreFinalize/View-python_side_input1-write/Write/WriteImpl/PreFinalize
[32mINFO [0m apache_beam.runners.dataflow.dataflow_runner:dataflow_runner.py:236 2022-02-18T13:46:27.774Z: JOB_MESSAGE_DEBUG: Value "write/Write/WriteImpl/FinalizeWrite/View-python_side_input1-write/Write/WriteImpl/FinalizeWrite.out" materialized.
[32mINFO [0m apache_beam.runners.dataflow.dataflow_runner:dataflow_runner.py:236 2022-02-18T13:46:27.803Z: JOB_MESSAGE_DEBUG: Value "write/Write/WriteImpl/PreFinalize/View-python_side_input1-write/Write/WriteImpl/PreFinalize.out" materialized.
[32mINFO [0m apache_beam.runners.dataflow.dataflow_runner:dataflow_runner.py:236 2022-02-18T13:46:27.851Z: JOB_MESSAGE_BASIC: Executing operation write/Write/WriteImpl/PreFinalize
[32mINFO [0m apache_beam.runners.dataflow.dataflow_runner:dataflow_runner.py:236 2022-02-18T13:46:30.563Z: JOB_MESSAGE_BASIC: Finished operation write/Write/WriteImpl/PreFinalize
[32mINFO [0m apache_beam.runners.dataflow.dataflow_runner:dataflow_runner.py:236 2022-02-18T13:46:30.644Z: JOB_MESSAGE_DEBUG: Value "write/Write/WriteImpl/PreFinalize.None" materialized.
[32mINFO [0m apache_beam.runners.dataflow.dataflow_runner:dataflow_runner.py:236 2022-02-18T13:46:30.692Z: JOB_MESSAGE_BASIC: Executing operation write/Write/WriteImpl/FinalizeWrite/View-python_side_input2-write/Write/WriteImpl/FinalizeWrite
[32mINFO [0m apache_beam.runners.dataflow.dataflow_runner:dataflow_runner.py:236 2022-02-18T13:46:30.751Z: JOB_MESSAGE_BASIC: Finished operation write/Write/WriteImpl/FinalizeWrite/View-python_side_input2-write/Write/WriteImpl/FinalizeWrite
[32mINFO [0m apache_beam.runners.dataflow.dataflow_runner:dataflow_runner.py:236 2022-02-18T13:46:30.804Z: JOB_MESSAGE_DEBUG: Value "write/Write/WriteImpl/FinalizeWrite/View-python_side_input2-write/Write/WriteImpl/FinalizeWrite.out" materialized.
[32mINFO [0m apache_beam.runners.dataflow.dataflow_runner:dataflow_runner.py:236 2022-02-18T13:46:30.882Z: JOB_MESSAGE_BASIC: Executing operation write/Write/WriteImpl/FinalizeWrite
[32mINFO [0m apache_beam.runners.dataflow.dataflow_runner:dataflow_runner.py:236 2022-02-18T13:46:32.643Z: JOB_MESSAGE_BASIC: Finished operation write/Write/WriteImpl/FinalizeWrite
[32mINFO [0m apache_beam.runners.dataflow.dataflow_runner:dataflow_runner.py:236 2022-02-18T13:46:32.718Z: JOB_MESSAGE_DEBUG: Executing success step success32
[32mINFO [0m apache_beam.runners.dataflow.dataflow_runner:dataflow_runner.py:236 2022-02-18T13:46:32.806Z: JOB_MESSAGE_DETAILED: Cleaning up.
[32mINFO [0m apache_beam.runners.dataflow.dataflow_runner:dataflow_runner.py:236 2022-02-18T13:46:32.887Z: JOB_MESSAGE_DEBUG: Starting worker pool teardown.
[32mINFO [0m apache_beam.runners.dataflow.dataflow_runner:dataflow_runner.py:236 2022-02-18T13:46:32.918Z: JOB_MESSAGE_BASIC: Stopping worker pool...
[32mINFO [0m apache_beam.runners.dataflow.dataflow_runner:dataflow_runner.py:236 2022-02-18T13:48:52.890Z: JOB_MESSAGE_DETAILED: Autoscaling: Resized worker pool from 1 to 0.
[32mINFO [0m apache_beam.runners.dataflow.dataflow_runner:dataflow_runner.py:236 2022-02-18T13:48:52.938Z: JOB_MESSAGE_BASIC: Worker pool stopped.
[32mINFO [0m apache_beam.runners.dataflow.dataflow_runner:dataflow_runner.py:236 2022-02-18T13:48:52.978Z: JOB_MESSAGE_DEBUG: Tearing down pending resources...
[32mINFO [0m apache_beam.runners.dataflow.dataflow_runner:dataflow_runner.py:191 Job 2022-02-18_05_38_38-17347386352841172129 is in state JOB_STATE_DONE
[33m=============================== warnings summary ===============================[0m
<https://ci-beam.apache.org/job/beam_PostCommit_Python_Examples_Dataflow/ws/src/build/gradleenv/-1734967051/lib/python3.8/site-packages/tenacity/_asyncio.py>:42
<https://ci-beam.apache.org/job/beam_PostCommit_Python_Examples_Dataflow/ws/src/build/gradleenv/-1734967051/lib/python3.8/site-packages/tenacity/_asyncio.py>:42: DeprecationWarning: "@coroutine" decorator is deprecated since Python 3.8, use "async def" instead
def call(self, fn, *args, **kwargs):
apache_beam/examples/complete/game/hourly_team_score_it_test.py::HourlyTeamScoreIT::test_hourly_team_score_output_checksum_on_small_input
<https://ci-beam.apache.org/job/beam_PostCommit_Python_Examples_Dataflow/ws/src/sdks/python/apache_beam/io/gcp/tests/utils.py>:63: PendingDeprecationWarning: Client.dataset is deprecated and will be removed in a future version. Use a string like 'my_project.my_dataset' or a cloud.google.bigquery.DatasetReference object, instead.
dataset_ref = client.dataset(unique_dataset_name, project=project)
apache_beam/examples/complete/game/hourly_team_score_it_test.py::HourlyTeamScoreIT::test_hourly_team_score_output_checksum_on_small_input
<https://ci-beam.apache.org/job/beam_PostCommit_Python_Examples_Dataflow/ws/src/sdks/python/apache_beam/io/gcp/bigquery.py>:2138: BeamDeprecationWarning: options is deprecated since First stable release. References to <pipeline>.options will not be supported
is_streaming_pipeline = p.options.view_as(StandardOptions).streaming
apache_beam/examples/complete/game/hourly_team_score_it_test.py::HourlyTeamScoreIT::test_hourly_team_score_output_checksum_on_small_input
<https://ci-beam.apache.org/job/beam_PostCommit_Python_Examples_Dataflow/ws/src/sdks/python/apache_beam/io/gcp/bigquery.py>:2144: BeamDeprecationWarning: options is deprecated since First stable release. References to <pipeline>.options will not be supported
experiments = p.options.view_as(DebugOptions).experiments or []
apache_beam/examples/complete/game/hourly_team_score_it_test.py::HourlyTeamScoreIT::test_hourly_team_score_output_checksum_on_small_input
<https://ci-beam.apache.org/job/beam_PostCommit_Python_Examples_Dataflow/ws/src/sdks/python/apache_beam/io/gcp/bigquery_file_loads.py>:1128: BeamDeprecationWarning: options is deprecated since First stable release. References to <pipeline>.options will not be supported
temp_location = p.options.view_as(GoogleCloudOptions).temp_location
apache_beam/examples/complete/game/hourly_team_score_it_test.py::HourlyTeamScoreIT::test_hourly_team_score_output_checksum_on_small_input
<https://ci-beam.apache.org/job/beam_PostCommit_Python_Examples_Dataflow/ws/src/sdks/python/apache_beam/io/gcp/bigquery_file_loads.py>:1130: BeamDeprecationWarning: options is deprecated since First stable release. References to <pipeline>.options will not be supported
p.options.view_as(GoogleCloudOptions).job_name or 'AUTOMATIC_JOB_NAME')
apache_beam/examples/cookbook/bigquery_side_input_it_test.py::BigQuerySideInputIT::test_bigquery_side_input_it
apache_beam/examples/cookbook/bigquery_side_input_it_test.py::BigQuerySideInputIT::test_bigquery_side_input_it
<https://ci-beam.apache.org/job/beam_PostCommit_Python_Examples_Dataflow/ws/src/sdks/python/apache_beam/io/gcp/bigquery.py>:2437: BeamDeprecationWarning: options is deprecated since First stable release. References to <pipeline>.options will not be supported
temp_location = pcoll.pipeline.options.view_as(
apache_beam/examples/cookbook/bigquery_side_input_it_test.py::BigQuerySideInputIT::test_bigquery_side_input_it
apache_beam/examples/cookbook/bigquery_side_input_it_test.py::BigQuerySideInputIT::test_bigquery_side_input_it
<https://ci-beam.apache.org/job/beam_PostCommit_Python_Examples_Dataflow/ws/src/sdks/python/apache_beam/io/gcp/bigquery.py>:2439: BeamDeprecationWarning: options is deprecated since First stable release. References to <pipeline>.options will not be supported
job_name = pcoll.pipeline.options.view_as(GoogleCloudOptions).job_name
apache_beam/examples/cookbook/bigquery_side_input_it_test.py::BigQuerySideInputIT::test_bigquery_side_input_it
apache_beam/examples/cookbook/bigquery_side_input_it_test.py::BigQuerySideInputIT::test_bigquery_side_input_it
<https://ci-beam.apache.org/job/beam_PostCommit_Python_Examples_Dataflow/ws/src/sdks/python/apache_beam/io/gcp/bigquery.py>:2463: BeamDeprecationWarning: options is deprecated since First stable release. References to <pipeline>.options will not be supported
pipeline_options=pcoll.pipeline.options,
-- Docs: https://docs.pytest.org/en/latest/warnings.html
- generated xml file: <https://ci-beam.apache.org/job/beam_PostCommit_Python_Examples_Dataflow/ws/src/sdks/python/pytest_postCommitIT-df-py38-no-xdist.xml> -
[31m[1m===== 4 failed, 3 passed, 5213 deselected, 12 warnings in 4835.29 seconds ======[0m
> Task :sdks:python:test-suites:dataflow:py38:examples FAILED
FAILURE: Build failed with an exception.
* Where:
Script '<https://ci-beam.apache.org/job/beam_PostCommit_Python_Examples_Dataflow/ws/src/sdks/python/test-suites/dataflow/common.gradle'> line: 182
* What went wrong:
Execution failed for task ':sdks:python:test-suites:dataflow:py38:examples'.
> Process 'command 'sh'' finished with non-zero exit value 1
* Try:
> Run with --stacktrace option to get the stack trace.
> Run with --info or --debug option to get more log output.
> Run with --scan to get full insights.
* Get more help at https://help.gradle.org
BUILD FAILED in 1h 47m 48s
15 actionable tasks: 9 executed, 4 from cache, 2 up-to-date
Publishing build scan...
https://gradle.com/s/ybr7jy6mtghmi
Build step 'Invoke Gradle script' changed build result to FAILURE
Build step 'Invoke Gradle script' marked build as failure
---------------------------------------------------------------------
To unsubscribe, e-mail: builds-unsubscribe@beam.apache.org
For additional commands, e-mail: builds-help@beam.apache.org
Build failed in Jenkins: beam_PostCommit_Python_Examples_Dataflow #55
Posted by Apache Jenkins Server <je...@builds.apache.org>.
See <https://ci-beam.apache.org/job/beam_PostCommit_Python_Examples_Dataflow/55/display/redirect?page=changes>
Changes:
[noreply] [release-2.36.0] Fix pickler argument for 2.36 blog (#16774)
------------------------------------------
[...truncated 525.62 KB...]
[1m self.assertEqual([0m
[1m> sorted(self.EXPECTED_RESULT), sorted(self.format_result(result)))[0m
[1m[31mapache_beam/examples/cookbook/coders_test.py[0m:98:
_ _ _ _ _ _ _ _ _ _ _ _ _ _ _ _ _ _ _ _ _ _ _ _ _ _ _ _ _ _ _ _ _ _ _ _ _ _ _ _
[1m[31mapache_beam/examples/cookbook/coders_test.py[0m:60: in format_result
[1m result_list = list([0m
[1m[31mapache_beam/examples/cookbook/coders_test.py[0m:62: in <lambda>
[1m lambda result_elem: format_tuple(result_elem.split(',')),[0m
_ _ _ _ _ _ _ _ _ _ _ _ _ _ _ _ _ _ _ _ _ _ _ _ _ _ _ _ _ _ _ _ _ _ _ _ _ _ _ _
result_elem_list = ['']
[1m def format_tuple(result_elem_list):[0m
[1m> [country, counter] = result_elem_list[0m
[1m[31mE ValueError: not enough values to unpack (expected 2, got 1)[0m
[1m[31mapache_beam/examples/cookbook/coders_test.py[0m:57: ValueError
------------------------------ Captured log call -------------------------------
[32mINFO [0m root:coders_test.py:51 Creating temp file: /tmp/tmp1ef0hnnq/input.txt
[32mINFO [0m apache_beam.runners.portability.stager:stager.py:754 Executing command: ['<https://ci-beam.apache.org/job/beam_PostCommit_Python_Examples_Dataflow/ws/src/build/gradleenv/-1734967051/bin/python3.8',> '-m', 'pip', 'download', '--dest', '/tmp/dataflow-requirements-cache', '-r', '/tmp/tmpb_biecvq/tmp_requirements.txt', '--exists-action', 'i', '--no-deps', '--implementation', 'cp', '--abi', 'cp38', '--platform', 'manylinux2014_x86_64']
[32mINFO [0m apache_beam.runners.portability.stager:stager.py:325 Copying Beam SDK "<https://ci-beam.apache.org/job/beam_PostCommit_Python_Examples_Dataflow/ws/src/sdks/python/build/apache-beam.tar.gz"> to staging location.
[33mWARNING [0m root:environments.py:371 Make sure that locally built Python SDK docker image has Python 3.8 interpreter.
[32mINFO [0m root:environments.py:380 Default Python SDK image for environment is apache/beam_python3.8_sdk:2.38.0.dev
[32mINFO [0m root:environments.py:295 Using provided Python SDK container image: gcr.io/cloud-dataflow/v1beta3/python38-fnapi:beam-master-20220208
[32mINFO [0m root:environments.py:302 Python SDK container image set to "gcr.io/cloud-dataflow/v1beta3/python38-fnapi:beam-master-20220208" for Docker environment
[32mINFO [0m apache_beam.runners.portability.fn_api_runner.translations:translations.py:678 ==================== <function pack_combiners at 0x7fd4aa7c9820> ====================
[32mINFO [0m apache_beam.runners.portability.fn_api_runner.translations:translations.py:678 ==================== <function sort_stages at 0x7fd4aa7ca040> ====================
[32mINFO [0m apache_beam.runners.dataflow.internal.apiclient:apiclient.py:706 Starting GCS upload to gs://temp-storage-for-end-to-end-tests/staging-it/beamapp-jenkins-0218074111-044092-6vcz3mbq.1645170071.044253/requirements.txt...
[32mINFO [0m apache_beam.runners.dataflow.internal.apiclient:apiclient.py:722 Completed GCS upload to gs://temp-storage-for-end-to-end-tests/staging-it/beamapp-jenkins-0218074111-044092-6vcz3mbq.1645170071.044253/requirements.txt in 0 seconds.
[32mINFO [0m apache_beam.runners.dataflow.internal.apiclient:apiclient.py:706 Starting GCS upload to gs://temp-storage-for-end-to-end-tests/staging-it/beamapp-jenkins-0218074111-044092-6vcz3mbq.1645170071.044253/pickled_main_session...
[32mINFO [0m apache_beam.runners.dataflow.internal.apiclient:apiclient.py:722 Completed GCS upload to gs://temp-storage-for-end-to-end-tests/staging-it/beamapp-jenkins-0218074111-044092-6vcz3mbq.1645170071.044253/pickled_main_session in 0 seconds.
[32mINFO [0m apache_beam.runners.dataflow.internal.apiclient:apiclient.py:706 Starting GCS upload to gs://temp-storage-for-end-to-end-tests/staging-it/beamapp-jenkins-0218074111-044092-6vcz3mbq.1645170071.044253/pbr-5.8.1.tar.gz...
[32mINFO [0m apache_beam.runners.dataflow.internal.apiclient:apiclient.py:722 Completed GCS upload to gs://temp-storage-for-end-to-end-tests/staging-it/beamapp-jenkins-0218074111-044092-6vcz3mbq.1645170071.044253/pbr-5.8.1.tar.gz in 0 seconds.
[32mINFO [0m apache_beam.runners.dataflow.internal.apiclient:apiclient.py:706 Starting GCS upload to gs://temp-storage-for-end-to-end-tests/staging-it/beamapp-jenkins-0218074111-044092-6vcz3mbq.1645170071.044253/mock-1.3.0.tar.gz...
[32mINFO [0m apache_beam.runners.dataflow.internal.apiclient:apiclient.py:722 Completed GCS upload to gs://temp-storage-for-end-to-end-tests/staging-it/beamapp-jenkins-0218074111-044092-6vcz3mbq.1645170071.044253/mock-1.3.0.tar.gz in 0 seconds.
[32mINFO [0m apache_beam.runners.dataflow.internal.apiclient:apiclient.py:706 Starting GCS upload to gs://temp-storage-for-end-to-end-tests/staging-it/beamapp-jenkins-0218074111-044092-6vcz3mbq.1645170071.044253/mock-2.0.0.tar.gz...
[32mINFO [0m apache_beam.runners.dataflow.internal.apiclient:apiclient.py:722 Completed GCS upload to gs://temp-storage-for-end-to-end-tests/staging-it/beamapp-jenkins-0218074111-044092-6vcz3mbq.1645170071.044253/mock-2.0.0.tar.gz in 0 seconds.
[32mINFO [0m apache_beam.runners.dataflow.internal.apiclient:apiclient.py:706 Starting GCS upload to gs://temp-storage-for-end-to-end-tests/staging-it/beamapp-jenkins-0218074111-044092-6vcz3mbq.1645170071.044253/six-1.16.0.tar.gz...
[32mINFO [0m apache_beam.runners.dataflow.internal.apiclient:apiclient.py:722 Completed GCS upload to gs://temp-storage-for-end-to-end-tests/staging-it/beamapp-jenkins-0218074111-044092-6vcz3mbq.1645170071.044253/six-1.16.0.tar.gz in 0 seconds.
[32mINFO [0m apache_beam.runners.dataflow.internal.apiclient:apiclient.py:706 Starting GCS upload to gs://temp-storage-for-end-to-end-tests/staging-it/beamapp-jenkins-0218074111-044092-6vcz3mbq.1645170071.044253/soupsieve-2.3.1.tar.gz...
[32mINFO [0m apache_beam.runners.dataflow.internal.apiclient:apiclient.py:722 Completed GCS upload to gs://temp-storage-for-end-to-end-tests/staging-it/beamapp-jenkins-0218074111-044092-6vcz3mbq.1645170071.044253/soupsieve-2.3.1.tar.gz in 0 seconds.
[32mINFO [0m apache_beam.runners.dataflow.internal.apiclient:apiclient.py:706 Starting GCS upload to gs://temp-storage-for-end-to-end-tests/staging-it/beamapp-jenkins-0218074111-044092-6vcz3mbq.1645170071.044253/PyHamcrest-1.10.1.tar.gz...
[32mINFO [0m apache_beam.runners.dataflow.internal.apiclient:apiclient.py:722 Completed GCS upload to gs://temp-storage-for-end-to-end-tests/staging-it/beamapp-jenkins-0218074111-044092-6vcz3mbq.1645170071.044253/PyHamcrest-1.10.1.tar.gz in 0 seconds.
[32mINFO [0m apache_beam.runners.dataflow.internal.apiclient:apiclient.py:706 Starting GCS upload to gs://temp-storage-for-end-to-end-tests/staging-it/beamapp-jenkins-0218074111-044092-6vcz3mbq.1645170071.044253/parameterized-0.7.5.tar.gz...
[32mINFO [0m apache_beam.runners.dataflow.internal.apiclient:apiclient.py:722 Completed GCS upload to gs://temp-storage-for-end-to-end-tests/staging-it/beamapp-jenkins-0218074111-044092-6vcz3mbq.1645170071.044253/parameterized-0.7.5.tar.gz in 0 seconds.
[32mINFO [0m apache_beam.runners.dataflow.internal.apiclient:apiclient.py:706 Starting GCS upload to gs://temp-storage-for-end-to-end-tests/staging-it/beamapp-jenkins-0218074111-044092-6vcz3mbq.1645170071.044253/beautifulsoup4-4.10.0.tar.gz...
[32mINFO [0m apache_beam.runners.dataflow.internal.apiclient:apiclient.py:722 Completed GCS upload to gs://temp-storage-for-end-to-end-tests/staging-it/beamapp-jenkins-0218074111-044092-6vcz3mbq.1645170071.044253/beautifulsoup4-4.10.0.tar.gz in 0 seconds.
[32mINFO [0m apache_beam.runners.dataflow.internal.apiclient:apiclient.py:706 Starting GCS upload to gs://temp-storage-for-end-to-end-tests/staging-it/beamapp-jenkins-0218074111-044092-6vcz3mbq.1645170071.044253/mock-2.0.0-py2.py3-none-any.whl...
[32mINFO [0m apache_beam.runners.dataflow.internal.apiclient:apiclient.py:722 Completed GCS upload to gs://temp-storage-for-end-to-end-tests/staging-it/beamapp-jenkins-0218074111-044092-6vcz3mbq.1645170071.044253/mock-2.0.0-py2.py3-none-any.whl in 0 seconds.
[32mINFO [0m apache_beam.runners.dataflow.internal.apiclient:apiclient.py:706 Starting GCS upload to gs://temp-storage-for-end-to-end-tests/staging-it/beamapp-jenkins-0218074111-044092-6vcz3mbq.1645170071.044253/seaborn-0.11.2-py3-none-any.whl...
[32mINFO [0m apache_beam.runners.dataflow.internal.apiclient:apiclient.py:722 Completed GCS upload to gs://temp-storage-for-end-to-end-tests/staging-it/beamapp-jenkins-0218074111-044092-6vcz3mbq.1645170071.044253/seaborn-0.11.2-py3-none-any.whl in 0 seconds.
[32mINFO [0m apache_beam.runners.dataflow.internal.apiclient:apiclient.py:706 Starting GCS upload to gs://temp-storage-for-end-to-end-tests/staging-it/beamapp-jenkins-0218074111-044092-6vcz3mbq.1645170071.044253/PyHamcrest-1.10.1-py3-none-any.whl...
[32mINFO [0m apache_beam.runners.dataflow.internal.apiclient:apiclient.py:722 Completed GCS upload to gs://temp-storage-for-end-to-end-tests/staging-it/beamapp-jenkins-0218074111-044092-6vcz3mbq.1645170071.044253/PyHamcrest-1.10.1-py3-none-any.whl in 0 seconds.
[32mINFO [0m apache_beam.runners.dataflow.internal.apiclient:apiclient.py:706 Starting GCS upload to gs://temp-storage-for-end-to-end-tests/staging-it/beamapp-jenkins-0218074111-044092-6vcz3mbq.1645170071.044253/beautifulsoup4-4.10.0-py3-none-any.whl...
[32mINFO [0m apache_beam.runners.dataflow.internal.apiclient:apiclient.py:722 Completed GCS upload to gs://temp-storage-for-end-to-end-tests/staging-it/beamapp-jenkins-0218074111-044092-6vcz3mbq.1645170071.044253/beautifulsoup4-4.10.0-py3-none-any.whl in 0 seconds.
[32mINFO [0m apache_beam.runners.dataflow.internal.apiclient:apiclient.py:706 Starting GCS upload to gs://temp-storage-for-end-to-end-tests/staging-it/beamapp-jenkins-0218074111-044092-6vcz3mbq.1645170071.044253/parameterized-0.7.5-py2.py3-none-any.whl...
[32mINFO [0m apache_beam.runners.dataflow.internal.apiclient:apiclient.py:722 Completed GCS upload to gs://temp-storage-for-end-to-end-tests/staging-it/beamapp-jenkins-0218074111-044092-6vcz3mbq.1645170071.044253/parameterized-0.7.5-py2.py3-none-any.whl in 0 seconds.
[32mINFO [0m apache_beam.runners.dataflow.internal.apiclient:apiclient.py:706 Starting GCS upload to gs://temp-storage-for-end-to-end-tests/staging-it/beamapp-jenkins-0218074111-044092-6vcz3mbq.1645170071.044253/matplotlib-3.3.4-cp36-cp36m-manylinux1_x86_64.whl...
[32mINFO [0m apache_beam.runners.dataflow.internal.apiclient:apiclient.py:722 Completed GCS upload to gs://temp-storage-for-end-to-end-tests/staging-it/beamapp-jenkins-0218074111-044092-6vcz3mbq.1645170071.044253/matplotlib-3.3.4-cp36-cp36m-manylinux1_x86_64.whl in 0 seconds.
[32mINFO [0m apache_beam.runners.dataflow.internal.apiclient:apiclient.py:706 Starting GCS upload to gs://temp-storage-for-end-to-end-tests/staging-it/beamapp-jenkins-0218074111-044092-6vcz3mbq.1645170071.044253/matplotlib-3.5.1-cp38-cp38-manylinux_2_5_x86_64.manylinux1_x86_64.whl...
[32mINFO [0m apache_beam.runners.dataflow.internal.apiclient:apiclient.py:722 Completed GCS upload to gs://temp-storage-for-end-to-end-tests/staging-it/beamapp-jenkins-0218074111-044092-6vcz3mbq.1645170071.044253/matplotlib-3.5.1-cp38-cp38-manylinux_2_5_x86_64.manylinux1_x86_64.whl in 0 seconds.
[32mINFO [0m apache_beam.runners.dataflow.internal.apiclient:apiclient.py:706 Starting GCS upload to gs://temp-storage-for-end-to-end-tests/staging-it/beamapp-jenkins-0218074111-044092-6vcz3mbq.1645170071.044253/matplotlib-3.5.1-cp37-cp37m-manylinux_2_5_x86_64.manylinux1_x86_64.whl...
[32mINFO [0m apache_beam.runners.dataflow.internal.apiclient:apiclient.py:722 Completed GCS upload to gs://temp-storage-for-end-to-end-tests/staging-it/beamapp-jenkins-0218074111-044092-6vcz3mbq.1645170071.044253/matplotlib-3.5.1-cp37-cp37m-manylinux_2_5_x86_64.manylinux1_x86_64.whl in 0 seconds.
[32mINFO [0m apache_beam.runners.dataflow.internal.apiclient:apiclient.py:706 Starting GCS upload to gs://temp-storage-for-end-to-end-tests/staging-it/beamapp-jenkins-0218074111-044092-6vcz3mbq.1645170071.044253/dataflow_python_sdk.tar...
[32mINFO [0m apache_beam.runners.dataflow.internal.apiclient:apiclient.py:722 Completed GCS upload to gs://temp-storage-for-end-to-end-tests/staging-it/beamapp-jenkins-0218074111-044092-6vcz3mbq.1645170071.044253/dataflow_python_sdk.tar in 0 seconds.
[32mINFO [0m apache_beam.runners.dataflow.internal.apiclient:apiclient.py:706 Starting GCS upload to gs://temp-storage-for-end-to-end-tests/staging-it/beamapp-jenkins-0218074111-044092-6vcz3mbq.1645170071.044253/pipeline.pb...
[32mINFO [0m apache_beam.runners.dataflow.internal.apiclient:apiclient.py:722 Completed GCS upload to gs://temp-storage-for-end-to-end-tests/staging-it/beamapp-jenkins-0218074111-044092-6vcz3mbq.1645170071.044253/pipeline.pb in 0 seconds.
[33mWARNING [0m apache_beam.options.pipeline_options:pipeline_options.py:309 Discarding unparseable args: ['--sleep_secs=20', '--kms_key_name=projects/apache-beam-testing/locations/global/keyRings/beam-it/cryptoKeys/test']
[33mWARNING [0m apache_beam.options.pipeline_options:pipeline_options.py:309 Discarding unparseable args: ['--sleep_secs=20', '--kms_key_name=projects/apache-beam-testing/locations/global/keyRings/beam-it/cryptoKeys/test']
[32mINFO [0m apache_beam.runners.dataflow.internal.apiclient:apiclient.py:886 Create job: <Job
clientRequestId: '20220218074111045192-8518'
createTime: '2022-02-18T07:41:15.724263Z'
currentStateTime: '1970-01-01T00:00:00Z'
id: '2022-02-17_23_41_15-12815444347159487597'
location: 'us-central1'
name: 'beamapp-jenkins-0218074111-044092-6vcz3mbq'
projectId: 'apache-beam-testing'
stageStates: []
startTime: '2022-02-18T07:41:15.724263Z'
steps: []
tempFiles: []
type: TypeValueValuesEnum(JOB_TYPE_BATCH, 1)>
[32mINFO [0m apache_beam.runners.dataflow.internal.apiclient:apiclient.py:888 Created job with id: [2022-02-17_23_41_15-12815444347159487597]
[32mINFO [0m apache_beam.runners.dataflow.internal.apiclient:apiclient.py:889 Submitted job: 2022-02-17_23_41_15-12815444347159487597
[32mINFO [0m apache_beam.runners.dataflow.internal.apiclient:apiclient.py:890 To access the Dataflow monitoring console, please navigate to https://console.cloud.google.com/dataflow/jobs/us-central1/2022-02-17_23_41_15-12815444347159487597?project=apache-beam-testing
[32mINFO [0m apache_beam.runners.dataflow.dataflow_runner:dataflow_runner.py:191 Job 2022-02-17_23_41_15-12815444347159487597 is in state JOB_STATE_RUNNING
[32mINFO [0m apache_beam.runners.dataflow.dataflow_runner:dataflow_runner.py:236 2022-02-18T07:41:17.227Z: JOB_MESSAGE_DETAILED: Autoscaling is enabled for job 2022-02-17_23_41_15-12815444347159487597. The number of workers will be between 1 and 1000.
[32mINFO [0m apache_beam.runners.dataflow.dataflow_runner:dataflow_runner.py:236 2022-02-18T07:41:17.657Z: JOB_MESSAGE_DETAILED: Autoscaling was automatically enabled for job 2022-02-17_23_41_15-12815444347159487597.
[32mINFO [0m apache_beam.runners.dataflow.dataflow_runner:dataflow_runner.py:236 2022-02-18T07:41:20.054Z: JOB_MESSAGE_BASIC: Worker configuration: e2-standard-2 in us-central1-b.
[32mINFO [0m apache_beam.runners.dataflow.dataflow_runner:dataflow_runner.py:236 2022-02-18T07:41:21.686Z: JOB_MESSAGE_DETAILED: Expanding SplittableParDo operations into optimizable parts.
[32mINFO [0m apache_beam.runners.dataflow.dataflow_runner:dataflow_runner.py:236 2022-02-18T07:41:21.760Z: JOB_MESSAGE_DETAILED: Expanding CollectionToSingleton operations into optimizable parts.
[32mINFO [0m apache_beam.runners.dataflow.dataflow_runner:dataflow_runner.py:236 2022-02-18T07:41:21.836Z: JOB_MESSAGE_DETAILED: Expanding CoGroupByKey operations into optimizable parts.
[32mINFO [0m apache_beam.runners.dataflow.dataflow_runner:dataflow_runner.py:236 2022-02-18T07:41:21.873Z: JOB_MESSAGE_DEBUG: Combiner lifting skipped for step write/Write/WriteImpl/GroupByKey: GroupByKey not followed by a combiner.
[32mINFO [0m apache_beam.runners.dataflow.dataflow_runner:dataflow_runner.py:236 2022-02-18T07:41:21.948Z: JOB_MESSAGE_DETAILED: Expanding GroupByKey operations into optimizable parts.
[32mINFO [0m apache_beam.runners.dataflow.dataflow_runner:dataflow_runner.py:236 2022-02-18T07:41:21.977Z: JOB_MESSAGE_DEBUG: Annotating graph with Autotuner information.
[32mINFO [0m apache_beam.runners.dataflow.dataflow_runner:dataflow_runner.py:236 2022-02-18T07:41:22.025Z: JOB_MESSAGE_DETAILED: Fusing adjacent ParDo, Read, Write, and Flatten operations
[32mINFO [0m apache_beam.runners.dataflow.dataflow_runner:dataflow_runner.py:236 2022-02-18T07:41:22.061Z: JOB_MESSAGE_DETAILED: Fusing consumer write/Write/WriteImpl/InitializeWrite into write/Write/WriteImpl/DoOnce/Map(decode)
[32mINFO [0m apache_beam.runners.dataflow.dataflow_runner:dataflow_runner.py:236 2022-02-18T07:41:22.100Z: JOB_MESSAGE_DETAILED: Fusing consumer read/Read/Map(<lambda at iobase.py:898>) into read/Read/Impulse
[32mINFO [0m apache_beam.runners.dataflow.dataflow_runner:dataflow_runner.py:236 2022-02-18T07:41:22.127Z: JOB_MESSAGE_DETAILED: Fusing consumer ref_AppliedPTransform_read-Read-SDFBoundedSourceReader-ParDo-SDFBoundedSourceDoFn-_7/PairWithRestriction into read/Read/Map(<lambda at iobase.py:898>)
[32mINFO [0m apache_beam.runners.dataflow.dataflow_runner:dataflow_runner.py:236 2022-02-18T07:41:22.159Z: JOB_MESSAGE_DETAILED: Fusing consumer ref_AppliedPTransform_read-Read-SDFBoundedSourceReader-ParDo-SDFBoundedSourceDoFn-_7/SplitWithSizing into ref_AppliedPTransform_read-Read-SDFBoundedSourceReader-ParDo-SDFBoundedSourceDoFn-_7/PairWithRestriction
[32mINFO [0m apache_beam.runners.dataflow.dataflow_runner:dataflow_runner.py:236 2022-02-18T07:41:22.197Z: JOB_MESSAGE_DETAILED: Fusing consumer points into ref_AppliedPTransform_read-Read-SDFBoundedSourceReader-ParDo-SDFBoundedSourceDoFn-_7/ProcessElementAndRestrictionWithSizing
[32mINFO [0m apache_beam.runners.dataflow.dataflow_runner:dataflow_runner.py:236 2022-02-18T07:41:22.228Z: JOB_MESSAGE_DETAILED: Fusing consumer CombinePerKey(sum)/GroupByKey+CombinePerKey(sum)/Combine/Partial into points
[32mINFO [0m apache_beam.runners.dataflow.dataflow_runner:dataflow_runner.py:236 2022-02-18T07:41:22.263Z: JOB_MESSAGE_DETAILED: Fusing consumer CombinePerKey(sum)/GroupByKey/Write into CombinePerKey(sum)/GroupByKey+CombinePerKey(sum)/Combine/Partial
[32mINFO [0m apache_beam.runners.dataflow.dataflow_runner:dataflow_runner.py:236 2022-02-18T07:41:22.308Z: JOB_MESSAGE_DETAILED: Fusing consumer CombinePerKey(sum)/Combine into CombinePerKey(sum)/GroupByKey/Read
[32mINFO [0m apache_beam.runners.dataflow.dataflow_runner:dataflow_runner.py:236 2022-02-18T07:41:22.342Z: JOB_MESSAGE_DETAILED: Fusing consumer CombinePerKey(sum)/Combine/Extract into CombinePerKey(sum)/Combine
[32mINFO [0m apache_beam.runners.dataflow.dataflow_runner:dataflow_runner.py:236 2022-02-18T07:41:22.376Z: JOB_MESSAGE_DETAILED: Fusing consumer write/Write/WriteImpl/WindowInto(WindowIntoFn) into CombinePerKey(sum)/Combine/Extract
[32mINFO [0m apache_beam.runners.dataflow.dataflow_runner:dataflow_runner.py:236 2022-02-18T07:41:22.410Z: JOB_MESSAGE_DETAILED: Fusing consumer write/Write/WriteImpl/DoOnce/FlatMap(<lambda at core.py:3229>) into write/Write/WriteImpl/DoOnce/Impulse
[32mINFO [0m apache_beam.runners.dataflow.dataflow_runner:dataflow_runner.py:236 2022-02-18T07:41:22.456Z: JOB_MESSAGE_DETAILED: Fusing consumer write/Write/WriteImpl/DoOnce/Map(decode) into write/Write/WriteImpl/DoOnce/FlatMap(<lambda at core.py:3229>)
[32mINFO [0m apache_beam.runners.dataflow.dataflow_runner:dataflow_runner.py:236 2022-02-18T07:41:22.488Z: JOB_MESSAGE_DETAILED: Fusing consumer write/Write/WriteImpl/WriteBundles into write/Write/WriteImpl/WindowInto(WindowIntoFn)
[32mINFO [0m apache_beam.runners.dataflow.dataflow_runner:dataflow_runner.py:236 2022-02-18T07:41:22.569Z: JOB_MESSAGE_DETAILED: Fusing consumer write/Write/WriteImpl/Pair into write/Write/WriteImpl/WriteBundles
[32mINFO [0m apache_beam.runners.dataflow.dataflow_runner:dataflow_runner.py:236 2022-02-18T07:41:22.602Z: JOB_MESSAGE_DETAILED: Fusing consumer write/Write/WriteImpl/GroupByKey/Write into write/Write/WriteImpl/Pair
[32mINFO [0m apache_beam.runners.dataflow.dataflow_runner:dataflow_runner.py:236 2022-02-18T07:41:22.622Z: JOB_MESSAGE_DETAILED: Fusing consumer write/Write/WriteImpl/Extract into write/Write/WriteImpl/GroupByKey/Read
[32mINFO [0m apache_beam.runners.dataflow.dataflow_runner:dataflow_runner.py:236 2022-02-18T07:41:22.659Z: JOB_MESSAGE_DEBUG: Workflow config is missing a default resource spec.
[32mINFO [0m apache_beam.runners.dataflow.dataflow_runner:dataflow_runner.py:236 2022-02-18T07:41:22.698Z: JOB_MESSAGE_DEBUG: Adding StepResource setup and teardown to workflow graph.
[32mINFO [0m apache_beam.runners.dataflow.dataflow_runner:dataflow_runner.py:236 2022-02-18T07:41:22.761Z: JOB_MESSAGE_DEBUG: Adding workflow start and stop steps.
[32mINFO [0m apache_beam.runners.dataflow.dataflow_runner:dataflow_runner.py:236 2022-02-18T07:41:22.794Z: JOB_MESSAGE_DEBUG: Assigning stage ids.
[32mINFO [0m apache_beam.runners.dataflow.dataflow_runner:dataflow_runner.py:236 2022-02-18T07:41:22.948Z: JOB_MESSAGE_DEBUG: Executing wait step start34
[32mINFO [0m apache_beam.runners.dataflow.dataflow_runner:dataflow_runner.py:236 2022-02-18T07:41:23.036Z: JOB_MESSAGE_BASIC: Executing operation write/Write/WriteImpl/DoOnce/Impulse+write/Write/WriteImpl/DoOnce/FlatMap(<lambda at core.py:3229>)+write/Write/WriteImpl/DoOnce/Map(decode)+write/Write/WriteImpl/InitializeWrite
[32mINFO [0m apache_beam.runners.dataflow.dataflow_runner:dataflow_runner.py:236 2022-02-18T07:41:23.064Z: JOB_MESSAGE_BASIC: Executing operation read/Read/Impulse+read/Read/Map(<lambda at iobase.py:898>)+ref_AppliedPTransform_read-Read-SDFBoundedSourceReader-ParDo-SDFBoundedSourceDoFn-_7/PairWithRestriction+ref_AppliedPTransform_read-Read-SDFBoundedSourceReader-ParDo-SDFBoundedSourceDoFn-_7/SplitWithSizing
[32mINFO [0m apache_beam.runners.dataflow.dataflow_runner:dataflow_runner.py:236 2022-02-18T07:41:23.087Z: JOB_MESSAGE_DEBUG: Starting worker pool setup.
[32mINFO [0m apache_beam.runners.dataflow.dataflow_runner:dataflow_runner.py:236 2022-02-18T07:41:23.096Z: JOB_MESSAGE_BASIC: Executing operation CombinePerKey(sum)/GroupByKey/Create
[32mINFO [0m apache_beam.runners.dataflow.dataflow_runner:dataflow_runner.py:236 2022-02-18T07:41:23.122Z: JOB_MESSAGE_BASIC: Starting 1 workers in us-central1-b...
[32mINFO [0m apache_beam.runners.dataflow.dataflow_runner:dataflow_runner.py:236 2022-02-18T07:41:23.133Z: JOB_MESSAGE_BASIC: Executing operation write/Write/WriteImpl/GroupByKey/Create
[32mINFO [0m apache_beam.runners.dataflow.dataflow_runner:dataflow_runner.py:236 2022-02-18T07:41:23.186Z: JOB_MESSAGE_BASIC: Finished operation CombinePerKey(sum)/GroupByKey/Create
[32mINFO [0m apache_beam.runners.dataflow.dataflow_runner:dataflow_runner.py:236 2022-02-18T07:41:23.200Z: JOB_MESSAGE_BASIC: Finished operation write/Write/WriteImpl/GroupByKey/Create
[32mINFO [0m apache_beam.runners.dataflow.dataflow_runner:dataflow_runner.py:236 2022-02-18T07:41:23.249Z: JOB_MESSAGE_DEBUG: Value "CombinePerKey(sum)/GroupByKey/Session" materialized.
[32mINFO [0m apache_beam.runners.dataflow.dataflow_runner:dataflow_runner.py:236 2022-02-18T07:41:23.283Z: JOB_MESSAGE_DEBUG: Value "write/Write/WriteImpl/GroupByKey/Session" materialized.
[32mINFO [0m apache_beam.runners.dataflow.dataflow_runner:dataflow_runner.py:236 2022-02-18T07:41:32.614Z: JOB_MESSAGE_BASIC: Your project already contains 100 Dataflow-created metric descriptors, so new user metrics of the form custom.googleapis.com/* will not be created. However, all user metrics are also available in the metric dataflow.googleapis.com/job/user_counter. If you rely on the custom metrics, you can delete old / unused metric descriptors. See https://developers.google.com/apis-explorer/#p/monitoring/v3/monitoring.projects.metricDescriptors.list and https://developers.google.com/apis-explorer/#p/monitoring/v3/monitoring.projects.metricDescriptors.delete
[32mINFO [0m apache_beam.runners.dataflow.dataflow_runner:dataflow_runner.py:236 2022-02-18T07:42:05.935Z: JOB_MESSAGE_DETAILED: Autoscaling: Raised the number of workers to 1 based on the rate of progress in the currently running stage(s).
[32mINFO [0m apache_beam.runners.dataflow.dataflow_runner:dataflow_runner.py:236 2022-02-18T07:42:26.072Z: JOB_MESSAGE_DETAILED: Workers have started successfully.
[32mINFO [0m apache_beam.runners.dataflow.dataflow_runner:dataflow_runner.py:236 2022-02-18T07:42:26.097Z: JOB_MESSAGE_DETAILED: Workers have started successfully.
[32mINFO [0m apache_beam.runners.dataflow.dataflow_runner:dataflow_runner.py:236 2022-02-18T07:48:54.012Z: JOB_MESSAGE_BASIC: Finished operation read/Read/Impulse+read/Read/Map(<lambda at iobase.py:898>)+ref_AppliedPTransform_read-Read-SDFBoundedSourceReader-ParDo-SDFBoundedSourceDoFn-_7/PairWithRestriction+ref_AppliedPTransform_read-Read-SDFBoundedSourceReader-ParDo-SDFBoundedSourceDoFn-_7/SplitWithSizing
[32mINFO [0m apache_beam.runners.dataflow.dataflow_runner:dataflow_runner.py:236 2022-02-18T07:48:54.091Z: JOB_MESSAGE_DEBUG: Value "ref_AppliedPTransform_read-Read-SDFBoundedSourceReader-ParDo-SDFBoundedSourceDoFn-_7-split-with-sizing-out3" materialized.
[32mINFO [0m apache_beam.runners.dataflow.dataflow_runner:dataflow_runner.py:236 2022-02-18T07:48:54.141Z: JOB_MESSAGE_BASIC: Executing operation ref_AppliedPTransform_read-Read-SDFBoundedSourceReader-ParDo-SDFBoundedSourceDoFn-_7/ProcessElementAndRestrictionWithSizing+points+CombinePerKey(sum)/GroupByKey+CombinePerKey(sum)/Combine/Partial+CombinePerKey(sum)/GroupByKey/Write
[32mINFO [0m apache_beam.runners.dataflow.dataflow_runner:dataflow_runner.py:236 2022-02-18T07:48:54.200Z: JOB_MESSAGE_BASIC: Finished operation write/Write/WriteImpl/DoOnce/Impulse+write/Write/WriteImpl/DoOnce/FlatMap(<lambda at core.py:3229>)+write/Write/WriteImpl/DoOnce/Map(decode)+write/Write/WriteImpl/InitializeWrite
[32mINFO [0m apache_beam.runners.dataflow.dataflow_runner:dataflow_runner.py:236 2022-02-18T07:48:54.271Z: JOB_MESSAGE_DEBUG: Value "write/Write/WriteImpl/DoOnce/Map(decode).None" materialized.
[32mINFO [0m apache_beam.runners.dataflow.dataflow_runner:dataflow_runner.py:236 2022-02-18T07:48:54.301Z: JOB_MESSAGE_DEBUG: Value "write/Write/WriteImpl/InitializeWrite.None" materialized.
[32mINFO [0m apache_beam.runners.dataflow.dataflow_runner:dataflow_runner.py:236 2022-02-18T07:48:54.380Z: JOB_MESSAGE_BASIC: Executing operation write/Write/WriteImpl/FinalizeWrite/View-python_side_input0-write/Write/WriteImpl/FinalizeWrite
[32mINFO [0m apache_beam.runners.dataflow.dataflow_runner:dataflow_runner.py:236 2022-02-18T07:48:54.407Z: JOB_MESSAGE_BASIC: Executing operation write/Write/WriteImpl/WriteBundles/View-python_side_input0-write/Write/WriteImpl/WriteBundles
[32mINFO [0m apache_beam.runners.dataflow.dataflow_runner:dataflow_runner.py:236 2022-02-18T07:48:54.431Z: JOB_MESSAGE_BASIC: Finished operation write/Write/WriteImpl/FinalizeWrite/View-python_side_input0-write/Write/WriteImpl/FinalizeWrite
[32mINFO [0m apache_beam.runners.dataflow.dataflow_runner:dataflow_runner.py:236 2022-02-18T07:48:54.438Z: JOB_MESSAGE_BASIC: Executing operation write/Write/WriteImpl/PreFinalize/View-python_side_input0-write/Write/WriteImpl/PreFinalize
[32mINFO [0m apache_beam.runners.dataflow.dataflow_runner:dataflow_runner.py:236 2022-02-18T07:48:54.451Z: JOB_MESSAGE_BASIC: Finished operation write/Write/WriteImpl/WriteBundles/View-python_side_input0-write/Write/WriteImpl/WriteBundles
[32mINFO [0m apache_beam.runners.dataflow.dataflow_runner:dataflow_runner.py:236 2022-02-18T07:48:54.480Z: JOB_MESSAGE_BASIC: Finished operation write/Write/WriteImpl/PreFinalize/View-python_side_input0-write/Write/WriteImpl/PreFinalize
[32mINFO [0m apache_beam.runners.dataflow.dataflow_runner:dataflow_runner.py:236 2022-02-18T07:48:54.493Z: JOB_MESSAGE_DEBUG: Value "write/Write/WriteImpl/FinalizeWrite/View-python_side_input0-write/Write/WriteImpl/FinalizeWrite.out" materialized.
[32mINFO [0m apache_beam.runners.dataflow.dataflow_runner:dataflow_runner.py:236 2022-02-18T07:48:54.534Z: JOB_MESSAGE_DEBUG: Value "write/Write/WriteImpl/WriteBundles/View-python_side_input0-write/Write/WriteImpl/WriteBundles.out" materialized.
[32mINFO [0m apache_beam.runners.dataflow.dataflow_runner:dataflow_runner.py:236 2022-02-18T07:48:54.558Z: JOB_MESSAGE_DEBUG: Value "write/Write/WriteImpl/PreFinalize/View-python_side_input0-write/Write/WriteImpl/PreFinalize.out" materialized.
[32mINFO [0m apache_beam.runners.dataflow.dataflow_runner:dataflow_runner.py:236 2022-02-18T07:48:59.857Z: JOB_MESSAGE_BASIC: Finished operation ref_AppliedPTransform_read-Read-SDFBoundedSourceReader-ParDo-SDFBoundedSourceDoFn-_7/ProcessElementAndRestrictionWithSizing+points+CombinePerKey(sum)/GroupByKey+CombinePerKey(sum)/Combine/Partial+CombinePerKey(sum)/GroupByKey/Write
[32mINFO [0m apache_beam.runners.dataflow.dataflow_runner:dataflow_runner.py:236 2022-02-18T07:48:59.916Z: JOB_MESSAGE_BASIC: Executing operation CombinePerKey(sum)/GroupByKey/Close
[32mINFO [0m apache_beam.runners.dataflow.dataflow_runner:dataflow_runner.py:236 2022-02-18T07:48:59.956Z: JOB_MESSAGE_BASIC: Finished operation CombinePerKey(sum)/GroupByKey/Close
[32mINFO [0m apache_beam.runners.dataflow.dataflow_runner:dataflow_runner.py:236 2022-02-18T07:49:00.014Z: JOB_MESSAGE_BASIC: Executing operation CombinePerKey(sum)/GroupByKey/Read+CombinePerKey(sum)/Combine+CombinePerKey(sum)/Combine/Extract+write/Write/WriteImpl/WindowInto(WindowIntoFn)+write/Write/WriteImpl/WriteBundles+write/Write/WriteImpl/Pair+write/Write/WriteImpl/GroupByKey/Write
[32mINFO [0m apache_beam.runners.dataflow.dataflow_runner:dataflow_runner.py:236 2022-02-18T07:49:01.162Z: JOB_MESSAGE_BASIC: Finished operation CombinePerKey(sum)/GroupByKey/Read+CombinePerKey(sum)/Combine+CombinePerKey(sum)/Combine/Extract+write/Write/WriteImpl/WindowInto(WindowIntoFn)+write/Write/WriteImpl/WriteBundles+write/Write/WriteImpl/Pair+write/Write/WriteImpl/GroupByKey/Write
[32mINFO [0m apache_beam.runners.dataflow.dataflow_runner:dataflow_runner.py:236 2022-02-18T07:49:01.248Z: JOB_MESSAGE_BASIC: Executing operation write/Write/WriteImpl/GroupByKey/Close
[32mINFO [0m apache_beam.runners.dataflow.dataflow_runner:dataflow_runner.py:236 2022-02-18T07:49:01.310Z: JOB_MESSAGE_BASIC: Finished operation write/Write/WriteImpl/GroupByKey/Close
[32mINFO [0m apache_beam.runners.dataflow.dataflow_runner:dataflow_runner.py:236 2022-02-18T07:49:01.371Z: JOB_MESSAGE_BASIC: Executing operation write/Write/WriteImpl/GroupByKey/Read+write/Write/WriteImpl/Extract
[32mINFO [0m apache_beam.runners.dataflow.dataflow_runner:dataflow_runner.py:236 2022-02-18T07:49:03.594Z: JOB_MESSAGE_BASIC: Finished operation write/Write/WriteImpl/GroupByKey/Read+write/Write/WriteImpl/Extract
[32mINFO [0m apache_beam.runners.dataflow.dataflow_runner:dataflow_runner.py:236 2022-02-18T07:49:03.661Z: JOB_MESSAGE_DEBUG: Value "write/Write/WriteImpl/Extract.None" materialized.
[32mINFO [0m apache_beam.runners.dataflow.dataflow_runner:dataflow_runner.py:236 2022-02-18T07:49:03.745Z: JOB_MESSAGE_BASIC: Executing operation write/Write/WriteImpl/FinalizeWrite/View-python_side_input1-write/Write/WriteImpl/FinalizeWrite
[32mINFO [0m apache_beam.runners.dataflow.dataflow_runner:dataflow_runner.py:236 2022-02-18T07:49:03.765Z: JOB_MESSAGE_BASIC: Executing operation write/Write/WriteImpl/PreFinalize/View-python_side_input1-write/Write/WriteImpl/PreFinalize
[32mINFO [0m apache_beam.runners.dataflow.dataflow_runner:dataflow_runner.py:236 2022-02-18T07:49:03.793Z: JOB_MESSAGE_BASIC: Finished operation write/Write/WriteImpl/FinalizeWrite/View-python_side_input1-write/Write/WriteImpl/FinalizeWrite
[32mINFO [0m apache_beam.runners.dataflow.dataflow_runner:dataflow_runner.py:236 2022-02-18T07:49:03.810Z: JOB_MESSAGE_BASIC: Finished operation write/Write/WriteImpl/PreFinalize/View-python_side_input1-write/Write/WriteImpl/PreFinalize
[32mINFO [0m apache_beam.runners.dataflow.dataflow_runner:dataflow_runner.py:236 2022-02-18T07:49:03.863Z: JOB_MESSAGE_DEBUG: Value "write/Write/WriteImpl/FinalizeWrite/View-python_side_input1-write/Write/WriteImpl/FinalizeWrite.out" materialized.
[32mINFO [0m apache_beam.runners.dataflow.dataflow_runner:dataflow_runner.py:236 2022-02-18T07:49:03.928Z: JOB_MESSAGE_DEBUG: Value "write/Write/WriteImpl/PreFinalize/View-python_side_input1-write/Write/WriteImpl/PreFinalize.out" materialized.
[32mINFO [0m apache_beam.runners.dataflow.dataflow_runner:dataflow_runner.py:236 2022-02-18T07:49:03.981Z: JOB_MESSAGE_BASIC: Executing operation write/Write/WriteImpl/PreFinalize
[32mINFO [0m apache_beam.runners.dataflow.dataflow_runner:dataflow_runner.py:236 2022-02-18T07:49:06.699Z: JOB_MESSAGE_BASIC: Finished operation write/Write/WriteImpl/PreFinalize
[32mINFO [0m apache_beam.runners.dataflow.dataflow_runner:dataflow_runner.py:236 2022-02-18T07:49:06.770Z: JOB_MESSAGE_DEBUG: Value "write/Write/WriteImpl/PreFinalize.None" materialized.
[32mINFO [0m apache_beam.runners.dataflow.dataflow_runner:dataflow_runner.py:236 2022-02-18T07:49:06.838Z: JOB_MESSAGE_BASIC: Executing operation write/Write/WriteImpl/FinalizeWrite/View-python_side_input2-write/Write/WriteImpl/FinalizeWrite
[32mINFO [0m apache_beam.runners.dataflow.dataflow_runner:dataflow_runner.py:236 2022-02-18T07:49:06.912Z: JOB_MESSAGE_BASIC: Finished operation write/Write/WriteImpl/FinalizeWrite/View-python_side_input2-write/Write/WriteImpl/FinalizeWrite
[32mINFO [0m apache_beam.runners.dataflow.dataflow_runner:dataflow_runner.py:236 2022-02-18T07:49:06.977Z: JOB_MESSAGE_DEBUG: Value "write/Write/WriteImpl/FinalizeWrite/View-python_side_input2-write/Write/WriteImpl/FinalizeWrite.out" materialized.
[32mINFO [0m apache_beam.runners.dataflow.dataflow_runner:dataflow_runner.py:236 2022-02-18T07:49:07.037Z: JOB_MESSAGE_BASIC: Executing operation write/Write/WriteImpl/FinalizeWrite
[32mINFO [0m apache_beam.runners.dataflow.dataflow_runner:dataflow_runner.py:236 2022-02-18T07:49:08.784Z: JOB_MESSAGE_BASIC: Finished operation write/Write/WriteImpl/FinalizeWrite
[32mINFO [0m apache_beam.runners.dataflow.dataflow_runner:dataflow_runner.py:236 2022-02-18T07:49:08.839Z: JOB_MESSAGE_DEBUG: Executing success step success32
[32mINFO [0m apache_beam.runners.dataflow.dataflow_runner:dataflow_runner.py:236 2022-02-18T07:49:08.930Z: JOB_MESSAGE_DETAILED: Cleaning up.
[32mINFO [0m apache_beam.runners.dataflow.dataflow_runner:dataflow_runner.py:236 2022-02-18T07:49:09.025Z: JOB_MESSAGE_DEBUG: Starting worker pool teardown.
[32mINFO [0m apache_beam.runners.dataflow.dataflow_runner:dataflow_runner.py:236 2022-02-18T07:49:09.057Z: JOB_MESSAGE_BASIC: Stopping worker pool...
[32mINFO [0m apache_beam.runners.dataflow.dataflow_runner:dataflow_runner.py:236 2022-02-18T07:51:40.702Z: JOB_MESSAGE_DETAILED: Autoscaling: Resized worker pool from 1 to 0.
[32mINFO [0m apache_beam.runners.dataflow.dataflow_runner:dataflow_runner.py:236 2022-02-18T07:51:40.754Z: JOB_MESSAGE_BASIC: Worker pool stopped.
[32mINFO [0m apache_beam.runners.dataflow.dataflow_runner:dataflow_runner.py:236 2022-02-18T07:51:40.783Z: JOB_MESSAGE_DEBUG: Tearing down pending resources...
[32mINFO [0m apache_beam.runners.dataflow.dataflow_runner:dataflow_runner.py:191 Job 2022-02-17_23_41_15-12815444347159487597 is in state JOB_STATE_DONE
[33m=============================== warnings summary ===============================[0m
<https://ci-beam.apache.org/job/beam_PostCommit_Python_Examples_Dataflow/ws/src/build/gradleenv/-1734967051/lib/python3.8/site-packages/tenacity/_asyncio.py>:42
<https://ci-beam.apache.org/job/beam_PostCommit_Python_Examples_Dataflow/ws/src/build/gradleenv/-1734967051/lib/python3.8/site-packages/tenacity/_asyncio.py>:42: DeprecationWarning: "@coroutine" decorator is deprecated since Python 3.8, use "async def" instead
def call(self, fn, *args, **kwargs):
apache_beam/examples/complete/game/hourly_team_score_it_test.py::HourlyTeamScoreIT::test_hourly_team_score_output_checksum_on_small_input
<https://ci-beam.apache.org/job/beam_PostCommit_Python_Examples_Dataflow/ws/src/sdks/python/apache_beam/io/gcp/tests/utils.py>:63: PendingDeprecationWarning: Client.dataset is deprecated and will be removed in a future version. Use a string like 'my_project.my_dataset' or a cloud.google.bigquery.DatasetReference object, instead.
dataset_ref = client.dataset(unique_dataset_name, project=project)
apache_beam/examples/complete/game/hourly_team_score_it_test.py::HourlyTeamScoreIT::test_hourly_team_score_output_checksum_on_small_input
<https://ci-beam.apache.org/job/beam_PostCommit_Python_Examples_Dataflow/ws/src/sdks/python/apache_beam/io/gcp/bigquery.py>:2138: BeamDeprecationWarning: options is deprecated since First stable release. References to <pipeline>.options will not be supported
is_streaming_pipeline = p.options.view_as(StandardOptions).streaming
apache_beam/examples/complete/game/hourly_team_score_it_test.py::HourlyTeamScoreIT::test_hourly_team_score_output_checksum_on_small_input
<https://ci-beam.apache.org/job/beam_PostCommit_Python_Examples_Dataflow/ws/src/sdks/python/apache_beam/io/gcp/bigquery.py>:2144: BeamDeprecationWarning: options is deprecated since First stable release. References to <pipeline>.options will not be supported
experiments = p.options.view_as(DebugOptions).experiments or []
apache_beam/examples/complete/game/hourly_team_score_it_test.py::HourlyTeamScoreIT::test_hourly_team_score_output_checksum_on_small_input
<https://ci-beam.apache.org/job/beam_PostCommit_Python_Examples_Dataflow/ws/src/sdks/python/apache_beam/io/gcp/bigquery_file_loads.py>:1128: BeamDeprecationWarning: options is deprecated since First stable release. References to <pipeline>.options will not be supported
temp_location = p.options.view_as(GoogleCloudOptions).temp_location
apache_beam/examples/complete/game/hourly_team_score_it_test.py::HourlyTeamScoreIT::test_hourly_team_score_output_checksum_on_small_input
<https://ci-beam.apache.org/job/beam_PostCommit_Python_Examples_Dataflow/ws/src/sdks/python/apache_beam/io/gcp/bigquery_file_loads.py>:1130: BeamDeprecationWarning: options is deprecated since First stable release. References to <pipeline>.options will not be supported
p.options.view_as(GoogleCloudOptions).job_name or 'AUTOMATIC_JOB_NAME')
apache_beam/examples/cookbook/bigquery_side_input_it_test.py::BigQuerySideInputIT::test_bigquery_side_input_it
apache_beam/examples/cookbook/bigquery_side_input_it_test.py::BigQuerySideInputIT::test_bigquery_side_input_it
<https://ci-beam.apache.org/job/beam_PostCommit_Python_Examples_Dataflow/ws/src/sdks/python/apache_beam/io/gcp/bigquery.py>:2437: BeamDeprecationWarning: options is deprecated since First stable release. References to <pipeline>.options will not be supported
temp_location = pcoll.pipeline.options.view_as(
apache_beam/examples/cookbook/bigquery_side_input_it_test.py::BigQuerySideInputIT::test_bigquery_side_input_it
apache_beam/examples/cookbook/bigquery_side_input_it_test.py::BigQuerySideInputIT::test_bigquery_side_input_it
<https://ci-beam.apache.org/job/beam_PostCommit_Python_Examples_Dataflow/ws/src/sdks/python/apache_beam/io/gcp/bigquery.py>:2439: BeamDeprecationWarning: options is deprecated since First stable release. References to <pipeline>.options will not be supported
job_name = pcoll.pipeline.options.view_as(GoogleCloudOptions).job_name
apache_beam/examples/cookbook/bigquery_side_input_it_test.py::BigQuerySideInputIT::test_bigquery_side_input_it
apache_beam/examples/cookbook/bigquery_side_input_it_test.py::BigQuerySideInputIT::test_bigquery_side_input_it
<https://ci-beam.apache.org/job/beam_PostCommit_Python_Examples_Dataflow/ws/src/sdks/python/apache_beam/io/gcp/bigquery.py>:2463: BeamDeprecationWarning: options is deprecated since First stable release. References to <pipeline>.options will not be supported
pipeline_options=pcoll.pipeline.options,
-- Docs: https://docs.pytest.org/en/latest/warnings.html
- generated xml file: <https://ci-beam.apache.org/job/beam_PostCommit_Python_Examples_Dataflow/ws/src/sdks/python/pytest_postCommitIT-df-py38-no-xdist.xml> -
[31m[1m===== 4 failed, 3 passed, 5213 deselected, 12 warnings in 5033.98 seconds ======[0m
> Task :sdks:python:test-suites:dataflow:py38:examples FAILED
FAILURE: Build failed with an exception.
* Where:
Script '<https://ci-beam.apache.org/job/beam_PostCommit_Python_Examples_Dataflow/ws/src/sdks/python/test-suites/dataflow/common.gradle'> line: 182
* What went wrong:
Execution failed for task ':sdks:python:test-suites:dataflow:py38:examples'.
> Process 'command 'sh'' finished with non-zero exit value 1
* Try:
> Run with --stacktrace option to get the stack trace.
> Run with --info or --debug option to get more log output.
> Run with --scan to get full insights.
* Get more help at https://help.gradle.org
BUILD FAILED in 1h 51m 9s
15 actionable tasks: 9 executed, 4 from cache, 2 up-to-date
Publishing build scan...
https://gradle.com/s/mte7vg6bgyy2w
Build step 'Invoke Gradle script' changed build result to FAILURE
Build step 'Invoke Gradle script' marked build as failure
---------------------------------------------------------------------
To unsubscribe, e-mail: builds-unsubscribe@beam.apache.org
For additional commands, e-mail: builds-help@beam.apache.org