You are viewing a plain text version of this content. The canonical link for it is here.
Posted to dev@hive.apache.org by Apache Jenkins Server <je...@builds.apache.org> on 2012/11/04 17:04:36 UTC
Build failed in Jenkins: Hive-0.9.1-SNAPSHOT-h0.21 #188
See <https://builds.apache.org/job/Hive-0.9.1-SNAPSHOT-h0.21/188/>
------------------------------------------
[...truncated 5426 lines...]
create-dirs:
[echo] Project: jdbc
[mkdir] Created dir: <https://builds.apache.org/job/Hive-0.9.1-SNAPSHOT-h0.21/188/artifact/hive/build/jdbc>
[mkdir] Created dir: <https://builds.apache.org/job/Hive-0.9.1-SNAPSHOT-h0.21/188/artifact/hive/build/jdbc/classes>
[mkdir] Created dir: <https://builds.apache.org/job/Hive-0.9.1-SNAPSHOT-h0.21/188/artifact/hive/build/jdbc/test>
[mkdir] Created dir: <https://builds.apache.org/job/Hive-0.9.1-SNAPSHOT-h0.21/188/artifact/hive/build/jdbc/test/src>
[mkdir] Created dir: <https://builds.apache.org/job/Hive-0.9.1-SNAPSHOT-h0.21/188/artifact/hive/build/jdbc/test/classes>
[mkdir] Created dir: <https://builds.apache.org/job/Hive-0.9.1-SNAPSHOT-h0.21/188/artifact/hive/build/jdbc/test/resources>
[copy] Warning: <https://builds.apache.org/job/Hive-0.9.1-SNAPSHOT-h0.21/ws/hive/jdbc/src/test/resources> does not exist.
init:
[echo] Project: jdbc
create-dirs:
[echo] Project: hwi
[mkdir] Created dir: <https://builds.apache.org/job/Hive-0.9.1-SNAPSHOT-h0.21/188/artifact/hive/build/hwi>
[mkdir] Created dir: <https://builds.apache.org/job/Hive-0.9.1-SNAPSHOT-h0.21/188/artifact/hive/build/hwi/classes>
[mkdir] Created dir: <https://builds.apache.org/job/Hive-0.9.1-SNAPSHOT-h0.21/188/artifact/hive/build/hwi/test>
[mkdir] Created dir: <https://builds.apache.org/job/Hive-0.9.1-SNAPSHOT-h0.21/188/artifact/hive/build/hwi/test/src>
[mkdir] Created dir: <https://builds.apache.org/job/Hive-0.9.1-SNAPSHOT-h0.21/188/artifact/hive/build/hwi/test/classes>
[mkdir] Created dir: <https://builds.apache.org/job/Hive-0.9.1-SNAPSHOT-h0.21/188/artifact/hive/build/hwi/test/resources>
[copy] Warning: <https://builds.apache.org/job/Hive-0.9.1-SNAPSHOT-h0.21/ws/hive/hwi/src/test/resources> does not exist.
init:
[echo] Project: hwi
create-dirs:
[echo] Project: hbase-handler
[mkdir] Created dir: <https://builds.apache.org/job/Hive-0.9.1-SNAPSHOT-h0.21/188/artifact/hive/build/hbase-handler>
[mkdir] Created dir: <https://builds.apache.org/job/Hive-0.9.1-SNAPSHOT-h0.21/188/artifact/hive/build/hbase-handler/classes>
[mkdir] Created dir: <https://builds.apache.org/job/Hive-0.9.1-SNAPSHOT-h0.21/188/artifact/hive/build/hbase-handler/test>
[mkdir] Created dir: <https://builds.apache.org/job/Hive-0.9.1-SNAPSHOT-h0.21/188/artifact/hive/build/hbase-handler/test/src>
[mkdir] Created dir: <https://builds.apache.org/job/Hive-0.9.1-SNAPSHOT-h0.21/188/artifact/hive/build/hbase-handler/test/classes>
[mkdir] Created dir: <https://builds.apache.org/job/Hive-0.9.1-SNAPSHOT-h0.21/188/artifact/hive/build/hbase-handler/test/resources>
[copy] Warning: <https://builds.apache.org/job/Hive-0.9.1-SNAPSHOT-h0.21/ws/hive/hbase-handler/src/test/resources> does not exist.
init:
[echo] Project: hbase-handler
create-dirs:
[echo] Project: pdk
[mkdir] Created dir: <https://builds.apache.org/job/Hive-0.9.1-SNAPSHOT-h0.21/188/artifact/hive/build/pdk>
[mkdir] Created dir: <https://builds.apache.org/job/Hive-0.9.1-SNAPSHOT-h0.21/188/artifact/hive/build/pdk/classes>
[mkdir] Created dir: <https://builds.apache.org/job/Hive-0.9.1-SNAPSHOT-h0.21/188/artifact/hive/build/pdk/test>
[mkdir] Created dir: <https://builds.apache.org/job/Hive-0.9.1-SNAPSHOT-h0.21/188/artifact/hive/build/pdk/test/src>
[mkdir] Created dir: <https://builds.apache.org/job/Hive-0.9.1-SNAPSHOT-h0.21/188/artifact/hive/build/pdk/test/classes>
[mkdir] Created dir: <https://builds.apache.org/job/Hive-0.9.1-SNAPSHOT-h0.21/188/artifact/hive/build/pdk/test/resources>
[copy] Warning: <https://builds.apache.org/job/Hive-0.9.1-SNAPSHOT-h0.21/ws/hive/pdk/src/test/resources> does not exist.
init:
[echo] Project: pdk
create-dirs:
[echo] Project: builtins
[mkdir] Created dir: <https://builds.apache.org/job/Hive-0.9.1-SNAPSHOT-h0.21/188/artifact/hive/build/builtins>
[mkdir] Created dir: <https://builds.apache.org/job/Hive-0.9.1-SNAPSHOT-h0.21/188/artifact/hive/build/builtins/classes>
[mkdir] Created dir: <https://builds.apache.org/job/Hive-0.9.1-SNAPSHOT-h0.21/188/artifact/hive/build/builtins/test>
[mkdir] Created dir: <https://builds.apache.org/job/Hive-0.9.1-SNAPSHOT-h0.21/188/artifact/hive/build/builtins/test/src>
[mkdir] Created dir: <https://builds.apache.org/job/Hive-0.9.1-SNAPSHOT-h0.21/188/artifact/hive/build/builtins/test/classes>
[mkdir] Created dir: <https://builds.apache.org/job/Hive-0.9.1-SNAPSHOT-h0.21/188/artifact/hive/build/builtins/test/resources>
[copy] Warning: <https://builds.apache.org/job/Hive-0.9.1-SNAPSHOT-h0.21/ws/hive/builtins/src/test/resources> does not exist.
init:
[echo] Project: builtins
jar:
[echo] Project: hive
create-dirs:
[echo] Project: shims
[copy] Warning: <https://builds.apache.org/job/Hive-0.9.1-SNAPSHOT-h0.21/ws/hive/shims/src/test/resources> does not exist.
init:
[echo] Project: shims
ivy-init-settings:
[echo] Project: shims
ivy-resolve:
[echo] Project: shims
[ivy:resolve] :: loading settings :: file = <https://builds.apache.org/job/Hive-0.9.1-SNAPSHOT-h0.21/ws/hive/ivy/ivysettings.xml>
[ivy:resolve] downloading http://repo1.maven.org/maven2/org/apache/zookeeper/zookeeper/3.4.3/zookeeper-3.4.3.jar ...
[ivy:resolve] ................................................................................................................................... (749kB)
[ivy:resolve] .. (0kB)
[ivy:resolve] [SUCCESSFUL ] org.apache.zookeeper#zookeeper;3.4.3!zookeeper.jar (96ms)
[ivy:resolve] downloading http://repo1.maven.org/maven2/org/apache/thrift/libthrift/0.7.0/libthrift-0.7.0.jar ...
[ivy:resolve] ..................................................... (294kB)
[ivy:resolve] .. (0kB)
[ivy:resolve] [SUCCESSFUL ] org.apache.thrift#libthrift;0.7.0!libthrift.jar (228ms)
[ivy:resolve] downloading http://repo1.maven.org/maven2/commons-logging/commons-logging/1.0.4/commons-logging-1.0.4.jar ...
[ivy:resolve] ....... (37kB)
[ivy:resolve] .. (0kB)
[ivy:resolve] [SUCCESSFUL ] commons-logging#commons-logging;1.0.4!commons-logging.jar (22ms)
[ivy:resolve] downloading http://repo1.maven.org/maven2/commons-logging/commons-logging-api/1.0.4/commons-logging-api-1.0.4.jar ...
[ivy:resolve] .... (25kB)
[ivy:resolve] .. (0kB)
[ivy:resolve] [SUCCESSFUL ] commons-logging#commons-logging-api;1.0.4!commons-logging-api.jar (14ms)
[ivy:resolve] downloading http://repo1.maven.org/maven2/com/google/guava/guava/r09/guava-r09.jar ...
[ivy:resolve] ..................................................................................................................................................................................... (1117kB)
[ivy:resolve] .. (0kB)
[ivy:resolve] [SUCCESSFUL ] com.google.guava#guava;r09!guava.jar (123ms)
[ivy:resolve] downloading http://repo1.maven.org/maven2/org/codehaus/jackson/jackson-core-asl/1.8.8/jackson-core-asl-1.8.8.jar ...
[ivy:resolve] .............................. (222kB)
[ivy:resolve] .. (0kB)
[ivy:resolve] [SUCCESSFUL ] org.codehaus.jackson#jackson-core-asl;1.8.8!jackson-core-asl.jar (58ms)
[ivy:resolve] downloading http://repo1.maven.org/maven2/org/codehaus/jackson/jackson-mapper-asl/1.8.8/jackson-mapper-asl-1.8.8.jar ...
[ivy:resolve] ........................................................................................................ (652kB)
[ivy:resolve] .. (0kB)
[ivy:resolve] [SUCCESSFUL ] org.codehaus.jackson#jackson-mapper-asl;1.8.8!jackson-mapper-asl.jar (155ms)
[ivy:report] Processing <https://builds.apache.org/job/Hive-0.9.1-SNAPSHOT-h0.21/188/artifact/hive/build/ivy/resolution-cache/org.apache.hive-hive-shims-default.xml> to <https://builds.apache.org/job/Hive-0.9.1-SNAPSHOT-h0.21/188/artifact/hive/build/ivy/report/org.apache.hive-hive-shims-default.html>
ivy-retrieve:
[echo] Project: shims
compile:
[echo] Project: shims
[echo] Building shims 0.20
build_shims:
[echo] Project: shims
[echo] Compiling <https://builds.apache.org/job/Hive-0.9.1-SNAPSHOT-h0.21/ws/hive/shims/src/common/java;/home/jenkins/jenkins-slave/workspace/Hive-0.9.1-SNAPSHOT-h0.21/hive/shims/src/0.20/java> against hadoop 0.20.2 (<https://builds.apache.org/job/Hive-0.9.1-SNAPSHOT-h0.21/188/artifact/hive/build/hadoopcore/hadoop-0.20.2)>
ivy-init-settings:
[echo] Project: shims
ivy-resolve-hadoop-shim:
[echo] Project: shims
[ivy:resolve] :: loading settings :: file = <https://builds.apache.org/job/Hive-0.9.1-SNAPSHOT-h0.21/ws/hive/ivy/ivysettings.xml>
[ivy:resolve] downloading http://repo1.maven.org/maven2/org/apache/hadoop/hadoop-test/0.20.2/hadoop-test-0.20.2.jar ...
[ivy:resolve] ................................................................................................................................................................................................................................................................. (1527kB)
[ivy:resolve] .. (0kB)
[ivy:resolve] [SUCCESSFUL ] org.apache.hadoop#hadoop-test;0.20.2!hadoop-test.jar (287ms)
[ivy:resolve] downloading http://repo1.maven.org/maven2/org/mortbay/jetty/jsp-2.1/6.1.14/jsp-2.1-6.1.14.jar ...
[ivy:resolve] ............................................................................................................................................................... (1000kB)
[ivy:resolve] .. (0kB)
[ivy:resolve] [SUCCESSFUL ] org.mortbay.jetty#jsp-2.1;6.1.14!jsp-2.1.jar (309ms)
[ivy:resolve] downloading http://repo1.maven.org/maven2/ant/ant/1.6.5/ant-1.6.5.jar ...
[ivy:resolve] .............................................................................................................................................................. (1009kB)
[ivy:resolve] .. (0kB)
[ivy:resolve] [SUCCESSFUL ] ant#ant;1.6.5!ant.jar (86ms)
[ivy:resolve] downloading http://repo1.maven.org/maven2/org/apache/ftpserver/ftplet-api/1.0.0/ftplet-api-1.0.0.jar ...
[ivy:resolve] ... (22kB)
[ivy:resolve] .. (0kB)
[ivy:resolve] [SUCCESSFUL ] org.apache.ftpserver#ftplet-api;1.0.0!ftplet-api.jar(bundle) (52ms)
[ivy:resolve] downloading http://repo1.maven.org/maven2/org/apache/mina/mina-core/2.0.0-M5/mina-core-2.0.0-M5.jar ...
[ivy:resolve] ................................................................................................ (622kB)
[ivy:resolve] .. (0kB)
[ivy:resolve] [SUCCESSFUL ] org.apache.mina#mina-core;2.0.0-M5!mina-core.jar(bundle) (94ms)
[ivy:resolve] downloading http://repo1.maven.org/maven2/org/apache/ftpserver/ftpserver-core/1.0.0/ftpserver-core-1.0.0.jar ...
[ivy:resolve] ........................................ (264kB)
[ivy:resolve] .. (0kB)
[ivy:resolve] [SUCCESSFUL ] org.apache.ftpserver#ftpserver-core;1.0.0!ftpserver-core.jar(bundle) (52ms)
[ivy:resolve] downloading http://repo1.maven.org/maven2/org/apache/ftpserver/ftpserver-deprecated/1.0.0-M2/ftpserver-deprecated-1.0.0-M2.jar ...
[ivy:resolve] ..... (31kB)
[ivy:resolve] .. (0kB)
[ivy:resolve] [SUCCESSFUL ] org.apache.ftpserver#ftpserver-deprecated;1.0.0-M2!ftpserver-deprecated.jar (56ms)
[ivy:resolve] downloading http://repo1.maven.org/maven2/org/slf4j/slf4j-api/1.5.2/slf4j-api-1.5.2.jar ...
[ivy:resolve] .. (16kB)
[ivy:resolve] .. (0kB)
[ivy:resolve] [SUCCESSFUL ] org.slf4j#slf4j-api;1.5.2!slf4j-api.jar (127ms)
[ivy:resolve]
[ivy:resolve] :: problems summary ::
[ivy:resolve] :::: WARNINGS
[ivy:resolve] problem while downloading module descriptor: http://repo1.maven.org/maven2/commons-net/commons-net/1.4.1/commons-net-1.4.1.pom: /home/jenkins/.ivy2/cache/commons-net/commons-net/ivy-1.4.1.xml.original.part (No such file or directory) (11ms)
[ivy:resolve] module not found: commons-net#commons-net;1.4.1
[ivy:resolve] ==== local: tried
[ivy:resolve] /home/jenkins/.ivy2/local/commons-net/commons-net/1.4.1/ivys/ivy.xml
[ivy:resolve] -- artifact commons-net#commons-net;1.4.1!commons-net.jar:
[ivy:resolve] /home/jenkins/.ivy2/local/commons-net/commons-net/1.4.1/jars/commons-net.jar
[ivy:resolve] ==== apache-snapshot: tried
[ivy:resolve] https://repository.apache.org/content/repositories/snapshots/commons-net/commons-net/1.4.1/commons-net-1.4.1.pom
[ivy:resolve] -- artifact commons-net#commons-net;1.4.1!commons-net.jar:
[ivy:resolve] https://repository.apache.org/content/repositories/snapshots/commons-net/commons-net/1.4.1/commons-net-1.4.1.jar
[ivy:resolve] ==== maven2: tried
[ivy:resolve] http://repo1.maven.org/maven2/commons-net/commons-net/1.4.1/commons-net-1.4.1.pom
[ivy:resolve] ==== datanucleus-repo: tried
[ivy:resolve] -- artifact commons-net#commons-net;1.4.1!commons-net.jar:
[ivy:resolve] http://www.datanucleus.org/downloads/maven2/commons-net/commons-net/1.4.1/commons-net-1.4.1.jar
[ivy:resolve] ==== hadoop-source: tried
[ivy:resolve] -- artifact commons-net#commons-net;1.4.1!commons-net.jar:
[ivy:resolve] http://mirror.facebook.net/facebook/hive-deps/hadoop/core/commons-net-1.4.1/commons-net-1.4.1.jar
[ivy:resolve] ==== hadoop-source2: tried
[ivy:resolve] -- artifact commons-net#commons-net;1.4.1!commons-net.jar:
[ivy:resolve] http://archive.cloudera.com/hive-deps/hadoop/core/commons-net-1.4.1/commons-net-1.4.1.jar
[ivy:resolve] problem while downloading module descriptor: http://repo1.maven.org/maven2/org/mortbay/jetty/jetty-util/6.1.14/jetty-util-6.1.14.pom: /home/jenkins/.ivy2/cache/org.mortbay.jetty/jetty-util/ivy-6.1.14.xml.original.part (No such file or directory) (86ms)
[ivy:resolve] module not found: org.mortbay.jetty#jetty-util;6.1.14
[ivy:resolve] ==== local: tried
[ivy:resolve] /home/jenkins/.ivy2/local/org.mortbay.jetty/jetty-util/6.1.14/ivys/ivy.xml
[ivy:resolve] -- artifact org.mortbay.jetty#jetty-util;6.1.14!jetty-util.jar:
[ivy:resolve] /home/jenkins/.ivy2/local/org.mortbay.jetty/jetty-util/6.1.14/jars/jetty-util.jar
[ivy:resolve] ==== apache-snapshot: tried
[ivy:resolve] https://repository.apache.org/content/repositories/snapshots/org/mortbay/jetty/jetty-util/6.1.14/jetty-util-6.1.14.pom
[ivy:resolve] -- artifact org.mortbay.jetty#jetty-util;6.1.14!jetty-util.jar:
[ivy:resolve] https://repository.apache.org/content/repositories/snapshots/org/mortbay/jetty/jetty-util/6.1.14/jetty-util-6.1.14.jar
[ivy:resolve] ==== maven2: tried
[ivy:resolve] http://repo1.maven.org/maven2/org/mortbay/jetty/jetty-util/6.1.14/jetty-util-6.1.14.pom
[ivy:resolve] ==== datanucleus-repo: tried
[ivy:resolve] -- artifact org.mortbay.jetty#jetty-util;6.1.14!jetty-util.jar:
[ivy:resolve] http://www.datanucleus.org/downloads/maven2/org/mortbay/jetty/jetty-util/6.1.14/jetty-util-6.1.14.jar
[ivy:resolve] ==== hadoop-source: tried
[ivy:resolve] -- artifact org.mortbay.jetty#jetty-util;6.1.14!jetty-util.jar:
[ivy:resolve] http://mirror.facebook.net/facebook/hive-deps/hadoop/core/jetty-util-6.1.14/jetty-util-6.1.14.jar
[ivy:resolve] ==== hadoop-source2: tried
[ivy:resolve] -- artifact org.mortbay.jetty#jetty-util;6.1.14!jetty-util.jar:
[ivy:resolve] http://archive.cloudera.com/hive-deps/hadoop/core/jetty-util-6.1.14/jetty-util-6.1.14.jar
[ivy:resolve] problem while downloading module descriptor: http://repo1.maven.org/maven2/tomcat/jasper-runtime/5.5.12/jasper-runtime-5.5.12.pom: /home/jenkins/.ivy2/cache/tomcat/jasper-runtime/ivy-5.5.12.xml.original.part (No such file or directory) (42ms)
[ivy:resolve] module not found: tomcat#jasper-runtime;5.5.12
[ivy:resolve] ==== local: tried
[ivy:resolve] /home/jenkins/.ivy2/local/tomcat/jasper-runtime/5.5.12/ivys/ivy.xml
[ivy:resolve] -- artifact tomcat#jasper-runtime;5.5.12!jasper-runtime.jar:
[ivy:resolve] /home/jenkins/.ivy2/local/tomcat/jasper-runtime/5.5.12/jars/jasper-runtime.jar
[ivy:resolve] ==== apache-snapshot: tried
[ivy:resolve] https://repository.apache.org/content/repositories/snapshots/tomcat/jasper-runtime/5.5.12/jasper-runtime-5.5.12.pom
[ivy:resolve] -- artifact tomcat#jasper-runtime;5.5.12!jasper-runtime.jar:
[ivy:resolve] https://repository.apache.org/content/repositories/snapshots/tomcat/jasper-runtime/5.5.12/jasper-runtime-5.5.12.jar
[ivy:resolve] ==== maven2: tried
[ivy:resolve] http://repo1.maven.org/maven2/tomcat/jasper-runtime/5.5.12/jasper-runtime-5.5.12.pom
[ivy:resolve] ==== datanucleus-repo: tried
[ivy:resolve] -- artifact tomcat#jasper-runtime;5.5.12!jasper-runtime.jar:
[ivy:resolve] http://www.datanucleus.org/downloads/maven2/tomcat/jasper-runtime/5.5.12/jasper-runtime-5.5.12.jar
[ivy:resolve] ==== hadoop-source: tried
[ivy:resolve] -- artifact tomcat#jasper-runtime;5.5.12!jasper-runtime.jar:
[ivy:resolve] http://mirror.facebook.net/facebook/hive-deps/hadoop/core/jasper-runtime-5.5.12/jasper-runtime-5.5.12.jar
[ivy:resolve] ==== hadoop-source2: tried
[ivy:resolve] -- artifact tomcat#jasper-runtime;5.5.12!jasper-runtime.jar:
[ivy:resolve] http://archive.cloudera.com/hive-deps/hadoop/core/jasper-runtime-5.5.12/jasper-runtime-5.5.12.jar
[ivy:resolve] ::::::::::::::::::::::::::::::::::::::::::::::
[ivy:resolve] :: UNRESOLVED DEPENDENCIES ::
[ivy:resolve] ::::::::::::::::::::::::::::::::::::::::::::::
[ivy:resolve] :: commons-net#commons-net;1.4.1: not found
[ivy:resolve] :: org.mortbay.jetty#jetty-util;6.1.14: not found
[ivy:resolve] :: tomcat#jasper-runtime;5.5.12: not found
[ivy:resolve] ::::::::::::::::::::::::::::::::::::::::::::::
[ivy:resolve]
[ivy:resolve] :: USE VERBOSE OR DEBUG MESSAGE LEVEL FOR MORE DETAILS
BUILD FAILED
<https://builds.apache.org/job/Hive-0.9.1-SNAPSHOT-h0.21/ws/hive/build.xml>:302: The following error occurred while executing this line:
<https://builds.apache.org/job/Hive-0.9.1-SNAPSHOT-h0.21/ws/hive/build.xml>:152: The following error occurred while executing this line:
<https://builds.apache.org/job/Hive-0.9.1-SNAPSHOT-h0.21/ws/hive/shims/build.xml>:85: The following error occurred while executing this line:
<https://builds.apache.org/job/Hive-0.9.1-SNAPSHOT-h0.21/ws/hive/shims/build.xml>:88: The following error occurred while executing this line:
<https://builds.apache.org/job/Hive-0.9.1-SNAPSHOT-h0.21/ws/hive/shims/build.xml>:60: The following error occurred while executing this line:
<https://builds.apache.org/job/Hive-0.9.1-SNAPSHOT-h0.21/ws/hive/build-common.xml>:164: impossible to resolve dependencies:
resolve failed - see output for details
Total time: 38 seconds
Build step 'Invoke Ant' marked build as failure
Archiving artifacts
Recording test results
Jenkins build is back to normal : Hive-0.9.1-SNAPSHOT-h0.21 #193
Posted by Apache Jenkins Server <je...@builds.apache.org>.
See <https://builds.apache.org/job/Hive-0.9.1-SNAPSHOT-h0.21/193/>
Build failed in Jenkins: Hive-0.9.1-SNAPSHOT-h0.21 #192
Posted by Apache Jenkins Server <je...@builds.apache.org>.
See <https://builds.apache.org/job/Hive-0.9.1-SNAPSHOT-h0.21/192/>
------------------------------------------
[...truncated 36599 lines...]
[junit] POSTHOOK: query: select count(1) as cnt from testhivedrivertable
[junit] POSTHOOK: type: DROPTABLE
[junit] POSTHOOK: Input: default@testhivedrivertable
[junit] POSTHOOK: Output: file:/tmp/jenkins/hive_2012-11-08_12-44-38_642_8305349522597005900/-mr-10000
[junit] OK
[junit] PREHOOK: query: drop table testhivedrivertable
[junit] PREHOOK: type: DROPTABLE
[junit] PREHOOK: Input: default@testhivedrivertable
[junit] PREHOOK: Output: default@testhivedrivertable
[junit] POSTHOOK: query: drop table testhivedrivertable
[junit] POSTHOOK: type: DROPTABLE
[junit] POSTHOOK: Input: default@testhivedrivertable
[junit] POSTHOOK: Output: default@testhivedrivertable
[junit] OK
[junit] Hive history file=/x1/jenkins/jenkins-slave/workspace/Hive-0.9.1-SNAPSHOT-h0.21/hive/build/service/tmp/hive_job_log_jenkins_201211081244_424433184.txt
[junit] PREHOOK: query: drop table testhivedrivertable
[junit] PREHOOK: type: DROPTABLE
[junit] POSTHOOK: query: drop table testhivedrivertable
[junit] POSTHOOK: type: DROPTABLE
[junit] OK
[junit] PREHOOK: query: create table testhivedrivertable (num int)
[junit] PREHOOK: type: DROPTABLE
[junit] POSTHOOK: query: create table testhivedrivertable (num int)
[junit] POSTHOOK: type: DROPTABLE
[junit] POSTHOOK: Output: default@testhivedrivertable
[junit] OK
[junit] Copying file: file:/x1/jenkins/jenkins-slave/workspace/Hive-0.9.1-SNAPSHOT-h0.21/hive/data/files/kv1.txt
[junit] PREHOOK: query: load data local inpath '/x1/jenkins/jenkins-slave/workspace/Hive-0.9.1-SNAPSHOT-h0.21/hive/data/files/kv1.txt' into table testhivedrivertable
[junit] PREHOOK: type: DROPTABLE
[junit] PREHOOK: Output: default@testhivedrivertable
[junit] Copying data from file:/x1/jenkins/jenkins-slave/workspace/Hive-0.9.1-SNAPSHOT-h0.21/hive/data/files/kv1.txt
[junit] Loading data to table default.testhivedrivertable
[junit] POSTHOOK: query: load data local inpath '/x1/jenkins/jenkins-slave/workspace/Hive-0.9.1-SNAPSHOT-h0.21/hive/data/files/kv1.txt' into table testhivedrivertable
[junit] POSTHOOK: type: DROPTABLE
[junit] POSTHOOK: Output: default@testhivedrivertable
[junit] OK
[junit] PREHOOK: query: select * from testhivedrivertable limit 10
[junit] PREHOOK: type: DROPTABLE
[junit] PREHOOK: Input: default@testhivedrivertable
[junit] PREHOOK: Output: file:/tmp/jenkins/hive_2012-11-08_12-44-42_821_4069840362958937577/-mr-10000
[junit] POSTHOOK: query: select * from testhivedrivertable limit 10
[junit] POSTHOOK: type: DROPTABLE
[junit] POSTHOOK: Input: default@testhivedrivertable
[junit] POSTHOOK: Output: file:/tmp/jenkins/hive_2012-11-08_12-44-42_821_4069840362958937577/-mr-10000
[junit] OK
[junit] PREHOOK: query: drop table testhivedrivertable
[junit] PREHOOK: type: DROPTABLE
[junit] PREHOOK: Input: default@testhivedrivertable
[junit] PREHOOK: Output: default@testhivedrivertable
[junit] POSTHOOK: query: drop table testhivedrivertable
[junit] POSTHOOK: type: DROPTABLE
[junit] POSTHOOK: Input: default@testhivedrivertable
[junit] POSTHOOK: Output: default@testhivedrivertable
[junit] OK
[junit] Hive history file=/x1/jenkins/jenkins-slave/workspace/Hive-0.9.1-SNAPSHOT-h0.21/hive/build/service/tmp/hive_job_log_jenkins_201211081244_331882337.txt
[junit] PREHOOK: query: drop table testhivedrivertable
[junit] PREHOOK: type: DROPTABLE
[junit] POSTHOOK: query: drop table testhivedrivertable
[junit] POSTHOOK: type: DROPTABLE
[junit] OK
[junit] PREHOOK: query: create table testhivedrivertable (num int)
[junit] PREHOOK: type: DROPTABLE
[junit] POSTHOOK: query: create table testhivedrivertable (num int)
[junit] POSTHOOK: type: DROPTABLE
[junit] POSTHOOK: Output: default@testhivedrivertable
[junit] OK
[junit] PREHOOK: query: drop table testhivedrivertable
[junit] PREHOOK: type: DROPTABLE
[junit] PREHOOK: Input: default@testhivedrivertable
[junit] PREHOOK: Output: default@testhivedrivertable
[junit] POSTHOOK: query: drop table testhivedrivertable
[junit] POSTHOOK: type: DROPTABLE
[junit] POSTHOOK: Input: default@testhivedrivertable
[junit] POSTHOOK: Output: default@testhivedrivertable
[junit] OK
[junit] Hive history file=/x1/jenkins/jenkins-slave/workspace/Hive-0.9.1-SNAPSHOT-h0.21/hive/build/service/tmp/hive_job_log_jenkins_201211081244_500238304.txt
[junit] Hive history file=/x1/jenkins/jenkins-slave/workspace/Hive-0.9.1-SNAPSHOT-h0.21/hive/build/service/tmp/hive_job_log_jenkins_201211081244_704810651.txt
[junit] PREHOOK: query: drop table testhivedrivertable
[junit] PREHOOK: type: DROPTABLE
[junit] POSTHOOK: query: drop table testhivedrivertable
[junit] POSTHOOK: type: DROPTABLE
[junit] OK
[junit] Copying file: file:/x1/jenkins/jenkins-slave/workspace/Hive-0.9.1-SNAPSHOT-h0.21/hive/data/files/kv1.txt
[junit] PREHOOK: query: create table testhivedrivertable (key int, value string)
[junit] PREHOOK: type: DROPTABLE
[junit] POSTHOOK: query: create table testhivedrivertable (key int, value string)
[junit] POSTHOOK: type: DROPTABLE
[junit] POSTHOOK: Output: default@testhivedrivertable
[junit] OK
[junit] PREHOOK: query: load data local inpath '/x1/jenkins/jenkins-slave/workspace/Hive-0.9.1-SNAPSHOT-h0.21/hive/data/files/kv1.txt' into table testhivedrivertable
[junit] PREHOOK: type: DROPTABLE
[junit] PREHOOK: Output: default@testhivedrivertable
[junit] Copying data from file:/x1/jenkins/jenkins-slave/workspace/Hive-0.9.1-SNAPSHOT-h0.21/hive/data/files/kv1.txt
[junit] Loading data to table default.testhivedrivertable
[junit] POSTHOOK: query: load data local inpath '/x1/jenkins/jenkins-slave/workspace/Hive-0.9.1-SNAPSHOT-h0.21/hive/data/files/kv1.txt' into table testhivedrivertable
[junit] POSTHOOK: type: DROPTABLE
[junit] POSTHOOK: Output: default@testhivedrivertable
[junit] OK
[junit] PREHOOK: query: select key, value from testhivedrivertable
[junit] PREHOOK: type: DROPTABLE
[junit] PREHOOK: Input: default@testhivedrivertable
[junit] PREHOOK: Output: file:/tmp/jenkins/hive_2012-11-08_12-44-43_501_7514662337583911751/-mr-10000
[junit] Total MapReduce jobs = 1
[junit] Launching Job 1 out of 1
[junit] Number of reduce tasks is set to 0 since there's no reduce operator
[junit] Job running in-process (local Hadoop)
[junit] Hadoop job information for null: number of mappers: 0; number of reducers: 0
[junit] 2012-11-08 12:44:46,174 null map = 100%, reduce = 0%
[junit] Ended Job = job_local_0001
[junit] Execution completed successfully
[junit] Mapred Local Task Succeeded . Convert the Join into MapJoin
[junit] POSTHOOK: query: select key, value from testhivedrivertable
[junit] POSTHOOK: type: DROPTABLE
[junit] POSTHOOK: Input: default@testhivedrivertable
[junit] POSTHOOK: Output: file:/tmp/jenkins/hive_2012-11-08_12-44-43_501_7514662337583911751/-mr-10000
[junit] OK
[junit] PREHOOK: query: select key, value from testhivedrivertable
[junit] PREHOOK: type: DROPTABLE
[junit] PREHOOK: Input: default@testhivedrivertable
[junit] PREHOOK: Output: file:/tmp/jenkins/hive_2012-11-08_12-44-46_332_1277933231767060309/-mr-10000
[junit] Total MapReduce jobs = 1
[junit] Launching Job 1 out of 1
[junit] Number of reduce tasks is set to 0 since there's no reduce operator
[junit] Job running in-process (local Hadoop)
[junit] Hadoop job information for null: number of mappers: 0; number of reducers: 0
[junit] 2012-11-08 12:44:48,899 null map = 100%, reduce = 0%
[junit] Ended Job = job_local_0001
[junit] Execution completed successfully
[junit] Mapred Local Task Succeeded . Convert the Join into MapJoin
[junit] POSTHOOK: query: select key, value from testhivedrivertable
[junit] POSTHOOK: type: DROPTABLE
[junit] POSTHOOK: Input: default@testhivedrivertable
[junit] POSTHOOK: Output: file:/tmp/jenkins/hive_2012-11-08_12-44-46_332_1277933231767060309/-mr-10000
[junit] OK
[junit] PREHOOK: query: select key, value from testhivedrivertable
[junit] PREHOOK: type: DROPTABLE
[junit] PREHOOK: Input: default@testhivedrivertable
[junit] PREHOOK: Output: file:/tmp/jenkins/hive_2012-11-08_12-44-49_065_6563892853816822199/-mr-10000
[junit] Total MapReduce jobs = 1
[junit] Launching Job 1 out of 1
[junit] Number of reduce tasks is set to 0 since there's no reduce operator
[junit] Job running in-process (local Hadoop)
[junit] Hadoop job information for null: number of mappers: 0; number of reducers: 0
[junit] 2012-11-08 12:44:51,704 null map = 100%, reduce = 0%
[junit] Ended Job = job_local_0001
[junit] Execution completed successfully
[junit] Mapred Local Task Succeeded . Convert the Join into MapJoin
[junit] POSTHOOK: query: select key, value from testhivedrivertable
[junit] POSTHOOK: type: DROPTABLE
[junit] POSTHOOK: Input: default@testhivedrivertable
[junit] POSTHOOK: Output: file:/tmp/jenkins/hive_2012-11-08_12-44-49_065_6563892853816822199/-mr-10000
[junit] OK
[junit] Hive history file=/x1/jenkins/jenkins-slave/workspace/Hive-0.9.1-SNAPSHOT-h0.21/hive/build/service/tmp/hive_job_log_jenkins_201211081244_440310623.txt
[junit] PREHOOK: query: drop table testhivedrivertable
[junit] PREHOOK: type: DROPTABLE
[junit] PREHOOK: Input: default@testhivedrivertable
[junit] PREHOOK: Output: default@testhivedrivertable
[junit] POSTHOOK: query: drop table testhivedrivertable
[junit] POSTHOOK: type: DROPTABLE
[junit] POSTHOOK: Input: default@testhivedrivertable
[junit] POSTHOOK: Output: default@testhivedrivertable
[junit] OK
[junit] PREHOOK: query: create table testhivedrivertable (key int, value string)
[junit] PREHOOK: type: DROPTABLE
[junit] POSTHOOK: query: create table testhivedrivertable (key int, value string)
[junit] POSTHOOK: type: DROPTABLE
[junit] POSTHOOK: Output: default@testhivedrivertable
[junit] OK
[junit] Copying file: file:/x1/jenkins/jenkins-slave/workspace/Hive-0.9.1-SNAPSHOT-h0.21/hive/data/files/kv1.txt
[junit] PREHOOK: query: load data local inpath '/x1/jenkins/jenkins-slave/workspace/Hive-0.9.1-SNAPSHOT-h0.21/hive/data/files/kv1.txt' into table testhivedrivertable
[junit] PREHOOK: type: DROPTABLE
[junit] PREHOOK: Output: default@testhivedrivertable
[junit] Copying data from file:/x1/jenkins/jenkins-slave/workspace/Hive-0.9.1-SNAPSHOT-h0.21/hive/data/files/kv1.txt
[junit] Loading data to table default.testhivedrivertable
[junit] POSTHOOK: query: load data local inpath '/x1/jenkins/jenkins-slave/workspace/Hive-0.9.1-SNAPSHOT-h0.21/hive/data/files/kv1.txt' into table testhivedrivertable
[junit] POSTHOOK: type: DROPTABLE
[junit] POSTHOOK: Output: default@testhivedrivertable
[junit] OK
[junit] PREHOOK: query: select key, value from testhivedrivertable where key > 10
[junit] PREHOOK: type: DROPTABLE
[junit] PREHOOK: Input: default@testhivedrivertable
[junit] PREHOOK: Output: file:/tmp/jenkins/hive_2012-11-08_12-44-52_170_3459621527521845272/-mr-10000
[junit] Total MapReduce jobs = 1
[junit] Launching Job 1 out of 1
[junit] Number of reduce tasks is set to 0 since there's no reduce operator
[junit] Job running in-process (local Hadoop)
[junit] Hadoop job information for null: number of mappers: 0; number of reducers: 0
[junit] 2012-11-08 12:44:54,802 null map = 100%, reduce = 0%
[junit] Ended Job = job_local_0001
[junit] Execution completed successfully
[junit] Mapred Local Task Succeeded . Convert the Join into MapJoin
[junit] POSTHOOK: query: select key, value from testhivedrivertable where key > 10
[junit] POSTHOOK: type: DROPTABLE
[junit] POSTHOOK: Input: default@testhivedrivertable
[junit] POSTHOOK: Output: file:/tmp/jenkins/hive_2012-11-08_12-44-52_170_3459621527521845272/-mr-10000
[junit] OK
[junit] SLF4J: Class path contains multiple SLF4J bindings.
[junit] SLF4J: Found binding in [jar:file:/x1/jenkins/jenkins-slave/workspace/Hive-0.9.1-SNAPSHOT-h0.21/hive/build/ivy/lib/test/slf4j-log4j12-1.6.1.jar!/org/slf4j/impl/StaticLoggerBinder.class]
[junit] SLF4J: Found binding in [jar:file:/x1/jenkins/jenkins-slave/workspace/Hive-0.9.1-SNAPSHOT-h0.21/hive/build/ivy/lib/default/slf4j-log4j12-1.6.1.jar!/org/slf4j/impl/StaticLoggerBinder.class]
[junit] SLF4J: See http://www.slf4j.org/codes.html#multiple_bindings for an explanation.
[junit] PREHOOK: query: select count(1) as c from testhivedrivertable
[junit] PREHOOK: type: DROPTABLE
[junit] PREHOOK: Input: default@testhivedrivertable
[junit] PREHOOK: Output: file:/tmp/jenkins/hive_2012-11-08_12-44-55_013_6124292013931653600/-mr-10000
[junit] Total MapReduce jobs = 1
[junit] Launching Job 1 out of 1
[junit] Number of reduce tasks determined at compile time: 1
[junit] In order to change the average load for a reducer (in bytes):
[junit] set hive.exec.reducers.bytes.per.reducer=<number>
[junit] In order to limit the maximum number of reducers:
[junit] set hive.exec.reducers.max=<number>
[junit] In order to set a constant number of reducers:
[junit] set mapred.reduce.tasks=<number>
[junit] Job running in-process (local Hadoop)
[junit] Hadoop job information for null: number of mappers: 0; number of reducers: 0
[junit] 2012-11-08 12:44:57,684 null map = 100%, reduce = 100%
[junit] Ended Job = job_local_0001
[junit] Execution completed successfully
[junit] Mapred Local Task Succeeded . Convert the Join into MapJoin
[junit] POSTHOOK: query: select count(1) as c from testhivedrivertable
[junit] POSTHOOK: type: DROPTABLE
[junit] POSTHOOK: Input: default@testhivedrivertable
[junit] POSTHOOK: Output: file:/tmp/jenkins/hive_2012-11-08_12-44-55_013_6124292013931653600/-mr-10000
[junit] OK
[junit] Hive history file=/x1/jenkins/jenkins-slave/workspace/Hive-0.9.1-SNAPSHOT-h0.21/hive/build/service/tmp/hive_job_log_jenkins_201211081244_401661454.txt
[junit] /x1/jenkins/jenkins-slave/workspace/Hive-0.9.1-SNAPSHOT-h0.21/hive/service/../data/files/invalidpath/sample.jar does not exist
[junit] Hive history file=/x1/jenkins/jenkins-slave/workspace/Hive-0.9.1-SNAPSHOT-h0.21/hive/build/service/tmp/hive_job_log_jenkins_201211081244_1079080753.txt
[junit] /x1/jenkins/jenkins-slave/workspace/Hive-0.9.1-SNAPSHOT-h0.21/hive/service/../data/files/invalidpath/sample.txt does not exist
[junit] Hive history file=/x1/jenkins/jenkins-slave/workspace/Hive-0.9.1-SNAPSHOT-h0.21/hive/build/service/tmp/hive_job_log_jenkins_201211081244_1595893568.txt
[junit] Tests run: 11, Failures: 0, Errors: 0, Time elapsed: 23.95 sec
[junit] /x1/jenkins/jenkins-slave/workspace/Hive-0.9.1-SNAPSHOT-h0.21/hive/service/../data/files/invalidpath/sample.zip does not exist
[junit] Hive history file=/x1/jenkins/jenkins-slave/workspace/Hive-0.9.1-SNAPSHOT-h0.21/hive/build/service/tmp/hive_job_log_jenkins_201211081244_417163482.txt
[junit] Hive history file=/x1/jenkins/jenkins-slave/workspace/Hive-0.9.1-SNAPSHOT-h0.21/hive/build/service/tmp/hive_job_log_jenkins_201211081244_2064295655.txt
[junit] Running org.apache.hadoop.hive.service.TestHiveServerSessions
[junit] SLF4J: Class path contains multiple SLF4J bindings.
[junit] SLF4J: Found binding in [jar:file:/x1/jenkins/jenkins-slave/workspace/Hive-0.9.1-SNAPSHOT-h0.21/hive/build/ivy/lib/test/slf4j-log4j12-1.6.1.jar!/org/slf4j/impl/StaticLoggerBinder.class]
[junit] SLF4J: Found binding in [jar:file:/x1/jenkins/jenkins-slave/workspace/Hive-0.9.1-SNAPSHOT-h0.21/hive/build/ivy/lib/default/slf4j-log4j12-1.6.1.jar!/org/slf4j/impl/StaticLoggerBinder.class]
[junit] SLF4J: See http://www.slf4j.org/codes.html#multiple_bindings for an explanation.
[junit] Hive history file=/x1/jenkins/jenkins-slave/workspace/Hive-0.9.1-SNAPSHOT-h0.21/hive/build/service/tmp/hive_job_log_jenkins_201211081245_480355416.txt
[junit] Hive history file=/x1/jenkins/jenkins-slave/workspace/Hive-0.9.1-SNAPSHOT-h0.21/hive/build/service/tmp/hive_job_log_jenkins_201211081245_1586493180.txt
[junit] Tests run: 1, Failures: 0, Errors: 0, Time elapsed: 3.851 sec
BUILD FAILED
/x1/jenkins/jenkins-slave/workspace/Hive-0.9.1-SNAPSHOT-h0.21/hive/build.xml:316: Keepgoing execution: 1 of 12 iterations failed.
Total time: 273 minutes 13 seconds
Build step 'Invoke Ant' marked build as failure
Archiving artifacts
Recording test results
Build failed in Jenkins: Hive-0.9.1-SNAPSHOT-h0.21 #191
Posted by Apache Jenkins Server <je...@builds.apache.org>.
See <https://builds.apache.org/job/Hive-0.9.1-SNAPSHOT-h0.21/191/>
------------------------------------------
[...truncated 36589 lines...]
[junit] POSTHOOK: query: select count(1) as cnt from testhivedrivertable
[junit] POSTHOOK: type: DROPTABLE
[junit] POSTHOOK: Input: default@testhivedrivertable
[junit] POSTHOOK: Output: file:/tmp/jenkins/hive_2012-11-07_14-00-05_524_6578135953392494415/-mr-10000
[junit] OK
[junit] PREHOOK: query: drop table testhivedrivertable
[junit] PREHOOK: type: DROPTABLE
[junit] PREHOOK: Input: default@testhivedrivertable
[junit] PREHOOK: Output: default@testhivedrivertable
[junit] POSTHOOK: query: drop table testhivedrivertable
[junit] POSTHOOK: type: DROPTABLE
[junit] POSTHOOK: Input: default@testhivedrivertable
[junit] POSTHOOK: Output: default@testhivedrivertable
[junit] OK
[junit] Hive history file=<https://builds.apache.org/job/Hive-0.9.1-SNAPSHOT-h0.21/191/artifact/hive/build/service/tmp/hive_job_log_jenkins_201211071400_118927353.txt>
[junit] PREHOOK: query: drop table testhivedrivertable
[junit] PREHOOK: type: DROPTABLE
[junit] Copying file: <https://builds.apache.org/job/Hive-0.9.1-SNAPSHOT-h0.21/ws/hive/data/files/kv1.txt>
[junit] POSTHOOK: query: drop table testhivedrivertable
[junit] POSTHOOK: type: DROPTABLE
[junit] OK
[junit] PREHOOK: query: create table testhivedrivertable (num int)
[junit] PREHOOK: type: DROPTABLE
[junit] POSTHOOK: query: create table testhivedrivertable (num int)
[junit] POSTHOOK: type: DROPTABLE
[junit] POSTHOOK: Output: default@testhivedrivertable
[junit] OK
[junit] PREHOOK: query: load data local inpath '<https://builds.apache.org/job/Hive-0.9.1-SNAPSHOT-h0.21/ws/hive/data/files/kv1.txt'> into table testhivedrivertable
[junit] PREHOOK: type: DROPTABLE
[junit] PREHOOK: Output: default@testhivedrivertable
[junit] Copying data from <https://builds.apache.org/job/Hive-0.9.1-SNAPSHOT-h0.21/ws/hive/data/files/kv1.txt>
[junit] Loading data to table default.testhivedrivertable
[junit] POSTHOOK: query: load data local inpath '<https://builds.apache.org/job/Hive-0.9.1-SNAPSHOT-h0.21/ws/hive/data/files/kv1.txt'> into table testhivedrivertable
[junit] POSTHOOK: type: DROPTABLE
[junit] POSTHOOK: Output: default@testhivedrivertable
[junit] OK
[junit] PREHOOK: query: select * from testhivedrivertable limit 10
[junit] PREHOOK: type: DROPTABLE
[junit] PREHOOK: Input: default@testhivedrivertable
[junit] PREHOOK: Output: file:/tmp/jenkins/hive_2012-11-07_14-00-09_805_8245017800794643265/-mr-10000
[junit] POSTHOOK: query: select * from testhivedrivertable limit 10
[junit] POSTHOOK: type: DROPTABLE
[junit] POSTHOOK: Input: default@testhivedrivertable
[junit] POSTHOOK: Output: file:/tmp/jenkins/hive_2012-11-07_14-00-09_805_8245017800794643265/-mr-10000
[junit] OK
[junit] PREHOOK: query: drop table testhivedrivertable
[junit] PREHOOK: type: DROPTABLE
[junit] PREHOOK: Input: default@testhivedrivertable
[junit] PREHOOK: Output: default@testhivedrivertable
[junit] POSTHOOK: query: drop table testhivedrivertable
[junit] POSTHOOK: type: DROPTABLE
[junit] POSTHOOK: Input: default@testhivedrivertable
[junit] POSTHOOK: Output: default@testhivedrivertable
[junit] OK
[junit] Hive history file=<https://builds.apache.org/job/Hive-0.9.1-SNAPSHOT-h0.21/191/artifact/hive/build/service/tmp/hive_job_log_jenkins_201211071400_783356209.txt>
[junit] PREHOOK: query: drop table testhivedrivertable
[junit] PREHOOK: type: DROPTABLE
[junit] POSTHOOK: query: drop table testhivedrivertable
[junit] POSTHOOK: type: DROPTABLE
[junit] OK
[junit] PREHOOK: query: create table testhivedrivertable (num int)
[junit] PREHOOK: type: DROPTABLE
[junit] POSTHOOK: query: create table testhivedrivertable (num int)
[junit] POSTHOOK: type: DROPTABLE
[junit] POSTHOOK: Output: default@testhivedrivertable
[junit] OK
[junit] PREHOOK: query: drop table testhivedrivertable
[junit] PREHOOK: type: DROPTABLE
[junit] PREHOOK: Input: default@testhivedrivertable
[junit] PREHOOK: Output: default@testhivedrivertable
[junit] POSTHOOK: query: drop table testhivedrivertable
[junit] POSTHOOK: type: DROPTABLE
[junit] POSTHOOK: Input: default@testhivedrivertable
[junit] POSTHOOK: Output: default@testhivedrivertable
[junit] OK
[junit] Hive history file=<https://builds.apache.org/job/Hive-0.9.1-SNAPSHOT-h0.21/191/artifact/hive/build/service/tmp/hive_job_log_jenkins_201211071400_1424245266.txt>
[junit] Hive history file=<https://builds.apache.org/job/Hive-0.9.1-SNAPSHOT-h0.21/191/artifact/hive/build/service/tmp/hive_job_log_jenkins_201211071400_489474540.txt>
[junit] PREHOOK: query: drop table testhivedrivertable
[junit] PREHOOK: type: DROPTABLE
[junit] POSTHOOK: query: drop table testhivedrivertable
[junit] POSTHOOK: type: DROPTABLE
[junit] OK
[junit] PREHOOK: query: create table testhivedrivertable (key int, value string)
[junit] PREHOOK: type: DROPTABLE
[junit] Copying file: <https://builds.apache.org/job/Hive-0.9.1-SNAPSHOT-h0.21/ws/hive/data/files/kv1.txt>
[junit] POSTHOOK: query: create table testhivedrivertable (key int, value string)
[junit] POSTHOOK: type: DROPTABLE
[junit] POSTHOOK: Output: default@testhivedrivertable
[junit] OK
[junit] PREHOOK: query: load data local inpath '<https://builds.apache.org/job/Hive-0.9.1-SNAPSHOT-h0.21/ws/hive/data/files/kv1.txt'> into table testhivedrivertable
[junit] PREHOOK: type: DROPTABLE
[junit] PREHOOK: Output: default@testhivedrivertable
[junit] Copying data from <https://builds.apache.org/job/Hive-0.9.1-SNAPSHOT-h0.21/ws/hive/data/files/kv1.txt>
[junit] Loading data to table default.testhivedrivertable
[junit] POSTHOOK: query: load data local inpath '<https://builds.apache.org/job/Hive-0.9.1-SNAPSHOT-h0.21/ws/hive/data/files/kv1.txt'> into table testhivedrivertable
[junit] POSTHOOK: type: DROPTABLE
[junit] POSTHOOK: Output: default@testhivedrivertable
[junit] OK
[junit] PREHOOK: query: select key, value from testhivedrivertable
[junit] PREHOOK: type: DROPTABLE
[junit] PREHOOK: Input: default@testhivedrivertable
[junit] PREHOOK: Output: file:/tmp/jenkins/hive_2012-11-07_14-00-10_562_3511269163238996700/-mr-10000
[junit] Total MapReduce jobs = 1
[junit] Launching Job 1 out of 1
[junit] Number of reduce tasks is set to 0 since there's no reduce operator
[junit] Job running in-process (local Hadoop)
[junit] Hadoop job information for null: number of mappers: 0; number of reducers: 0
[junit] 2012-11-07 14:00:13,248 null map = 100%, reduce = 0%
[junit] Ended Job = job_local_0001
[junit] Execution completed successfully
[junit] Mapred Local Task Succeeded . Convert the Join into MapJoin
[junit] POSTHOOK: query: select key, value from testhivedrivertable
[junit] POSTHOOK: type: DROPTABLE
[junit] POSTHOOK: Input: default@testhivedrivertable
[junit] POSTHOOK: Output: file:/tmp/jenkins/hive_2012-11-07_14-00-10_562_3511269163238996700/-mr-10000
[junit] OK
[junit] PREHOOK: query: select key, value from testhivedrivertable
[junit] PREHOOK: type: DROPTABLE
[junit] PREHOOK: Input: default@testhivedrivertable
[junit] PREHOOK: Output: file:/tmp/jenkins/hive_2012-11-07_14-00-13_385_4729247990619152942/-mr-10000
[junit] Total MapReduce jobs = 1
[junit] Launching Job 1 out of 1
[junit] Number of reduce tasks is set to 0 since there's no reduce operator
[junit] Job running in-process (local Hadoop)
[junit] Hadoop job information for null: number of mappers: 0; number of reducers: 0
[junit] 2012-11-07 14:00:16,011 null map = 100%, reduce = 0%
[junit] Ended Job = job_local_0001
[junit] Execution completed successfully
[junit] Mapred Local Task Succeeded . Convert the Join into MapJoin
[junit] POSTHOOK: query: select key, value from testhivedrivertable
[junit] POSTHOOK: type: DROPTABLE
[junit] POSTHOOK: Input: default@testhivedrivertable
[junit] POSTHOOK: Output: file:/tmp/jenkins/hive_2012-11-07_14-00-13_385_4729247990619152942/-mr-10000
[junit] OK
[junit] PREHOOK: query: select key, value from testhivedrivertable
[junit] PREHOOK: type: DROPTABLE
[junit] PREHOOK: Input: default@testhivedrivertable
[junit] PREHOOK: Output: file:/tmp/jenkins/hive_2012-11-07_14-00-16_378_6444645610301914252/-mr-10000
[junit] Total MapReduce jobs = 1
[junit] Launching Job 1 out of 1
[junit] Number of reduce tasks is set to 0 since there's no reduce operator
[junit] Job running in-process (local Hadoop)
[junit] Hadoop job information for null: number of mappers: 0; number of reducers: 0
[junit] 2012-11-07 14:00:18,986 null map = 100%, reduce = 0%
[junit] Ended Job = job_local_0001
[junit] Execution completed successfully
[junit] Mapred Local Task Succeeded . Convert the Join into MapJoin
[junit] POSTHOOK: query: select key, value from testhivedrivertable
[junit] POSTHOOK: type: DROPTABLE
[junit] POSTHOOK: Input: default@testhivedrivertable
[junit] POSTHOOK: Output: file:/tmp/jenkins/hive_2012-11-07_14-00-16_378_6444645610301914252/-mr-10000
[junit] OK
[junit] Hive history file=<https://builds.apache.org/job/Hive-0.9.1-SNAPSHOT-h0.21/191/artifact/hive/build/service/tmp/hive_job_log_jenkins_201211071400_1945139856.txt>
[junit] PREHOOK: query: drop table testhivedrivertable
[junit] PREHOOK: type: DROPTABLE
[junit] PREHOOK: Input: default@testhivedrivertable
[junit] PREHOOK: Output: default@testhivedrivertable
[junit] POSTHOOK: query: drop table testhivedrivertable
[junit] POSTHOOK: type: DROPTABLE
[junit] POSTHOOK: Input: default@testhivedrivertable
[junit] POSTHOOK: Output: default@testhivedrivertable
[junit] OK
[junit] PREHOOK: query: create table testhivedrivertable (key int, value string)
[junit] PREHOOK: type: DROPTABLE
[junit] Copying file: <https://builds.apache.org/job/Hive-0.9.1-SNAPSHOT-h0.21/ws/hive/data/files/kv1.txt>
[junit] POSTHOOK: query: create table testhivedrivertable (key int, value string)
[junit] POSTHOOK: type: DROPTABLE
[junit] POSTHOOK: Output: default@testhivedrivertable
[junit] OK
[junit] PREHOOK: query: load data local inpath '<https://builds.apache.org/job/Hive-0.9.1-SNAPSHOT-h0.21/ws/hive/data/files/kv1.txt'> into table testhivedrivertable
[junit] PREHOOK: type: DROPTABLE
[junit] PREHOOK: Output: default@testhivedrivertable
[junit] Copying data from <https://builds.apache.org/job/Hive-0.9.1-SNAPSHOT-h0.21/ws/hive/data/files/kv1.txt>
[junit] Loading data to table default.testhivedrivertable
[junit] POSTHOOK: query: load data local inpath '<https://builds.apache.org/job/Hive-0.9.1-SNAPSHOT-h0.21/ws/hive/data/files/kv1.txt'> into table testhivedrivertable
[junit] POSTHOOK: type: DROPTABLE
[junit] POSTHOOK: Output: default@testhivedrivertable
[junit] OK
[junit] PREHOOK: query: select key, value from testhivedrivertable where key > 10
[junit] PREHOOK: type: DROPTABLE
[junit] PREHOOK: Input: default@testhivedrivertable
[junit] PREHOOK: Output: file:/tmp/jenkins/hive_2012-11-07_14-00-19_454_6909480964653437044/-mr-10000
[junit] Total MapReduce jobs = 1
[junit] Launching Job 1 out of 1
[junit] Number of reduce tasks is set to 0 since there's no reduce operator
[junit] Job running in-process (local Hadoop)
[junit] Hadoop job information for null: number of mappers: 0; number of reducers: 0
[junit] 2012-11-07 14:00:22,156 null map = 100%, reduce = 0%
[junit] Ended Job = job_local_0001
[junit] Execution completed successfully
[junit] Mapred Local Task Succeeded . Convert the Join into MapJoin
[junit] POSTHOOK: query: select key, value from testhivedrivertable where key > 10
[junit] POSTHOOK: type: DROPTABLE
[junit] POSTHOOK: Input: default@testhivedrivertable
[junit] POSTHOOK: Output: file:/tmp/jenkins/hive_2012-11-07_14-00-19_454_6909480964653437044/-mr-10000
[junit] OK
[junit] SLF4J: Class path contains multiple SLF4J bindings.
[junit] SLF4J: Found binding in [jar:<https://builds.apache.org/job/Hive-0.9.1-SNAPSHOT-h0.21/191/artifact/hive/build/ivy/lib/test/slf4j-log4j12-1.6.1.jar!/org/slf4j/impl/StaticLoggerBinder.class]>
[junit] SLF4J: Found binding in [jar:<https://builds.apache.org/job/Hive-0.9.1-SNAPSHOT-h0.21/191/artifact/hive/build/ivy/lib/default/slf4j-log4j12-1.6.1.jar!/org/slf4j/impl/StaticLoggerBinder.class]>
[junit] SLF4J: See http://www.slf4j.org/codes.html#multiple_bindings for an explanation.
[junit] PREHOOK: query: select count(1) as c from testhivedrivertable
[junit] PREHOOK: type: DROPTABLE
[junit] PREHOOK: Input: default@testhivedrivertable
[junit] PREHOOK: Output: file:/tmp/jenkins/hive_2012-11-07_14-00-22_325_959233600900100596/-mr-10000
[junit] Total MapReduce jobs = 1
[junit] Launching Job 1 out of 1
[junit] Number of reduce tasks determined at compile time: 1
[junit] In order to change the average load for a reducer (in bytes):
[junit] set hive.exec.reducers.bytes.per.reducer=<number>
[junit] In order to limit the maximum number of reducers:
[junit] set hive.exec.reducers.max=<number>
[junit] In order to set a constant number of reducers:
[junit] set mapred.reduce.tasks=<number>
[junit] Job running in-process (local Hadoop)
[junit] Hadoop job information for null: number of mappers: 0; number of reducers: 0
[junit] 2012-11-07 14:00:25,086 null map = 100%, reduce = 100%
[junit] Ended Job = job_local_0001
[junit] Execution completed successfully
[junit] Mapred Local Task Succeeded . Convert the Join into MapJoin
[junit] POSTHOOK: query: select count(1) as c from testhivedrivertable
[junit] POSTHOOK: type: DROPTABLE
[junit] POSTHOOK: Input: default@testhivedrivertable
[junit] POSTHOOK: Output: file:/tmp/jenkins/hive_2012-11-07_14-00-22_325_959233600900100596/-mr-10000
[junit] OK
[junit] Hive history file=<https://builds.apache.org/job/Hive-0.9.1-SNAPSHOT-h0.21/191/artifact/hive/build/service/tmp/hive_job_log_jenkins_201211071400_1965300899.txt>
[junit] <https://builds.apache.org/job/Hive-0.9.1-SNAPSHOT-h0.21/ws/hive/service/../data/files/invalidpath/sample.jar> does not exist
[junit] Hive history file=<https://builds.apache.org/job/Hive-0.9.1-SNAPSHOT-h0.21/191/artifact/hive/build/service/tmp/hive_job_log_jenkins_201211071400_1767433671.txt>
[junit] <https://builds.apache.org/job/Hive-0.9.1-SNAPSHOT-h0.21/ws/hive/service/../data/files/invalidpath/sample.txt> does not exist
[junit] Hive history file=<https://builds.apache.org/job/Hive-0.9.1-SNAPSHOT-h0.21/191/artifact/hive/build/service/tmp/hive_job_log_jenkins_201211071400_228630036.txt>
[junit] <https://builds.apache.org/job/Hive-0.9.1-SNAPSHOT-h0.21/ws/hive/service/../data/files/invalidpath/sample.zip> does not exist
[junit] Hive history file=<https://builds.apache.org/job/Hive-0.9.1-SNAPSHOT-h0.21/191/artifact/hive/build/service/tmp/hive_job_log_jenkins_201211071400_2140266507.txt>
[junit] Tests run: 11, Failures: 0, Errors: 0, Time elapsed: 26.188 sec
[junit] Hive history file=<https://builds.apache.org/job/Hive-0.9.1-SNAPSHOT-h0.21/191/artifact/hive/build/service/tmp/hive_job_log_jenkins_201211071400_1711108530.txt>
[junit] Running org.apache.hadoop.hive.service.TestHiveServerSessions
[junit] SLF4J: Class path contains multiple SLF4J bindings.
[junit] SLF4J: Found binding in [jar:<https://builds.apache.org/job/Hive-0.9.1-SNAPSHOT-h0.21/191/artifact/hive/build/ivy/lib/test/slf4j-log4j12-1.6.1.jar!/org/slf4j/impl/StaticLoggerBinder.class]>
[junit] SLF4J: Found binding in [jar:<https://builds.apache.org/job/Hive-0.9.1-SNAPSHOT-h0.21/191/artifact/hive/build/ivy/lib/default/slf4j-log4j12-1.6.1.jar!/org/slf4j/impl/StaticLoggerBinder.class]>
[junit] SLF4J: See http://www.slf4j.org/codes.html#multiple_bindings for an explanation.
[junit] Hive history file=<https://builds.apache.org/job/Hive-0.9.1-SNAPSHOT-h0.21/191/artifact/hive/build/service/tmp/hive_job_log_jenkins_201211071400_107970165.txt>
[junit] Hive history file=<https://builds.apache.org/job/Hive-0.9.1-SNAPSHOT-h0.21/191/artifact/hive/build/service/tmp/hive_job_log_jenkins_201211071400_102198932.txt>
[junit] Tests run: 1, Failures: 0, Errors: 0, Time elapsed: 4.761 sec
BUILD FAILED
<https://builds.apache.org/job/Hive-0.9.1-SNAPSHOT-h0.21/ws/hive/build.xml>:316: Keepgoing execution: 1 of 12 iterations failed.
Total time: 347 minutes 37 seconds
Build step 'Invoke Ant' marked build as failure
Archiving artifacts
Recording test results
Build failed in Jenkins: Hive-0.9.1-SNAPSHOT-h0.21 #190
Posted by Apache Jenkins Server <je...@builds.apache.org>.
See <https://builds.apache.org/job/Hive-0.9.1-SNAPSHOT-h0.21/190/>
------------------------------------------
[...truncated 5051 lines...]
A ql/src/gen
A ql/src/gen/thrift
A ql/src/gen/thrift/gen-py
A ql/src/gen/thrift/gen-py/queryplan
A ql/src/gen/thrift/gen-py/queryplan/ttypes.py
A ql/src/gen/thrift/gen-py/queryplan/constants.py
A ql/src/gen/thrift/gen-py/queryplan/__init__.py
A ql/src/gen/thrift/gen-cpp
A ql/src/gen/thrift/gen-cpp/queryplan_constants.h
A ql/src/gen/thrift/gen-cpp/queryplan_types.cpp
A ql/src/gen/thrift/gen-cpp/queryplan_types.h
A ql/src/gen/thrift/gen-cpp/queryplan_constants.cpp
A ql/src/gen/thrift/gen-rb
A ql/src/gen/thrift/gen-rb/queryplan_types.rb
A ql/src/gen/thrift/gen-rb/queryplan_constants.rb
A ql/src/gen/thrift/gen-javabean
A ql/src/gen/thrift/gen-javabean/org
A ql/src/gen/thrift/gen-javabean/org/apache
A ql/src/gen/thrift/gen-javabean/org/apache/hadoop
A ql/src/gen/thrift/gen-javabean/org/apache/hadoop/hive
A ql/src/gen/thrift/gen-javabean/org/apache/hadoop/hive/ql
A ql/src/gen/thrift/gen-javabean/org/apache/hadoop/hive/ql/plan
A ql/src/gen/thrift/gen-javabean/org/apache/hadoop/hive/ql/plan/api
A ql/src/gen/thrift/gen-javabean/org/apache/hadoop/hive/ql/plan/api/QueryPlan.java
A ql/src/gen/thrift/gen-javabean/org/apache/hadoop/hive/ql/plan/api/Adjacency.java
A ql/src/gen/thrift/gen-javabean/org/apache/hadoop/hive/ql/plan/api/Graph.java
A ql/src/gen/thrift/gen-javabean/org/apache/hadoop/hive/ql/plan/api/Task.java
A ql/src/gen/thrift/gen-javabean/org/apache/hadoop/hive/ql/plan/api/AdjacencyType.java
A ql/src/gen/thrift/gen-javabean/org/apache/hadoop/hive/ql/plan/api/Stage.java
A ql/src/gen/thrift/gen-javabean/org/apache/hadoop/hive/ql/plan/api/TaskType.java
A ql/src/gen/thrift/gen-javabean/org/apache/hadoop/hive/ql/plan/api/Query.java
A ql/src/gen/thrift/gen-javabean/org/apache/hadoop/hive/ql/plan/api/StageType.java
A ql/src/gen/thrift/gen-javabean/org/apache/hadoop/hive/ql/plan/api/NodeType.java
A ql/src/gen/thrift/gen-javabean/org/apache/hadoop/hive/ql/plan/api/Operator.java
A ql/src/gen/thrift/gen-javabean/org/apache/hadoop/hive/ql/plan/api/OperatorType.java
A ql/src/gen/thrift/gen-php
A ql/src/gen/thrift/gen-php/queryplan
A ql/src/gen/thrift/gen-php/queryplan/queryplan_types.php
A ql/src/gen-javabean
A ql/src/gen-javabean/org
A ql/src/gen-javabean/org/apache
A ql/src/gen-javabean/org/apache/hadoop
A ql/src/gen-javabean/org/apache/hadoop/hive
A ql/src/gen-javabean/org/apache/hadoop/hive/ql
A ql/src/gen-javabean/org/apache/hadoop/hive/ql/plan
A ql/src/gen-javabean/org/apache/hadoop/hive/ql/plan/api
A ql/src/gen-php
A ql/build.xml
A ql/if
A ql/if/queryplan.thrift
A pdk
A pdk/ivy.xml
A pdk/scripts
A pdk/scripts/class-registration.xsl
A pdk/scripts/build-plugin.xml
A pdk/scripts/README
A pdk/src
A pdk/src/java
A pdk/src/java/org
A pdk/src/java/org/apache
A pdk/src/java/org/apache/hive
A pdk/src/java/org/apache/hive/pdk
A pdk/src/java/org/apache/hive/pdk/FunctionExtractor.java
A pdk/src/java/org/apache/hive/pdk/HivePdkUnitTest.java
A pdk/src/java/org/apache/hive/pdk/HivePdkUnitTests.java
A pdk/src/java/org/apache/hive/pdk/PluginTest.java
A pdk/test-plugin
A pdk/test-plugin/test
A pdk/test-plugin/test/cleanup.sql
A pdk/test-plugin/test/onerow.txt
A pdk/test-plugin/test/setup.sql
A pdk/test-plugin/src
A pdk/test-plugin/src/org
A pdk/test-plugin/src/org/apache
A pdk/test-plugin/src/org/apache/hive
A pdk/test-plugin/src/org/apache/hive/pdktest
A pdk/test-plugin/src/org/apache/hive/pdktest/Rot13.java
A pdk/test-plugin/build.xml
A pdk/build.xml
A build-offline.xml
U .
At revision 1406198
no change for http://svn.apache.org/repos/asf/hive/branches/branch-0.9 since the previous build
[hive] $ /home/hudson/tools/ant/apache-ant-1.8.1/bin/ant -Dversion=0.9.1-SNAPSHOT very-clean tar binary
Buildfile: /x1/jenkins/jenkins-slave/workspace/Hive-0.9.1-SNAPSHOT-h0.21/hive/build.xml
ivy-init-dirs:
[echo] Project: hive
[mkdir] Created dir: /x1/jenkins/jenkins-slave/workspace/Hive-0.9.1-SNAPSHOT-h0.21/hive/build/ivy
[mkdir] Created dir: /x1/jenkins/jenkins-slave/workspace/Hive-0.9.1-SNAPSHOT-h0.21/hive/build/ivy/lib
[mkdir] Created dir: /x1/jenkins/jenkins-slave/workspace/Hive-0.9.1-SNAPSHOT-h0.21/hive/build/ivy/report
[mkdir] Created dir: /x1/jenkins/jenkins-slave/workspace/Hive-0.9.1-SNAPSHOT-h0.21/hive/build/ivy/maven
ivy-download:
[echo] Project: hive
[get] Getting: http://repo2.maven.org/maven2/org/apache/ivy/ivy/2.1.0/ivy-2.1.0.jar
[get] To: /x1/jenkins/jenkins-slave/workspace/Hive-0.9.1-SNAPSHOT-h0.21/hive/build/ivy/lib/ivy-2.1.0.jar
ivy-probe-antlib:
[echo] Project: hive
ivy-init-antlib:
[echo] Project: hive
ivy-clean-cache:
[ivy:cleancache] :: Ivy 2.1.0 - 20090925235825 :: http://ant.apache.org/ivy/ ::
[ivy:cleancache] :: loading settings :: url = jar:file:/x1/jenkins/jenkins-slave/workspace/Hive-0.9.1-SNAPSHOT-h0.21/hive/build/ivy/lib/ivy-2.1.0.jar!/org/apache/ivy/core/settings/ivysettings.xml
clean:
[echo] Project: hive
clean:
[echo] Project: anttasks
clean:
[echo] Project: shims
clean:
[echo] Project: common
clean:
[echo] Project: serde
clean:
[echo] Project: metastore
clean:
[echo] Project: ql
clean:
[echo] Project: contrib
clean:
[echo] Project: service
clean:
[echo] Project: cli
clean:
[echo] Project: jdbc
clean:
[echo] Project: hwi
clean:
[echo] Project: hbase-handler
clean:
[echo] Project: pdk
clean:
[echo] Project: builtins
clean:
clean:
[echo] Project: odbc
[exec] rm -rf /x1/jenkins/jenkins-slave/workspace/Hive-0.9.1-SNAPSHOT-h0.21/hive/build/odbc /x1/jenkins/jenkins-slave/workspace/Hive-0.9.1-SNAPSHOT-h0.21/hive/build/service/objs /x1/jenkins/jenkins-slave/workspace/Hive-0.9.1-SNAPSHOT-h0.21/hive/build/ql/objs /x1/jenkins/jenkins-slave/workspace/Hive-0.9.1-SNAPSHOT-h0.21/hive/build/metastore/objs
clean-online:
[echo] Project: hive
[delete] Deleting directory /x1/jenkins/jenkins-slave/workspace/Hive-0.9.1-SNAPSHOT-h0.21/hive/build
clean-offline:
very-clean:
ivy-init-dirs:
[echo] Project: hive
[mkdir] Created dir: /x1/jenkins/jenkins-slave/workspace/Hive-0.9.1-SNAPSHOT-h0.21/hive/build/ivy
[mkdir] Created dir: /x1/jenkins/jenkins-slave/workspace/Hive-0.9.1-SNAPSHOT-h0.21/hive/build/ivy/lib
[mkdir] Created dir: /x1/jenkins/jenkins-slave/workspace/Hive-0.9.1-SNAPSHOT-h0.21/hive/build/ivy/report
[mkdir] Created dir: /x1/jenkins/jenkins-slave/workspace/Hive-0.9.1-SNAPSHOT-h0.21/hive/build/ivy/maven
ivy-download:
[echo] Project: hive
[get] Getting: http://repo2.maven.org/maven2/org/apache/ivy/ivy/2.1.0/ivy-2.1.0.jar
[get] To: /x1/jenkins/jenkins-slave/workspace/Hive-0.9.1-SNAPSHOT-h0.21/hive/build/ivy/lib/ivy-2.1.0.jar
ivy-probe-antlib:
[echo] Project: hive
ivy-init-antlib:
compile-ant-tasks:
[echo] Project: hive
create-dirs:
[echo] Project: anttasks
[mkdir] Created dir: /x1/jenkins/jenkins-slave/workspace/Hive-0.9.1-SNAPSHOT-h0.21/hive/build/anttasks
[mkdir] Created dir: /x1/jenkins/jenkins-slave/workspace/Hive-0.9.1-SNAPSHOT-h0.21/hive/build/anttasks/classes
[mkdir] Created dir: /x1/jenkins/jenkins-slave/workspace/Hive-0.9.1-SNAPSHOT-h0.21/hive/build/jexl/classes
[mkdir] Created dir: /x1/jenkins/jenkins-slave/workspace/Hive-0.9.1-SNAPSHOT-h0.21/hive/build/hadoopcore
[mkdir] Created dir: /x1/jenkins/jenkins-slave/workspace/Hive-0.9.1-SNAPSHOT-h0.21/hive/build/anttasks/test
[mkdir] Created dir: /x1/jenkins/jenkins-slave/workspace/Hive-0.9.1-SNAPSHOT-h0.21/hive/build/anttasks/test/src
[mkdir] Created dir: /x1/jenkins/jenkins-slave/workspace/Hive-0.9.1-SNAPSHOT-h0.21/hive/build/anttasks/test/classes
[mkdir] Created dir: /x1/jenkins/jenkins-slave/workspace/Hive-0.9.1-SNAPSHOT-h0.21/hive/build/anttasks/test/resources
[copy] Warning: /x1/jenkins/jenkins-slave/workspace/Hive-0.9.1-SNAPSHOT-h0.21/hive/ant/src/test/resources does not exist.
init:
[echo] Project: anttasks
ivy-init-settings:
[echo] Project: anttasks
ivy-resolve:
[echo] Project: anttasks
[ivy:resolve] :: loading settings :: file = /x1/jenkins/jenkins-slave/workspace/Hive-0.9.1-SNAPSHOT-h0.21/hive/ivy/ivysettings.xml
[ivy:resolve] downloading http://repo1.maven.org/maven2/commons-lang/commons-lang/2.4/commons-lang-2.4.jar ...
[ivy:resolve] .................... (255kB)
[ivy:resolve] downloading http://repo1.maven.org/maven2/velocity/velocity/1.5/velocity-1.5.jar ...
[ivy:resolve] ........................... (382kB)
[ivy:resolve] .. (0kB)
[ivy:resolve] [SUCCESSFUL ] velocity#velocity;1.5!velocity.jar (357ms)
[ivy:resolve]
[ivy:resolve] :: problems summary ::
[ivy:resolve] :::: WARNINGS
[ivy:resolve] [FAILED ] commons-lang#commons-lang;2.4!commons-lang.jar: Downloaded file size doesn't match expected Content Length for http://repo1.maven.org/maven2/commons-lang/commons-lang/2.4/commons-lang-2.4.jar. Please retry. (274ms)
[ivy:resolve] [FAILED ] commons-lang#commons-lang;2.4!commons-lang.jar: (0ms)
[ivy:resolve] ==== local: tried
[ivy:resolve] /home/jenkins/.ivy2/local/commons-lang/commons-lang/2.4/jars/commons-lang.jar
[ivy:resolve] ==== apache-snapshot: tried
[ivy:resolve] https://repository.apache.org/content/repositories/snapshots/commons-lang/commons-lang/2.4/commons-lang-2.4.jar
[ivy:resolve] ==== maven2: tried
[ivy:resolve] http://repo1.maven.org/maven2/commons-lang/commons-lang/2.4/commons-lang-2.4.jar
[ivy:resolve] ==== datanucleus-repo: tried
[ivy:resolve] http://www.datanucleus.org/downloads/maven2/commons-lang/commons-lang/2.4/commons-lang-2.4.jar
[ivy:resolve] ==== hadoop-source: tried
[ivy:resolve] http://mirror.facebook.net/facebook/hive-deps/hadoop/core/commons-lang-2.4/commons-lang-2.4.jar
[ivy:resolve] ==== hadoop-source2: tried
[ivy:resolve] http://archive.cloudera.com/hive-deps/hadoop/core/commons-lang-2.4/commons-lang-2.4.jar
[ivy:resolve] ::::::::::::::::::::::::::::::::::::::::::::::
[ivy:resolve] :: FAILED DOWNLOADS ::
[ivy:resolve] :: ^ see resolution messages for details ^ ::
[ivy:resolve] ::::::::::::::::::::::::::::::::::::::::::::::
[ivy:resolve] :: commons-lang#commons-lang;2.4!commons-lang.jar
[ivy:resolve] ::::::::::::::::::::::::::::::::::::::::::::::
[ivy:resolve]
[ivy:resolve] :: USE VERBOSE OR DEBUG MESSAGE LEVEL FOR MORE DETAILS
BUILD FAILED
/x1/jenkins/jenkins-slave/workspace/Hive-0.9.1-SNAPSHOT-h0.21/hive/build.xml:256: The following error occurred while executing this line:
/x1/jenkins/jenkins-slave/workspace/Hive-0.9.1-SNAPSHOT-h0.21/hive/build-common.xml:125: impossible to resolve dependencies:
resolve failed - see output for details
Total time: 8 seconds
Build step 'Invoke Ant' marked build as failure
Archiving artifacts
Recording test results
Build failed in Jenkins: Hive-0.9.1-SNAPSHOT-h0.21 #189
Posted by Apache Jenkins Server <je...@builds.apache.org>.
See <https://builds.apache.org/job/Hive-0.9.1-SNAPSHOT-h0.21/189/>
------------------------------------------
[...truncated 5328 lines...]
[mkdir] Created dir: <https://builds.apache.org/job/Hive-0.9.1-SNAPSHOT-h0.21/189/artifact/hive/build/shims>
[mkdir] Created dir: <https://builds.apache.org/job/Hive-0.9.1-SNAPSHOT-h0.21/189/artifact/hive/build/shims/classes>
[mkdir] Created dir: <https://builds.apache.org/job/Hive-0.9.1-SNAPSHOT-h0.21/189/artifact/hive/build/shims/test>
[mkdir] Created dir: <https://builds.apache.org/job/Hive-0.9.1-SNAPSHOT-h0.21/189/artifact/hive/build/shims/test/src>
[mkdir] Created dir: <https://builds.apache.org/job/Hive-0.9.1-SNAPSHOT-h0.21/189/artifact/hive/build/shims/test/classes>
[mkdir] Created dir: <https://builds.apache.org/job/Hive-0.9.1-SNAPSHOT-h0.21/189/artifact/hive/build/shims/test/resources>
[copy] Warning: <https://builds.apache.org/job/Hive-0.9.1-SNAPSHOT-h0.21/ws/hive/shims/src/test/resources> does not exist.
init:
[echo] Project: shims
create-dirs:
[echo] Project: common
[mkdir] Created dir: <https://builds.apache.org/job/Hive-0.9.1-SNAPSHOT-h0.21/189/artifact/hive/build/common>
[mkdir] Created dir: <https://builds.apache.org/job/Hive-0.9.1-SNAPSHOT-h0.21/189/artifact/hive/build/common/classes>
[mkdir] Created dir: <https://builds.apache.org/job/Hive-0.9.1-SNAPSHOT-h0.21/189/artifact/hive/build/common/test>
[mkdir] Created dir: <https://builds.apache.org/job/Hive-0.9.1-SNAPSHOT-h0.21/189/artifact/hive/build/common/test/src>
[mkdir] Created dir: <https://builds.apache.org/job/Hive-0.9.1-SNAPSHOT-h0.21/189/artifact/hive/build/common/test/classes>
[mkdir] Created dir: <https://builds.apache.org/job/Hive-0.9.1-SNAPSHOT-h0.21/189/artifact/hive/build/common/test/resources>
[copy] Copying 2 files to <https://builds.apache.org/job/Hive-0.9.1-SNAPSHOT-h0.21/189/artifact/hive/build/common/test/resources>
init:
[echo] Project: common
create-dirs:
[echo] Project: serde
[mkdir] Created dir: <https://builds.apache.org/job/Hive-0.9.1-SNAPSHOT-h0.21/189/artifact/hive/build/serde>
[mkdir] Created dir: <https://builds.apache.org/job/Hive-0.9.1-SNAPSHOT-h0.21/189/artifact/hive/build/serde/classes>
[mkdir] Created dir: <https://builds.apache.org/job/Hive-0.9.1-SNAPSHOT-h0.21/189/artifact/hive/build/serde/test>
[mkdir] Created dir: <https://builds.apache.org/job/Hive-0.9.1-SNAPSHOT-h0.21/189/artifact/hive/build/serde/test/src>
[mkdir] Created dir: <https://builds.apache.org/job/Hive-0.9.1-SNAPSHOT-h0.21/189/artifact/hive/build/serde/test/classes>
[mkdir] Created dir: <https://builds.apache.org/job/Hive-0.9.1-SNAPSHOT-h0.21/189/artifact/hive/build/serde/test/resources>
[copy] Warning: <https://builds.apache.org/job/Hive-0.9.1-SNAPSHOT-h0.21/ws/hive/serde/src/test/resources> does not exist.
init:
[echo] Project: serde
create-dirs:
[echo] Project: metastore
[mkdir] Created dir: <https://builds.apache.org/job/Hive-0.9.1-SNAPSHOT-h0.21/189/artifact/hive/build/metastore>
[mkdir] Created dir: <https://builds.apache.org/job/Hive-0.9.1-SNAPSHOT-h0.21/189/artifact/hive/build/metastore/classes>
[mkdir] Created dir: <https://builds.apache.org/job/Hive-0.9.1-SNAPSHOT-h0.21/189/artifact/hive/build/metastore/test>
[mkdir] Created dir: <https://builds.apache.org/job/Hive-0.9.1-SNAPSHOT-h0.21/189/artifact/hive/build/metastore/test/src>
[mkdir] Created dir: <https://builds.apache.org/job/Hive-0.9.1-SNAPSHOT-h0.21/189/artifact/hive/build/metastore/test/classes>
[mkdir] Created dir: <https://builds.apache.org/job/Hive-0.9.1-SNAPSHOT-h0.21/189/artifact/hive/build/metastore/test/resources>
[copy] Warning: <https://builds.apache.org/job/Hive-0.9.1-SNAPSHOT-h0.21/ws/hive/metastore/src/test/resources> does not exist.
init:
[echo] Project: metastore
create-dirs:
[echo] Project: ql
[mkdir] Created dir: <https://builds.apache.org/job/Hive-0.9.1-SNAPSHOT-h0.21/189/artifact/hive/build/ql>
[mkdir] Created dir: <https://builds.apache.org/job/Hive-0.9.1-SNAPSHOT-h0.21/189/artifact/hive/build/ql/classes>
[mkdir] Created dir: <https://builds.apache.org/job/Hive-0.9.1-SNAPSHOT-h0.21/189/artifact/hive/build/ql/test>
[mkdir] Created dir: <https://builds.apache.org/job/Hive-0.9.1-SNAPSHOT-h0.21/189/artifact/hive/build/ql/test/src>
[mkdir] Created dir: <https://builds.apache.org/job/Hive-0.9.1-SNAPSHOT-h0.21/189/artifact/hive/build/ql/test/classes>
[mkdir] Created dir: <https://builds.apache.org/job/Hive-0.9.1-SNAPSHOT-h0.21/189/artifact/hive/build/ql/test/resources>
[copy] Warning: <https://builds.apache.org/job/Hive-0.9.1-SNAPSHOT-h0.21/ws/hive/ql/src/test/resources> does not exist.
init:
[echo] Project: ql
create-dirs:
[echo] Project: contrib
[mkdir] Created dir: <https://builds.apache.org/job/Hive-0.9.1-SNAPSHOT-h0.21/189/artifact/hive/build/contrib>
[mkdir] Created dir: <https://builds.apache.org/job/Hive-0.9.1-SNAPSHOT-h0.21/189/artifact/hive/build/contrib/classes>
[mkdir] Created dir: <https://builds.apache.org/job/Hive-0.9.1-SNAPSHOT-h0.21/189/artifact/hive/build/contrib/test>
[mkdir] Created dir: <https://builds.apache.org/job/Hive-0.9.1-SNAPSHOT-h0.21/189/artifact/hive/build/contrib/test/src>
[mkdir] Created dir: <https://builds.apache.org/job/Hive-0.9.1-SNAPSHOT-h0.21/189/artifact/hive/build/contrib/test/classes>
[mkdir] Created dir: <https://builds.apache.org/job/Hive-0.9.1-SNAPSHOT-h0.21/189/artifact/hive/build/contrib/test/resources>
[copy] Warning: <https://builds.apache.org/job/Hive-0.9.1-SNAPSHOT-h0.21/ws/hive/contrib/src/test/resources> does not exist.
init:
[echo] Project: contrib
create-dirs:
[echo] Project: service
[mkdir] Created dir: <https://builds.apache.org/job/Hive-0.9.1-SNAPSHOT-h0.21/189/artifact/hive/build/service>
[mkdir] Created dir: <https://builds.apache.org/job/Hive-0.9.1-SNAPSHOT-h0.21/189/artifact/hive/build/service/classes>
[mkdir] Created dir: <https://builds.apache.org/job/Hive-0.9.1-SNAPSHOT-h0.21/189/artifact/hive/build/service/test>
[mkdir] Created dir: <https://builds.apache.org/job/Hive-0.9.1-SNAPSHOT-h0.21/189/artifact/hive/build/service/test/src>
[mkdir] Created dir: <https://builds.apache.org/job/Hive-0.9.1-SNAPSHOT-h0.21/189/artifact/hive/build/service/test/classes>
[mkdir] Created dir: <https://builds.apache.org/job/Hive-0.9.1-SNAPSHOT-h0.21/189/artifact/hive/build/service/test/resources>
[copy] Warning: <https://builds.apache.org/job/Hive-0.9.1-SNAPSHOT-h0.21/ws/hive/service/src/test/resources> does not exist.
init:
[echo] Project: service
create-dirs:
[echo] Project: cli
[mkdir] Created dir: <https://builds.apache.org/job/Hive-0.9.1-SNAPSHOT-h0.21/189/artifact/hive/build/cli>
[mkdir] Created dir: <https://builds.apache.org/job/Hive-0.9.1-SNAPSHOT-h0.21/189/artifact/hive/build/cli/classes>
[mkdir] Created dir: <https://builds.apache.org/job/Hive-0.9.1-SNAPSHOT-h0.21/189/artifact/hive/build/cli/test>
[mkdir] Created dir: <https://builds.apache.org/job/Hive-0.9.1-SNAPSHOT-h0.21/189/artifact/hive/build/cli/test/src>
[mkdir] Created dir: <https://builds.apache.org/job/Hive-0.9.1-SNAPSHOT-h0.21/189/artifact/hive/build/cli/test/classes>
[mkdir] Created dir: <https://builds.apache.org/job/Hive-0.9.1-SNAPSHOT-h0.21/189/artifact/hive/build/cli/test/resources>
[copy] Warning: <https://builds.apache.org/job/Hive-0.9.1-SNAPSHOT-h0.21/ws/hive/cli/src/test/resources> does not exist.
init:
[echo] Project: cli
create-dirs:
[echo] Project: jdbc
[mkdir] Created dir: <https://builds.apache.org/job/Hive-0.9.1-SNAPSHOT-h0.21/189/artifact/hive/build/jdbc>
[mkdir] Created dir: <https://builds.apache.org/job/Hive-0.9.1-SNAPSHOT-h0.21/189/artifact/hive/build/jdbc/classes>
[mkdir] Created dir: <https://builds.apache.org/job/Hive-0.9.1-SNAPSHOT-h0.21/189/artifact/hive/build/jdbc/test>
[mkdir] Created dir: <https://builds.apache.org/job/Hive-0.9.1-SNAPSHOT-h0.21/189/artifact/hive/build/jdbc/test/src>
[mkdir] Created dir: <https://builds.apache.org/job/Hive-0.9.1-SNAPSHOT-h0.21/189/artifact/hive/build/jdbc/test/classes>
[mkdir] Created dir: <https://builds.apache.org/job/Hive-0.9.1-SNAPSHOT-h0.21/189/artifact/hive/build/jdbc/test/resources>
[copy] Warning: <https://builds.apache.org/job/Hive-0.9.1-SNAPSHOT-h0.21/ws/hive/jdbc/src/test/resources> does not exist.
init:
[echo] Project: jdbc
create-dirs:
[echo] Project: hwi
[mkdir] Created dir: <https://builds.apache.org/job/Hive-0.9.1-SNAPSHOT-h0.21/189/artifact/hive/build/hwi>
[mkdir] Created dir: <https://builds.apache.org/job/Hive-0.9.1-SNAPSHOT-h0.21/189/artifact/hive/build/hwi/classes>
[mkdir] Created dir: <https://builds.apache.org/job/Hive-0.9.1-SNAPSHOT-h0.21/189/artifact/hive/build/hwi/test>
[mkdir] Created dir: <https://builds.apache.org/job/Hive-0.9.1-SNAPSHOT-h0.21/189/artifact/hive/build/hwi/test/src>
[mkdir] Created dir: <https://builds.apache.org/job/Hive-0.9.1-SNAPSHOT-h0.21/189/artifact/hive/build/hwi/test/classes>
[mkdir] Created dir: <https://builds.apache.org/job/Hive-0.9.1-SNAPSHOT-h0.21/189/artifact/hive/build/hwi/test/resources>
[copy] Warning: <https://builds.apache.org/job/Hive-0.9.1-SNAPSHOT-h0.21/ws/hive/hwi/src/test/resources> does not exist.
init:
[echo] Project: hwi
create-dirs:
[echo] Project: hbase-handler
[mkdir] Created dir: <https://builds.apache.org/job/Hive-0.9.1-SNAPSHOT-h0.21/189/artifact/hive/build/hbase-handler>
[mkdir] Created dir: <https://builds.apache.org/job/Hive-0.9.1-SNAPSHOT-h0.21/189/artifact/hive/build/hbase-handler/classes>
[mkdir] Created dir: <https://builds.apache.org/job/Hive-0.9.1-SNAPSHOT-h0.21/189/artifact/hive/build/hbase-handler/test>
[mkdir] Created dir: <https://builds.apache.org/job/Hive-0.9.1-SNAPSHOT-h0.21/189/artifact/hive/build/hbase-handler/test/src>
[mkdir] Created dir: <https://builds.apache.org/job/Hive-0.9.1-SNAPSHOT-h0.21/189/artifact/hive/build/hbase-handler/test/classes>
[mkdir] Created dir: <https://builds.apache.org/job/Hive-0.9.1-SNAPSHOT-h0.21/189/artifact/hive/build/hbase-handler/test/resources>
[copy] Warning: <https://builds.apache.org/job/Hive-0.9.1-SNAPSHOT-h0.21/ws/hive/hbase-handler/src/test/resources> does not exist.
init:
[echo] Project: hbase-handler
create-dirs:
[echo] Project: pdk
[mkdir] Created dir: <https://builds.apache.org/job/Hive-0.9.1-SNAPSHOT-h0.21/189/artifact/hive/build/pdk>
[mkdir] Created dir: <https://builds.apache.org/job/Hive-0.9.1-SNAPSHOT-h0.21/189/artifact/hive/build/pdk/classes>
[mkdir] Created dir: <https://builds.apache.org/job/Hive-0.9.1-SNAPSHOT-h0.21/189/artifact/hive/build/pdk/test>
[mkdir] Created dir: <https://builds.apache.org/job/Hive-0.9.1-SNAPSHOT-h0.21/189/artifact/hive/build/pdk/test/src>
[mkdir] Created dir: <https://builds.apache.org/job/Hive-0.9.1-SNAPSHOT-h0.21/189/artifact/hive/build/pdk/test/classes>
[mkdir] Created dir: <https://builds.apache.org/job/Hive-0.9.1-SNAPSHOT-h0.21/189/artifact/hive/build/pdk/test/resources>
[copy] Warning: <https://builds.apache.org/job/Hive-0.9.1-SNAPSHOT-h0.21/ws/hive/pdk/src/test/resources> does not exist.
init:
[echo] Project: pdk
create-dirs:
[echo] Project: builtins
[mkdir] Created dir: <https://builds.apache.org/job/Hive-0.9.1-SNAPSHOT-h0.21/189/artifact/hive/build/builtins>
[mkdir] Created dir: <https://builds.apache.org/job/Hive-0.9.1-SNAPSHOT-h0.21/189/artifact/hive/build/builtins/classes>
[mkdir] Created dir: <https://builds.apache.org/job/Hive-0.9.1-SNAPSHOT-h0.21/189/artifact/hive/build/builtins/test>
[mkdir] Created dir: <https://builds.apache.org/job/Hive-0.9.1-SNAPSHOT-h0.21/189/artifact/hive/build/builtins/test/src>
[mkdir] Created dir: <https://builds.apache.org/job/Hive-0.9.1-SNAPSHOT-h0.21/189/artifact/hive/build/builtins/test/classes>
[mkdir] Created dir: <https://builds.apache.org/job/Hive-0.9.1-SNAPSHOT-h0.21/189/artifact/hive/build/builtins/test/resources>
[copy] Warning: <https://builds.apache.org/job/Hive-0.9.1-SNAPSHOT-h0.21/ws/hive/builtins/src/test/resources> does not exist.
init:
[echo] Project: builtins
jar:
[echo] Project: hive
create-dirs:
[echo] Project: shims
[copy] Warning: <https://builds.apache.org/job/Hive-0.9.1-SNAPSHOT-h0.21/ws/hive/shims/src/test/resources> does not exist.
init:
[echo] Project: shims
ivy-init-settings:
[echo] Project: shims
ivy-resolve:
[echo] Project: shims
[ivy:resolve] :: loading settings :: file = <https://builds.apache.org/job/Hive-0.9.1-SNAPSHOT-h0.21/ws/hive/ivy/ivysettings.xml>
[ivy:resolve] downloading http://repo1.maven.org/maven2/org/apache/zookeeper/zookeeper/3.4.3/zookeeper-3.4.3.jar ...
[ivy:resolve] ............................................................................................................................ (749kB)
[ivy:resolve] .. (0kB)
[ivy:resolve] [SUCCESSFUL ] org.apache.zookeeper#zookeeper;3.4.3!zookeeper.jar (90ms)
[ivy:resolve] downloading http://repo1.maven.org/maven2/org/apache/thrift/libthrift/0.7.0/libthrift-0.7.0.jar ...
[ivy:resolve] .............................................. (294kB)
[ivy:resolve] .. (0kB)
[ivy:resolve] [SUCCESSFUL ] org.apache.thrift#libthrift;0.7.0!libthrift.jar (39ms)
[ivy:resolve] downloading http://repo1.maven.org/maven2/commons-logging/commons-logging/1.0.4/commons-logging-1.0.4.jar ...
[ivy:resolve] ....... (37kB)
[ivy:resolve] .. (0kB)
[ivy:resolve] [SUCCESSFUL ] commons-logging#commons-logging;1.0.4!commons-logging.jar (183ms)
[ivy:resolve] downloading http://repo1.maven.org/maven2/commons-logging/commons-logging-api/1.0.4/commons-logging-api-1.0.4.jar ...
[ivy:resolve] .... (25kB)
[ivy:resolve] .. (0kB)
[ivy:resolve] [SUCCESSFUL ] commons-logging#commons-logging-api;1.0.4!commons-logging-api.jar (12ms)
[ivy:resolve] downloading http://repo1.maven.org/maven2/org/codehaus/jackson/jackson-core-asl/1.8.8/jackson-core-asl-1.8.8.jar ...
[ivy:resolve] ........................................ (222kB)
[ivy:resolve] .. (0kB)
[ivy:resolve] [SUCCESSFUL ] org.codehaus.jackson#jackson-core-asl;1.8.8!jackson-core-asl.jar (31ms)
[ivy:resolve] downloading http://repo1.maven.org/maven2/org/codehaus/jackson/jackson-mapper-asl/1.8.8/jackson-mapper-asl-1.8.8.jar ...
[ivy:resolve] ................................................................................................................. (652kB)
[ivy:resolve] .. (0kB)
[ivy:resolve] [SUCCESSFUL ] org.codehaus.jackson#jackson-mapper-asl;1.8.8!jackson-mapper-asl.jar (78ms)
[ivy:resolve]
[ivy:resolve] :: problems summary ::
[ivy:resolve] :::: WARNINGS
[ivy:resolve] problem while downloading module descriptor: http://repo1.maven.org/maven2/com/google/guava/guava/r09/guava-r09.pom: /home/jenkins/.ivy2/cache/com.google.guava/guava/ivy-r09.xml.original.part (No such file or directory) (10ms)
[ivy:resolve] module not found: com.google.guava#guava;r09
[ivy:resolve] ==== local: tried
[ivy:resolve] /home/jenkins/.ivy2/local/com.google.guava/guava/r09/ivys/ivy.xml
[ivy:resolve] -- artifact com.google.guava#guava;r09!guava.jar:
[ivy:resolve] /home/jenkins/.ivy2/local/com.google.guava/guava/r09/jars/guava.jar
[ivy:resolve] ==== apache-snapshot: tried
[ivy:resolve] https://repository.apache.org/content/repositories/snapshots/com/google/guava/guava/r09/guava-r09.pom
[ivy:resolve] -- artifact com.google.guava#guava;r09!guava.jar:
[ivy:resolve] https://repository.apache.org/content/repositories/snapshots/com/google/guava/guava/r09/guava-r09.jar
[ivy:resolve] ==== maven2: tried
[ivy:resolve] http://repo1.maven.org/maven2/com/google/guava/guava/r09/guava-r09.pom
[ivy:resolve] ==== datanucleus-repo: tried
[ivy:resolve] -- artifact com.google.guava#guava;r09!guava.jar:
[ivy:resolve] http://www.datanucleus.org/downloads/maven2/com/google/guava/guava/r09/guava-r09.jar
[ivy:resolve] ==== hadoop-source: tried
[ivy:resolve] -- artifact com.google.guava#guava;r09!guava.jar:
[ivy:resolve] http://mirror.facebook.net/facebook/hive-deps/hadoop/core/guava-r09/guava-r09.jar
[ivy:resolve] ==== hadoop-source2: tried
[ivy:resolve] -- artifact com.google.guava#guava;r09!guava.jar:
[ivy:resolve] http://archive.cloudera.com/hive-deps/hadoop/core/guava-r09/guava-r09.jar
[ivy:resolve] ::::::::::::::::::::::::::::::::::::::::::::::
[ivy:resolve] :: UNRESOLVED DEPENDENCIES ::
[ivy:resolve] ::::::::::::::::::::::::::::::::::::::::::::::
[ivy:resolve] :: com.google.guava#guava;r09: not found
[ivy:resolve] ::::::::::::::::::::::::::::::::::::::::::::::
[ivy:resolve]
[ivy:resolve] :: USE VERBOSE OR DEBUG MESSAGE LEVEL FOR MORE DETAILS
BUILD FAILED
<https://builds.apache.org/job/Hive-0.9.1-SNAPSHOT-h0.21/ws/hive/build.xml>:302: The following error occurred while executing this line:
<https://builds.apache.org/job/Hive-0.9.1-SNAPSHOT-h0.21/ws/hive/build.xml>:152: The following error occurred while executing this line:
<https://builds.apache.org/job/Hive-0.9.1-SNAPSHOT-h0.21/ws/hive/build-common.xml>:125: impossible to resolve dependencies:
resolve failed - see output for details
Total time: 13 seconds
Build step 'Invoke Ant' marked build as failure
Archiving artifacts
Recording test results