You are viewing a plain text version of this content. The canonical link for it is here.
Posted to notifications@maven.apache.org by Apache Jenkins Server <je...@builds.apache.org> on 2018/04/10 17:38:23 UTC
Build failed in Jenkins: Maven TLP » maven-compiler-plugin » TEST_TO_FIX_MCOMPILER-192 #30
See https://builds.apache.org/job/maven-box/job/maven-compiler-plugin/job/TEST_TO_FIX_MCOMPILER-192/30/
Changes:
* Change JDK10 on Windows to 'JDK 10 b46 (Windows Only)'
* auto deploy if we are currently on master branch
* revert as it seems to fail on jenkins asf
* revert this one as well
* Removed unused information.
All tests passed
Build log:
[...truncated 1.80 MB...]
[linux-jdk9] [INFO] Building: mcompiler-120/pom.xml
[linux-jdk8] [INFO] mcompiler-106/pom.xml ............................ SUCCESS (4.4 s)
[linux-jdk8] [INFO] Building: MCOMPILER-129/pom.xml
[linux-jdk9] [INFO] run post-build script verify.groovy
[linux-jdk9] [INFO] mcompiler-120/pom.xml ............................ SUCCESS (4.6 s)
[linux-jdk9] [INFO] Building: MCOMPILER-129/pom.xml
[linux-jdk8] [INFO] MCOMPILER-129/pom.xml ............................ SUCCESS (4.4 s)
[linux-jdk8] [INFO] Building: MCOMPILER-298/pom.xml
[linux-jdk9] [INFO] MCOMPILER-129/pom.xml ............................ SUCCESS (3.3 s)
[linux-jdk9] [INFO] Building: jdk9-exportsto/pom.xml
[linux-jdk9] [INFO] jdk9-exportsto/pom.xml ........................... SUCCESS (4.1 s)
[linux-jdk9] [INFO] Building: MCOMPILER-228/pom.xml
[linux-jdk8] [INFO] MCOMPILER-298/pom.xml ............................ SUCCESS (6.7 s)
[linux-jdk8] [INFO] Building: test1/pom.xml
[linux-jdk9] [INFO] MCOMPILER-228/pom.xml ............................ SUCCESS (3.7 s)
[linux-jdk9] [INFO] Building: MCOMPILER-298/pom.xml
[linux-jdk8] [INFO] test1/pom.xml .................................... SUCCESS (4.5 s)
[linux-jdk8] [INFO] Building: default/pom.xml
[linux-jdk8] [INFO] run post-build script verify.bsh
[linux-jdk8] [INFO] default/pom.xml .................................. SUCCESS (4.1 s)
[linux-jdk8] [INFO] Building: MCOMPILER-197/pom.xml
[linux-jdk9] [INFO] MCOMPILER-298/pom.xml ............................ SUCCESS (5.1 s)
[linux-jdk9] [INFO] Building: automodules-manifest/pom.xml
[linux-jdk8] [INFO] run post-build script verify.groovy
[linux-jdk8] [INFO] MCOMPILER-197/pom.xml ............................ SUCCESS (5.2 s)
[linux-jdk8] [INFO] Building: non-english-warnings/pom.xml
[linux-jdk9] [INFO] run post-build script verify.groovy
[linux-jdk9] [INFO] automodules-manifest/pom.xml ..................... SUCCESS (3.9 s)
[linux-jdk9] [INFO] Building: mcompiler-182/pom.xml
[linux-jdk8] [INFO] run post-build script verify.bsh
[linux-jdk8] [INFO] non-english-warnings/pom.xml ..................... SUCCESS (4.4 s)
[linux-jdk8] [INFO] Building: MCOMPILER-294/pom.xml
[linux-jdk8] [INFO] MCOMPILER-294/pom.xml ............................ SKIPPED due to JRE version
[linux-jdk8] [INFO]
[linux-jdk8] [INFO] --- maven-checkstyle-plugin:3.0.0:check (checkstyle-check) @ maven-compiler-plugin ---
[linux-jdk8] [INFO] Downloading from central: https://repo.maven.apache.org/maven2/org/apache/maven/shared/maven-shared-resources/2/maven-shared-resources-2.pom
[linux-jdk8] [INFO] Downloaded from central: https://repo.maven.apache.org/maven2/org/apache/maven/shared/maven-shared-resources/2/maven-shared-resources-2.pom (3.0 kB at 211 kB/s)
[linux-jdk8] [INFO] Downloading from central: https://repo.maven.apache.org/maven2/org/codehaus/plexus/plexus-utils/3.0.10/plexus-utils-3.0.10.pom
[linux-jdk8] [INFO] Downloaded from central: https://repo.maven.apache.org/maven2/org/codehaus/plexus/plexus-utils/3.0.10/plexus-utils-3.0.10.pom (3.1 kB at 262 kB/s)
[linux-jdk8] [INFO] Downloading from central: https://repo.maven.apache.org/maven2/org/codehaus/plexus/plexus/3.3/plexus-3.3.pom
[linux-jdk8] [INFO] Downloaded from central: https://repo.maven.apache.org/maven2/org/codehaus/plexus/plexus/3.3/plexus-3.3.pom (20 kB at 1.5 MB/s)
[linux-jdk8] [INFO] Downloading from central: https://repo.maven.apache.org/maven2/org/apache/maven/doxia/doxia-integration-tools/1.6/doxia-integration-tools-1.6.pom
[linux-jdk8] [INFO] Downloaded from central: https://repo.maven.apache.org/maven2/org/apache/maven/doxia/doxia-integration-tools/1.6/doxia-integration-tools-1.6.pom (7.0 kB at 580 kB/s)
[linux-jdk8] [INFO] Downloading from central: https://repo.maven.apache.org/maven2/org/apache/maven/doxia/doxia-tools/3/doxia-tools-3.pom
[linux-jdk8] [INFO] Downloaded from central: https://repo.maven.apache.org/maven2/org/apache/maven/doxia/doxia-tools/3/doxia-tools-3.pom (9.9 kB at 709 kB/s)
[linux-jdk8] [INFO] Downloading from central: https://repo.maven.apache.org/maven2/org/codehaus/plexus/plexus-resources/1.1.0/plexus-resources-1.1.0.pom
[linux-jdk8] [INFO] Downloaded from central: https://repo.maven.apache.org/maven2/org/codehaus/plexus/plexus-resources/1.1.0/plexus-resources-1.1.0.pom (3.2 kB at 244 kB/s)
[linux-jdk8] [INFO] Downloading from central: https://repo.maven.apache.org/maven2/com/puppycrawl/tools/checkstyle/6.18/checkstyle-6.18.pom
[linux-jdk8] [INFO] Downloaded from central: https://repo.maven.apache.org/maven2/com/puppycrawl/tools/checkstyle/6.18/checkstyle-6.18.pom (71 kB at 3.1 MB/s)
[linux-jdk8] [INFO] Downloading from central: https://repo.maven.apache.org/maven2/antlr/antlr/2.7.7/antlr-2.7.7.pom
[linux-jdk8] [INFO] Downloaded from central: https://repo.maven.apache.org/maven2/antlr/antlr/2.7.7/antlr-2.7.7.pom (632 B at 53 kB/s)
[linux-jdk8] [INFO] Downloading from central: https://repo.maven.apache.org/maven2/org/antlr/antlr4-runtime/4.5.3/antlr4-runtime-4.5.3.pom
[linux-jdk8] [INFO] Downloaded from central: https://repo.maven.apache.org/maven2/org/antlr/antlr4-runtime/4.5.3/antlr4-runtime-4.5.3.pom (2.3 kB at 178 kB/s)
[linux-jdk8] [INFO] Downloading from central: https://repo.maven.apache.org/maven2/org/antlr/antlr4-master/4.5.3/antlr4-master-4.5.3.pom
[linux-jdk8] [INFO] Downloaded from central: https://repo.maven.apache.org/maven2/org/antlr/antlr4-master/4.5.3/antlr4-master-4.5.3.pom (3.7 kB at 307 kB/s)
[linux-jdk8] [INFO] Downloading from central: https://repo.maven.apache.org/maven2/commons-beanutils/commons-beanutils/1.9.2/commons-beanutils-1.9.2.pom
[linux-jdk8] [INFO] Downloaded from central: https://repo.maven.apache.org/maven2/commons-beanutils/commons-beanutils/1.9.2/commons-beanutils-1.9.2.pom (14 kB at 795 kB/s)
[linux-jdk8] [INFO] Downloading from central: https://repo.maven.apache.org/maven2/org/apache/commons/commons-parent/33/commons-parent-33.pom
[linux-jdk8] [INFO] Downloaded from central: https://repo.maven.apache.org/maven2/org/apache/commons/commons-parent/33/commons-parent-33.pom (53 kB at 2.8 MB/s)
[linux-jdk8] [INFO] Downloading from central: https://repo.maven.apache.org/maven2/commons-cli/commons-cli/1.3.1/commons-cli-1.3.1.pom
[linux-jdk8] [INFO] Downloaded from central: https://repo.maven.apache.org/maven2/commons-cli/commons-cli/1.3.1/commons-cli-1.3.1.pom (10 kB at 799 kB/s)
[linux-jdk8] [INFO] Downloading from central: https://repo.maven.apache.org/maven2/com/google/guava/guava/19.0/guava-19.0.pom
[linux-jdk8] [INFO] Downloaded from central: https://repo.maven.apache.org/maven2/com/google/guava/guava/19.0/guava-19.0.pom (6.8 kB at 424 kB/s)
[linux-jdk8] [INFO] Downloading from central: https://repo.maven.apache.org/maven2/com/google/guava/guava-parent/19.0/guava-parent-19.0.pom
[linux-jdk8] [INFO] Downloaded from central: https://repo.maven.apache.org/maven2/com/google/guava/guava-parent/19.0/guava-parent-19.0.pom (9.9 kB at 898 kB/s)
[linux-jdk8] [INFO] Downloading from central: https://repo.maven.apache.org/maven2/org/sonatype/oss/oss-parent/7/oss-parent-7.pom
[linux-jdk8] [INFO] Downloaded from central: https://repo.maven.apache.org/maven2/org/sonatype/oss/oss-parent/7/oss-parent-7.pom (4.8 kB at 439 kB/s)
[linux-jdk8] [INFO] Downloading from central: https://repo.maven.apache.org/maven2/org/apache/maven/shared/maven-shared-resources/2/maven-shared-resources-2.jar
[linux-jdk8] [INFO] Downloading from central: https://repo.maven.apache.org/maven2/org/apache/maven/doxia/doxia-core/1.2/doxia-core-1.2.jar
[linux-jdk8] [INFO] Downloading from central: https://repo.maven.apache.org/maven2/commons-digester/commons-digester/1.6/commons-digester-1.6.jar
[linux-jdk8] [INFO] Downloading from central: https://repo.maven.apache.org/maven2/commons-logging/commons-logging/1.0.4/commons-logging-1.0.4.jar
[linux-jdk8] [INFO] Downloading from central: https://repo.maven.apache.org/maven2/org/apache/maven/doxia/doxia-integration-tools/1.6/doxia-integration-tools-1.6.jar
[linux-jdk8] [INFO] Downloaded from central: https://repo.maven.apache.org/maven2/org/apache/maven/shared/maven-shared-resources/2/maven-shared-resources-2.jar (13 kB at 687 kB/s)
[linux-jdk8] [INFO] Downloading from central: https://repo.maven.apache.org/maven2/commons-io/commons-io/1.4/commons-io-1.4.jar
[linux-jdk8] [INFO] Downloaded from central: https://repo.maven.apache.org/maven2/commons-logging/commons-logging/1.0.4/commons-logging-1.0.4.jar (38 kB at 1.8 MB/s)
[linux-jdk8] [INFO] Downloading from central: https://repo.maven.apache.org/maven2/org/codehaus/plexus/plexus-resources/1.1.0/plexus-resources-1.1.0.jar
[linux-jdk8] [INFO] Downloaded from central: https://repo.maven.apache.org/maven2/org/apache/maven/doxia/doxia-integration-tools/1.6/doxia-integration-tools-1.6.jar (45 kB at 1.9 MB/s)
[linux-jdk8] [INFO] Downloading from central: https://repo.maven.apache.org/maven2/com/puppycrawl/tools/checkstyle/6.18/checkstyle-6.18.jar
[linux-jdk8] [INFO] Downloaded from central: https://repo.maven.apache.org/maven2/commons-digester/commons-digester/1.6/commons-digester-1.6.jar (168 kB at 5.6 MB/s)
[linux-jdk8] [INFO] Downloading from central: https://repo.maven.apache.org/maven2/antlr/antlr/2.7.7/antlr-2.7.7.jar
[linux-jdk8] [INFO] Downloaded from central: https://repo.maven.apache.org/maven2/org/apache/maven/doxia/doxia-core/1.2/doxia-core-1.2.jar (154 kB at 4.5 MB/s)
[linux-jdk8] [INFO] Downloading from central: https://repo.maven.apache.org/maven2/org/antlr/antlr4-runtime/4.5.3/antlr4-runtime-4.5.3.jar
[linux-jdk8] [INFO] Downloaded from central: https://repo.maven.apache.org/maven2/org/codehaus/plexus/plexus-resources/1.1.0/plexus-resources-1.1.0.jar (23 kB at 725 kB/s)
[linux-jdk8] [INFO] Downloading from central: https://repo.maven.apache.org/maven2/commons-beanutils/commons-beanutils/1.9.2/commons-beanutils-1.9.2.jar
[linux-jdk8] [INFO] Downloaded from central: https://repo.maven.apache.org/maven2/commons-io/commons-io/1.4/commons-io-1.4.jar (109 kB at 3.4 MB/s)
[linux-jdk8] [INFO] Downloading from central: https://repo.maven.apache.org/maven2/commons-cli/commons-cli/1.3.1/commons-cli-1.3.1.jar
[linux-jdk8] [INFO] Downloaded from central: https://repo.maven.apache.org/maven2/commons-cli/commons-cli/1.3.1/commons-cli-1.3.1.jar (53 kB at 1.1 MB/s)
[linux-jdk8] [INFO] Downloading from central: https://repo.maven.apache.org/maven2/com/google/guava/guava/19.0/guava-19.0.jar
[linux-jdk8] [INFO] Downloaded from central: https://repo.maven.apache.org/maven2/org/antlr/antlr4-runtime/4.5.3/antlr4-runtime-4.5.3.jar (302 kB at 4.3 MB/s)
[linux-jdk8] [INFO] Downloading from central: https://repo.maven.apache.org/maven2/commons-lang/commons-lang/2.1/commons-lang-2.1.jar
[linux-jdk8] [INFO] Downloaded from central: https://repo.maven.apache.org/maven2/antlr/antlr/2.7.7/antlr-2.7.7.jar (445 kB at 6.1 MB/s)
[linux-jdk8] [INFO] Downloaded from central: https://repo.maven.apache.org/maven2/commons-beanutils/commons-beanutils/1.9.2/commons-beanutils-1.9.2.jar (234 kB at 3.2 MB/s)
[linux-jdk8] [INFO] Downloaded from central: https://repo.maven.apache.org/maven2/commons-lang/commons-lang/2.1/commons-lang-2.1.jar (208 kB at 2.2 MB/s)
[linux-jdk8] [INFO] Downloaded from central: https://repo.maven.apache.org/maven2/com/puppycrawl/tools/checkstyle/6.18/checkstyle-6.18.jar (1.2 MB at 9.6 MB/s)
[linux-jdk8] [INFO] Downloaded from central: https://repo.maven.apache.org/maven2/com/google/guava/guava/19.0/guava-19.0.jar (2.3 MB at 11 MB/s)
[linux-jdk8] [INFO] There is 1 error reported by Checkstyle 6.18 with config/maven_checks.xml ruleset.
[linux-jdk8] [INFO] Ignored 1 error, 0 violation remaining.
[linux-jdk8] [INFO]
[linux-jdk8] [INFO] --- maven-invoker-plugin:3.0.1:verify (integration-test) @ maven-compiler-plugin ---
[linux-jdk8] [INFO] -------------------------------------------------
[linux-jdk8] [INFO] Build Summary:
[linux-jdk8] [INFO] Passed: 27, Failed: 0, Errors: 0, Skipped: 16
[linux-jdk8] [INFO] -------------------------------------------------
[linux-jdk8] [INFO] ------------------------------------------------------------------------
[linux-jdk8] [INFO] BUILD SUCCESS
[linux-jdk8] [INFO] ------------------------------------------------------------------------
[linux-jdk8] [INFO] Total time: 03:34 min
[linux-jdk8] [INFO] Finished at: 2018-04-10T17:36:05Z
[linux-jdk8] [INFO] Final Memory: 65M/2399M
[linux-jdk8] [INFO] ------------------------------------------------------------------------
[linux-jdk8] [INFO] [jenkins-event-spy] Generated /home/jenkins/jenkins-slave/workspace/n_TEST_TO_FIX_MCOMPILER-192-EJZ35UAEPCX3IH57D2YA4NCSBBIRCVCD4L4Y7IFGSVZP6VXNNVFA@tmp/withMaven84d11757/maven-spy-20180410-173230-6501375920851494493793.log
[Pipeline] [linux-jdk8] }
[Pipeline] [linux-jdk8] // dir
[Pipeline] [linux-jdk8] }
[linux-jdk8] [withMaven] junitPublisher - Archive test results for Maven artifact org.apache.maven.plugins:maven-compiler-plugin:3.7.1-SNAPSHOT generated by maven-surefire-plugin:test (default-test): m/target/surefire-reports/*.xml
[linux-jdk8] [withMaven] junitPublisher - Jenkins JUnit Attachments Plugin not found, can't publish test attachments.Recording test results
[Pipeline] [linux-jdk8] // withMaven
[Pipeline] [linux-jdk8] }
[Pipeline] [linux-jdk8] // stage
[Pipeline] [linux-jdk8] }
[Pipeline] [linux-jdk8] // node
[Pipeline] [linux-jdk8] }
[linux-jdk9] [INFO] run post-build script verify.groovy
[linux-jdk9] [INFO] mcompiler-182/pom.xml ............................ SUCCESS (12.7 s)
[linux-jdk9] [INFO] Building: automodules-application/pom.xml
[linux-jdk9] [INFO] run post-build script verify.groovy
[linux-jdk9] [INFO] automodules-application/pom.xml .................. SUCCESS (3.6 s)
[linux-jdk9] [INFO] Building: MCOMPILER-157/pom.xml
[linux-jdk9] [INFO] MCOMPILER-157/pom.xml ............................ SUCCESS (6.6 s)
[linux-jdk9] [INFO] Building: error-prone-compiler/pom.xml
[linux-jdk9] [INFO] run post-build script verify.groovy
[linux-jdk9] [INFO] error-prone-compiler/pom.xml ..................... SUCCESS (6.3 s)
[linux-jdk9] [INFO] Building: mcompiler-179/pom.xml
[linux-jdk9] [INFO] run post-build script verify.groovy
[linux-jdk9] [INFO] mcompiler-179/pom.xml ............................ SUCCESS (3.3 s)
[linux-jdk9] [INFO] Building: jpms_add-exports/pom.xml
[linux-jdk9] [INFO] run post-build script verify.groovy
[linux-jdk9] [INFO] jpms_add-exports/pom.xml ......................... SUCCESS (3.7 s)
[linux-jdk9] [INFO] Building: test1/pom.xml
[linux-jdk9] [INFO] test1/pom.xml .................................... SUCCESS (4.0 s)
[linux-jdk9] [INFO] Building: groovy-project-with-new-plexus-compiler/pom.xml
[linux-jdk9] [INFO] groovy-project-with-new-plexus-compiler/pom.xml .. SKIPPED due to JRE version
[linux-jdk9] [INFO] Building: MCOMPILER-275_separate-moduleinfo/pom.xml
[linux-jdk9] [INFO] run post-build script verify.groovy
[linux-jdk9] [INFO] MCOMPILER-275_separate-moduleinfo/pom.xml ........ SUCCESS (3.8 s)
[linux-jdk9] [INFO] Building: MCOMPILER-203-processorpath/pom.xml
[linux-jdk9] [INFO] MCOMPILER-203-processorpath/pom.xml .............. SUCCESS (9.2 s)
[linux-jdk9] [INFO] Building: mcompiler-106/pom.xml
[linux-jdk9] [INFO] mcompiler-106/pom.xml ............................ SUCCESS (4.4 s)
[linux-jdk9] [INFO] Building: mcompiler-21_methodname-change/pom.xml
[linux-jdk9] [INFO] run post-build script verify.groovy
[linux-jdk9] [INFO] mcompiler-21_methodname-change/pom.xml ........... SUCCESS (11.1 s)
[linux-jdk9] [INFO] Building: MCOMPILER-192/pom.xml
[linux-jdk9] [INFO] run post-build script verify.groovy
[linux-jdk9] [INFO] MCOMPILER-192/pom.xml ............................ SUCCESS (3.7 s)
[linux-jdk9] [INFO] Building: MCOMPILER-224/pom.xml
[linux-jdk9] [INFO] run post-build script verify.groovy
[linux-jdk9] [INFO] MCOMPILER-224/pom.xml ............................ SUCCESS (3.7 s)
[linux-jdk9] [INFO] Building: MCOMPILER-268_modulepath/pom.xml
[linux-jdk9] [INFO] run post-build script verify.groovy
[linux-jdk9] [INFO] MCOMPILER-268_modulepath/pom.xml ................. SUCCESS (5.1 s)
[linux-jdk9] [INFO] Building: MCOMPILER-190/pom.xml
[linux-jdk9] [INFO] MCOMPILER-190/pom.xml ............................ SUCCESS (4.3 s)
[linux-jdk9] [INFO] Building: MCOMPILER-260_customArguments/pom.xml
[linux-jdk9] [INFO] MCOMPILER-260_customArguments/pom.xml ............ SUCCESS (3.4 s)
[linux-jdk9] [INFO] Building: MCOMPILER-170/pom.xml
[linux-jdk9] [INFO] MCOMPILER-170/pom.xml ............................ SUCCESS (3.7 s)
[linux-jdk9] [INFO] Building: jpms_patch-module/pom.xml
[linux-jdk9] [INFO] run post-build script verify.groovy
[linux-jdk9] [INFO] jpms_patch-module/pom.xml ........................ SUCCESS (4.8 s)
[linux-jdk9] [INFO] Building: includes-excludes/pom.xml
[linux-jdk9] [INFO] run post-build script verify.bsh
[linux-jdk9] [INFO] includes-excludes/pom.xml ........................ SUCCESS (4.7 s)
[linux-jdk9] [INFO] Building: mcompiler-21_class-remove/pom.xml
[linux-jdk9] [INFO] run post-build script verify.groovy
[linux-jdk9] [INFO] mcompiler-21_class-remove/pom.xml ................ SUCCESS (10.9 s)
[linux-jdk9] [INFO] Building: MCOMPILER-270_release/pom.xml
[linux-jdk9] [INFO] run post-build script verify.groovy
[linux-jdk9] [INFO] MCOMPILER-270_release/pom.xml .................... SUCCESS (3.7 s)
[linux-jdk9] [INFO] Building: non-english-warnings/pom.xml
[linux-jdk9] [INFO] run post-build script verify.bsh
[linux-jdk9] [INFO] non-english-warnings/pom.xml ..................... SUCCESS (3.6 s)
[linux-jdk9] [INFO] Building: default-incremental-disable/pom.xml
[linux-jdk9] [INFO] run post-build script verify.groovy
[linux-jdk9] [INFO] default-incremental-disable/pom.xml .............. SUCCESS (6.7 s)
[linux-jdk9] [INFO] Building: automodules-transitive-module/pom.xml
[linux-jdk9] [INFO] run post-build script verify.groovy
[linux-jdk9] [INFO] automodules-transitive-module/pom.xml ............ SUCCESS (3.9 s)
[linux-jdk9] [INFO] Building: MCOMPILER-322_release10/pom.xml
[linux-jdk9] [INFO] MCOMPILER-322_release10/pom.xml .................. SKIPPED due to JRE version
[linux-jdk9] [INFO] Building: MCOMPILER-294/pom.xml
[linux-jdk9] [INFO] MCOMPILER-294/pom.xml ............................ SUCCESS (3.8 s)
[linux-jdk9] [INFO] Building: mcompiler-135/pom.xml
[linux-jdk9] [INFO] mcompiler-135/pom.xml ............................ SUCCESS (3.9 s)
[linux-jdk9] [INFO]
[linux-jdk9] [INFO] --- maven-checkstyle-plugin:3.0.0:check (checkstyle-check) @ maven-compiler-plugin ---
[linux-jdk9] [INFO] Downloading from central: https://repo.maven.apache.org/maven2/javax/xml/bind/jaxb-api/2.3.0/jaxb-api-2.3.0.pom
[linux-jdk9] [INFO] Downloaded from central: https://repo.maven.apache.org/maven2/javax/xml/bind/jaxb-api/2.3.0/jaxb-api-2.3.0.pom (23 kB at 742 kB/s)
[linux-jdk9] [INFO] Downloading from central: https://repo.maven.apache.org/maven2/javax/xml/bind/jaxb-api-parent/2.3.0/jaxb-api-parent-2.3.0.pom
[linux-jdk9] [INFO] Downloaded from central: https://repo.maven.apache.org/maven2/javax/xml/bind/jaxb-api-parent/2.3.0/jaxb-api-parent-2.3.0.pom (5.6 kB at 332 kB/s)
[linux-jdk9] [INFO] Downloading from central: https://repo.maven.apache.org/maven2/net/java/jvnet-parent/5/jvnet-parent-5.pom
[linux-jdk9] [INFO] Downloaded from central: https://repo.maven.apache.org/maven2/net/java/jvnet-parent/5/jvnet-parent-5.pom (8.9 kB at 521 kB/s)
[linux-jdk9] [INFO] Downloading from central: https://repo.maven.apache.org/maven2/javax/xml/bind/jaxb-api/2.3.0/jaxb-api-2.3.0.jar
[linux-jdk9] [INFO] Downloaded from central: https://repo.maven.apache.org/maven2/javax/xml/bind/jaxb-api/2.3.0/jaxb-api-2.3.0.jar (126 kB at 4.5 MB/s)
[linux-jdk9] [INFO] There is 1 error reported by Checkstyle 6.18 with config/maven_checks.xml ruleset.
[linux-jdk9] [INFO] Ignored 1 error, 0 violation remaining.
[linux-jdk9] [INFO]
[linux-jdk9] [INFO] --- maven-invoker-plugin:3.0.1:verify (integration-test) @ maven-compiler-plugin ---
[linux-jdk9] [INFO] -------------------------------------------------
[linux-jdk9] [INFO] Build Summary:
[linux-jdk9] [INFO] Passed: 39, Failed: 1, Errors: 0, Skipped: 3
[linux-jdk9] [INFO] -------------------------------------------------
[linux-jdk9] [ERROR] The following builds failed:
[linux-jdk9] [ERROR] * setup_module-transitive/pom.xml
[linux-jdk9] [INFO] -------------------------------------------------
[linux-jdk9] [INFO] ------------------------------------------------------------------------
[linux-jdk9] [INFO] BUILD FAILURE
[linux-jdk9] [INFO] ------------------------------------------------------------------------
[linux-jdk9] [INFO] Total time: 03:42 min
[linux-jdk9] [INFO] Finished at: 2018-04-10T17:38:18Z
[linux-jdk9] [INFO] Final Memory: 62M/204M
[linux-jdk9] [INFO] ------------------------------------------------------------------------
[linux-jdk9] [INFO] [jenkins-event-spy] Generated /home/jenkins/jenkins-slave/workspace/n_TEST_TO_FIX_MCOMPILER-192-EJZ35UAEPCX3IH57D2YA4NCSBBIRCVCD4L4Y7IFGSVZP6VXNNVFA@tmp/withMavenffbc3ec7/maven-spy-20180410-173436-1632788777182944076569.log
[linux-jdk9] [ERROR] Failed to execute goal org.apache.maven.plugins:maven-invoker-plugin:3.0.1:verify (integration-test) on project maven-compiler-plugin: 1 build failed. See console output above for details. -> [Help 1]
[linux-jdk9] [ERROR]
[linux-jdk9] [ERROR] To see the full stack trace of the errors, re-run Maven with the -e switch.
[linux-jdk9] [ERROR] Re-run Maven using the -X switch to enable full debug logging.
[linux-jdk9] [ERROR]
[linux-jdk9] [ERROR] For more information about the errors and possible solutions, please read the following articles:
[linux-jdk9] [ERROR] [Help 1] http://cwiki.apache.org/confluence/display/MAVEN/MojoFailureException
[Pipeline] [linux-jdk9] }
[Pipeline] [linux-jdk9] // dir
[Pipeline] [linux-jdk9] }
[linux-jdk9] [withMaven] junitPublisher - Archive test results for Maven artifact org.apache.maven.plugins:maven-compiler-plugin:3.7.1-SNAPSHOT generated by maven-surefire-plugin:test (default-test): m/target/surefire-reports/*.xml
[linux-jdk9] [withMaven] junitPublisher - Jenkins JUnit Attachments Plugin not found, can't publish test attachments.Recording test results
[Pipeline] [linux-jdk9] // withMaven
[Pipeline] [linux-jdk9] }
[Pipeline] [linux-jdk9] // stage
[Pipeline] [linux-jdk9] }
[Pipeline] [linux-jdk9] // node
[Pipeline] [linux-jdk9] }
[linux-jdk9] Failed in branch linux-jdk9
[Pipeline] // parallel
[Pipeline] stage
[Pipeline] { (Notifications)
[Pipeline] echo
Build result: FAILURE
[Pipeline] jiraIssueSelector
[Pipeline] emailext
Build succeeded in Jenkins: Maven TLP » maven-compiler-plugin » TEST_TO_FIX_MCOMPILER-192 #31
Posted by Apache Jenkins Server <je...@builds.apache.org>.
See https://builds.apache.org/job/maven-box/job/maven-compiler-plugin/job/TEST_TO_FIX_MCOMPILER-192/31/
No changes.
All tests passed