You are viewing a plain text version of this content. The canonical link for it is here.
Posted to dev@kafka.apache.org by Apache Jenkins Server <je...@builds.apache.org> on 2016/09/18 20:13:38 UTC

Build failed in Jenkins: kafka-trunk-jdk8 #893

See <https://builds.apache.org/job/kafka-trunk-jdk8/893/changes>

Changes:

[jason] KAFKA-2063; Bound fetch response size (KIP-74)

------------------------------------------
[...truncated 3055 lines...]
kafka.log.CleanerTest > testCleanSegments STARTED

kafka.log.CleanerTest > testCleanSegments PASSED

kafka.log.CleanerTest > testLogToCleanWithUncleanableSection STARTED

kafka.log.CleanerTest > testLogToCleanWithUncleanableSection PASSED

kafka.log.CleanerTest > testBuildPartialOffsetMap STARTED

kafka.log.CleanerTest > testBuildPartialOffsetMap PASSED

kafka.log.CleanerTest > testCleaningWithUnkeyedMessages STARTED

kafka.log.CleanerTest > testCleaningWithUnkeyedMessages PASSED

kafka.log.CleanerTest > testPartialSegmentClean STARTED

kafka.log.CleanerTest > testPartialSegmentClean PASSED

kafka.log.OffsetIndexTest > lookupExtremeCases STARTED

kafka.log.OffsetIndexTest > lookupExtremeCases PASSED

kafka.log.OffsetIndexTest > appendTooMany STARTED

kafka.log.OffsetIndexTest > appendTooMany PASSED

kafka.log.OffsetIndexTest > randomLookupTest STARTED

kafka.log.OffsetIndexTest > randomLookupTest PASSED

kafka.log.OffsetIndexTest > testReopen STARTED

kafka.log.OffsetIndexTest > testReopen PASSED

kafka.log.OffsetIndexTest > appendOutOfOrder STARTED

kafka.log.OffsetIndexTest > appendOutOfOrder PASSED

kafka.log.OffsetIndexTest > truncate STARTED

kafka.log.OffsetIndexTest > truncate PASSED

kafka.log.LogCleanerManagerTest > testCleanableOffsetsForNone STARTED

kafka.log.LogCleanerManagerTest > testCleanableOffsetsForNone PASSED

kafka.log.LogCleanerManagerTest > testCleanableOffsetsForTime STARTED

kafka.log.LogCleanerManagerTest > testCleanableOffsetsForTime PASSED

kafka.log.LogCleanerManagerTest > testLogsWithSegmentsToDeleteShouldConsiderCleanupPolicyCompactDeleteLogs STARTED

kafka.log.LogCleanerManagerTest > testLogsWithSegmentsToDeleteShouldConsiderCleanupPolicyCompactDeleteLogs PASSED

kafka.log.LogCleanerManagerTest > testLogsWithSegmentsToDeleteShouldNotConsiderCleanupPolicyCompactLogs STARTED

kafka.log.LogCleanerManagerTest > testLogsWithSegmentsToDeleteShouldNotConsiderCleanupPolicyCompactLogs PASSED

kafka.log.LogCleanerManagerTest > testLogsWithSegmentsToDeleteShouldNotConsiderCleanupPolicyDeleteLogs STARTED

kafka.log.LogCleanerManagerTest > testLogsWithSegmentsToDeleteShouldNotConsiderCleanupPolicyDeleteLogs PASSED

kafka.log.LogCleanerManagerTest > testCleanableOffsetsForShortTime STARTED

kafka.log.LogCleanerManagerTest > testCleanableOffsetsForShortTime PASSED

kafka.log.LogConfigTest > shouldValidateThrottledReplicasConfig STARTED

kafka.log.LogConfigTest > shouldValidateThrottledReplicasConfig PASSED

kafka.log.LogConfigTest > testFromPropsEmpty STARTED

kafka.log.LogConfigTest > testFromPropsEmpty PASSED

kafka.log.LogConfigTest > testKafkaConfigToProps STARTED

kafka.log.LogConfigTest > testKafkaConfigToProps PASSED

kafka.log.LogConfigTest > testFromPropsInvalid STARTED

kafka.log.LogConfigTest > testFromPropsInvalid PASSED

kafka.log.OffsetMapTest > testClear STARTED

kafka.log.OffsetMapTest > testClear PASSED

kafka.log.OffsetMapTest > testGetWhenFull STARTED

kafka.log.OffsetMapTest > testGetWhenFull PASSED

kafka.log.OffsetMapTest > testBasicValidation STARTED

kafka.log.OffsetMapTest > testBasicValidation PASSED

kafka.log.LogCleanerIntegrationTest > testCleansCombinedCompactAndDeleteTopic[0] STARTED

kafka.log.LogCleanerIntegrationTest > testCleansCombinedCompactAndDeleteTopic[0] PASSED

kafka.log.LogCleanerIntegrationTest > cleanerTest[0] STARTED

kafka.log.LogCleanerIntegrationTest > cleanerTest[0] PASSED

kafka.log.LogCleanerIntegrationTest > testCleanerWithMessageFormatV0[0] STARTED

kafka.log.LogCleanerIntegrationTest > testCleanerWithMessageFormatV0[0] PASSED

kafka.log.LogCleanerIntegrationTest > testCleansCombinedCompactAndDeleteTopic[1] STARTED

kafka.log.LogCleanerIntegrationTest > testCleansCombinedCompactAndDeleteTopic[1] PASSED

kafka.log.LogCleanerIntegrationTest > cleanerTest[1] STARTED

kafka.log.LogCleanerIntegrationTest > cleanerTest[1] PASSED

kafka.log.LogCleanerIntegrationTest > testCleanerWithMessageFormatV0[1] STARTED

kafka.log.LogCleanerIntegrationTest > testCleanerWithMessageFormatV0[1] PASSED

kafka.log.LogCleanerIntegrationTest > testCleansCombinedCompactAndDeleteTopic[2] STARTED

kafka.log.LogCleanerIntegrationTest > testCleansCombinedCompactAndDeleteTopic[2] PASSED

kafka.log.LogCleanerIntegrationTest > cleanerTest[2] STARTED

kafka.log.LogCleanerIntegrationTest > cleanerTest[2] PASSED

kafka.log.LogCleanerIntegrationTest > testCleanerWithMessageFormatV0[2] STARTED

kafka.log.LogCleanerIntegrationTest > testCleanerWithMessageFormatV0[2] PASSED

kafka.log.LogCleanerIntegrationTest > testCleansCombinedCompactAndDeleteTopic[3] STARTED

kafka.log.LogCleanerIntegrationTest > testCleansCombinedCompactAndDeleteTopic[3] PASSED

kafka.log.LogCleanerIntegrationTest > cleanerTest[3] STARTED

kafka.log.LogCleanerIntegrationTest > cleanerTest[3] PASSED

kafka.log.LogCleanerIntegrationTest > testCleanerWithMessageFormatV0[3] STARTED

kafka.log.LogCleanerIntegrationTest > testCleanerWithMessageFormatV0[3] PASSED

kafka.log.TimeIndexTest > testTruncate STARTED

kafka.log.TimeIndexTest > testTruncate PASSED

kafka.log.TimeIndexTest > testAppend STARTED

kafka.log.TimeIndexTest > testAppend PASSED

kafka.log.TimeIndexTest > testLookUp STARTED

kafka.log.TimeIndexTest > testLookUp PASSED

kafka.log.LogCleanerLagIntegrationTest > cleanerTest[0] STARTED

kafka.log.LogCleanerLagIntegrationTest > cleanerTest[0] PASSED

kafka.log.LogCleanerLagIntegrationTest > cleanerTest[1] STARTED

kafka.log.LogCleanerLagIntegrationTest > cleanerTest[1] PASSED

kafka.log.LogCleanerLagIntegrationTest > cleanerTest[2] STARTED

kafka.log.LogCleanerLagIntegrationTest > cleanerTest[2] PASSED

kafka.log.LogCleanerLagIntegrationTest > cleanerTest[3] STARTED

kafka.log.LogCleanerLagIntegrationTest > cleanerTest[3] PASSED

kafka.log.LogTest > testParseTopicPartitionNameForMissingTopic STARTED

kafka.log.LogTest > testParseTopicPartitionNameForMissingTopic PASSED

kafka.log.LogTest > shouldNotDeleteTimeBasedSegmentsWhenNoneReadyToBeDeleted STARTED

kafka.log.LogTest > shouldNotDeleteTimeBasedSegmentsWhenNoneReadyToBeDeleted PASSED

kafka.log.LogTest > testReadWithMinMessage STARTED

kafka.log.LogTest > testReadWithMinMessage PASSED

kafka.log.LogTest > testIndexRebuild STARTED
ERROR: Could not install GRADLE_2_4_RC_2_HOME
java.lang.NullPointerException
Build timed out (after 180 minutes). Marking the build as failed.
Build was aborted
Recording test results

kafka.log.LogTest > testIndexRebuild PASSED

kafka.log.LogTest > testLogRolls STARTED

kafka.log.LogTest > testLogRolls PASSED

kafka.log.LogTest > testMessageSizeCheck STARTED

kafka.log.LogTest > testMessageSizeCheck PASSED

kafka.log.LogTest > testAsyncDelete STARTED

kafka.log.LogTest > testAsyncDelete PASSED

kafka.log.LogTest > shouldNotDeleteSegmentsWhenPolicyDoesNotIncludeDelete STARTED

kafka.log.LogTest > shouldNotDeleteSegmentsWhenPolicyDoesNotIncludeDelete PASSED

kafka.log.LogTest > testReadOutOfRange STARTED

kafka.log.LogTest > testReadOutOfRange PASSED

kafka.log.LogTest > testAppendWithOutOfOrderOffsetsThrowsException STARTED

kafka.log.LogTest > testAppendWithOutOfOrderOffsetsThrowsException PASSED

kafka.log.LogTest > shouldDeleteSegmentsReadyToBeDeletedWhenCleanupPolicyIsCompactAndDelete STARTED

kafka.log.LogTest > shouldDeleteSegmentsReadyToBeDeletedWhenCleanupPolicyIsCompactAndDelete PASSED

kafka.log.LogTest > testReadAtLogGap STARTED

kafka.log.LogTest > testReadAtLogGap PASSED

kafka.log.LogTest > testTimeBasedLogRoll STARTED

kafka.log.LogTest > testTimeBasedLogRoll PASSED

kafka.log.LogTest > testLoadEmptyLog STARTED

kafka.log.LogTest > testLoadEmptyLog PASSED

kafka.log.LogTest > testMessageSetSizeCheck STARTED

kafka.log.LogTest > testMessageSetSizeCheck PASSED

kafka.log.LogTest > testIndexResizingAtTruncation STARTED

kafka.log.LogTest > testIndexResizingAtTruncation PASSED

kafka.log.LogTest > testCompactedTopicConstraints STARTED

kafka.log.LogTest > testCompactedTopicConstraints PASSED

kafka.log.LogTest > testThatGarbageCollectingSegmentsDoesntChangeOffset STARTED
Setting GRADLE_2_4_RC_2_HOME=/home/jenkins/jenkins-slave/tools/hudson.plugins.gradle.GradleInstallation/Gradle_2.4-rc-2
ERROR: Step ?Publish JUnit test result report? failed: No test report files were found. Configuration error?
Setting GRADLE_2_4_RC_2_HOME=/home/jenkins/jenkins-slave/tools/hudson.plugins.gradle.GradleInstallation/Gradle_2.4-rc-2

Jenkins build is back to normal : kafka-trunk-jdk8 #898

Posted by Apache Jenkins Server <je...@builds.apache.org>.
See <https://builds.apache.org/job/kafka-trunk-jdk8/898/changes>


Build failed in Jenkins: kafka-trunk-jdk8 #897

Posted by Apache Jenkins Server <je...@builds.apache.org>.
See <https://builds.apache.org/job/kafka-trunk-jdk8/897/changes>

Changes:

[jason] KAFKA-4135; Consumer poll with no subscription or assignment should

[wangguoz] KAFKA-4153: Fix incorrect KStream-KStream join behavior with asymmetric

------------------------------------------
[...truncated 3558 lines...]

kafka.network.SocketServerTest > tooBigRequestIsRejected STARTED

kafka.network.SocketServerTest > tooBigRequestIsRejected PASSED

kafka.integration.SaslSslTopicMetadataTest > testIsrAfterBrokerShutDownAndJoinsBack STARTED

kafka.integration.SaslSslTopicMetadataTest > testIsrAfterBrokerShutDownAndJoinsBack PASSED

kafka.integration.SaslSslTopicMetadataTest > testAutoCreateTopicWithCollision STARTED

kafka.integration.SaslSslTopicMetadataTest > testAutoCreateTopicWithCollision PASSED

kafka.integration.SaslSslTopicMetadataTest > testAliveBrokerListWithNoTopics STARTED

kafka.integration.SaslSslTopicMetadataTest > testAliveBrokerListWithNoTopics PASSED

kafka.integration.SaslSslTopicMetadataTest > testAutoCreateTopic STARTED

kafka.integration.SaslSslTopicMetadataTest > testAutoCreateTopic PASSED

kafka.integration.SaslSslTopicMetadataTest > testGetAllTopicMetadata STARTED

kafka.integration.SaslSslTopicMetadataTest > testGetAllTopicMetadata PASSED

kafka.integration.SaslSslTopicMetadataTest > testAliveBrokersListWithNoTopicsAfterNewBrokerStartup STARTED

kafka.integration.SaslSslTopicMetadataTest > testAliveBrokersListWithNoTopicsAfterNewBrokerStartup PASSED

kafka.integration.SaslSslTopicMetadataTest > testBasicTopicMetadata STARTED

kafka.integration.SaslSslTopicMetadataTest > testBasicTopicMetadata PASSED

kafka.integration.SaslSslTopicMetadataTest > testAutoCreateTopicWithInvalidReplication STARTED

kafka.integration.SaslSslTopicMetadataTest > testAutoCreateTopicWithInvalidReplication PASSED

kafka.integration.SaslSslTopicMetadataTest > testAliveBrokersListWithNoTopicsAfterABrokerShutdown STARTED

kafka.integration.SaslSslTopicMetadataTest > testAliveBrokersListWithNoTopicsAfterABrokerShutdown PASSED

kafka.integration.PrimitiveApiTest > testMultiProduce STARTED

kafka.integration.PrimitiveApiTest > testMultiProduce PASSED

kafka.integration.PrimitiveApiTest > testDefaultEncoderProducerAndFetch STARTED

kafka.integration.PrimitiveApiTest > testDefaultEncoderProducerAndFetch PASSED

kafka.integration.PrimitiveApiTest > testFetchRequestCanProperlySerialize STARTED

kafka.integration.PrimitiveApiTest > testFetchRequestCanProperlySerialize PASSED

kafka.integration.PrimitiveApiTest > testPipelinedProduceRequests STARTED

kafka.integration.PrimitiveApiTest > testPipelinedProduceRequests PASSED

kafka.integration.PrimitiveApiTest > testProduceAndMultiFetch STARTED

kafka.integration.PrimitiveApiTest > testProduceAndMultiFetch PASSED

kafka.integration.PrimitiveApiTest > testDefaultEncoderProducerAndFetchWithCompression STARTED

kafka.integration.PrimitiveApiTest > testDefaultEncoderProducerAndFetchWithCompression PASSED

kafka.integration.PrimitiveApiTest > testConsumerEmptyTopic STARTED

kafka.integration.PrimitiveApiTest > testConsumerEmptyTopic PASSED

kafka.integration.PrimitiveApiTest > testEmptyFetchRequest STARTED

kafka.integration.PrimitiveApiTest > testEmptyFetchRequest PASSED

kafka.integration.UncleanLeaderElectionTest > testUncleanLeaderElectionEnabled STARTED

kafka.integration.UncleanLeaderElectionTest > testUncleanLeaderElectionEnabled PASSED

kafka.integration.UncleanLeaderElectionTest > testCleanLeaderElectionDisabledByTopicOverride STARTED

kafka.integration.UncleanLeaderElectionTest > testCleanLeaderElectionDisabledByTopicOverride PASSED

kafka.integration.UncleanLeaderElectionTest > testUncleanLeaderElectionDisabled STARTED

kafka.integration.UncleanLeaderElectionTest > testUncleanLeaderElectionDisabled PASSED

kafka.integration.UncleanLeaderElectionTest > testUncleanLeaderElectionInvalidTopicOverride STARTED

kafka.integration.UncleanLeaderElectionTest > testUncleanLeaderElectionInvalidTopicOverride PASSED

kafka.integration.UncleanLeaderElectionTest > testUncleanLeaderElectionEnabledByTopicOverride STARTED

kafka.integration.UncleanLeaderElectionTest > testUncleanLeaderElectionEnabledByTopicOverride PASSED

kafka.integration.MinIsrConfigTest > testDefaultKafkaConfig STARTED

kafka.integration.MinIsrConfigTest > testDefaultKafkaConfig PASSED

kafka.integration.SaslPlaintextTopicMetadataTest > testIsrAfterBrokerShutDownAndJoinsBack STARTED

kafka.integration.SaslPlaintextTopicMetadataTest > testIsrAfterBrokerShutDownAndJoinsBack PASSED

kafka.integration.SaslPlaintextTopicMetadataTest > testAutoCreateTopicWithCollision STARTED

kafka.integration.SaslPlaintextTopicMetadataTest > testAutoCreateTopicWithCollision PASSED

kafka.integration.SaslPlaintextTopicMetadataTest > testAliveBrokerListWithNoTopics STARTED

kafka.integration.SaslPlaintextTopicMetadataTest > testAliveBrokerListWithNoTopics PASSED

kafka.integration.SaslPlaintextTopicMetadataTest > testAutoCreateTopic STARTED

kafka.integration.SaslPlaintextTopicMetadataTest > testAutoCreateTopic PASSED

kafka.integration.SaslPlaintextTopicMetadataTest > testGetAllTopicMetadata STARTED

kafka.integration.SaslPlaintextTopicMetadataTest > testGetAllTopicMetadata PASSED

kafka.integration.SaslPlaintextTopicMetadataTest > testAliveBrokersListWithNoTopicsAfterNewBrokerStartup STARTED

kafka.integration.SaslPlaintextTopicMetadataTest > testAliveBrokersListWithNoTopicsAfterNewBrokerStartup PASSED

kafka.integration.SaslPlaintextTopicMetadataTest > testBasicTopicMetadata STARTED

kafka.integration.SaslPlaintextTopicMetadataTest > testBasicTopicMetadata PASSED

kafka.integration.SaslPlaintextTopicMetadataTest > testAutoCreateTopicWithInvalidReplication STARTED

kafka.integration.SaslPlaintextTopicMetadataTest > testAutoCreateTopicWithInvalidReplication PASSED

kafka.integration.SaslPlaintextTopicMetadataTest > testAliveBrokersListWithNoTopicsAfterABrokerShutdown STARTED

kafka.integration.SaslPlaintextTopicMetadataTest > testAliveBrokersListWithNoTopicsAfterABrokerShutdown PASSED

kafka.integration.AutoOffsetResetTest > testResetToLatestWhenOffsetTooLow STARTED

kafka.integration.AutoOffsetResetTest > testResetToLatestWhenOffsetTooLow PASSED

kafka.integration.AutoOffsetResetTest > testResetToEarliestWhenOffsetTooLow STARTED

kafka.integration.AutoOffsetResetTest > testResetToEarliestWhenOffsetTooLow PASSED

kafka.integration.AutoOffsetResetTest > testResetToEarliestWhenOffsetTooHigh STARTED

kafka.integration.AutoOffsetResetTest > testResetToEarliestWhenOffsetTooHigh PASSED

kafka.integration.AutoOffsetResetTest > testResetToLatestWhenOffsetTooHigh STARTED

kafka.integration.AutoOffsetResetTest > testResetToLatestWhenOffsetTooHigh PASSED

kafka.integration.SslTopicMetadataTest > testIsrAfterBrokerShutDownAndJoinsBack STARTED

kafka.integration.SslTopicMetadataTest > testIsrAfterBrokerShutDownAndJoinsBack PASSED

kafka.integration.SslTopicMetadataTest > testAutoCreateTopicWithCollision STARTED

kafka.integration.SslTopicMetadataTest > testAutoCreateTopicWithCollision PASSED

kafka.integration.SslTopicMetadataTest > testAliveBrokerListWithNoTopics STARTED

kafka.integration.SslTopicMetadataTest > testAliveBrokerListWithNoTopics PASSED

kafka.integration.SslTopicMetadataTest > testAutoCreateTopic STARTED

kafka.integration.SslTopicMetadataTest > testAutoCreateTopic PASSED

kafka.integration.SslTopicMetadataTest > testGetAllTopicMetadata STARTED

kafka.integration.SslTopicMetadataTest > testGetAllTopicMetadata PASSED

kafka.integration.SslTopicMetadataTest > testAliveBrokersListWithNoTopicsAfterNewBrokerStartup STARTED

kafka.integration.SslTopicMetadataTest > testAliveBrokersListWithNoTopicsAfterNewBrokerStartup PASSED

kafka.integration.SslTopicMetadataTest > testBasicTopicMetadata STARTED

kafka.integration.SslTopicMetadataTest > testBasicTopicMetadata PASSED

kafka.integration.SslTopicMetadataTest > testAutoCreateTopicWithInvalidReplication STARTED

kafka.integration.SslTopicMetadataTest > testAutoCreateTopicWithInvalidReplication PASSED

kafka.integration.SslTopicMetadataTest > testAliveBrokersListWithNoTopicsAfterABrokerShutdown STARTED

kafka.integration.SslTopicMetadataTest > testAliveBrokersListWithNoTopicsAfterABrokerShutdown PASSED

kafka.integration.FetcherTest > testFetcher STARTED

kafka.integration.FetcherTest > testFetcher PASSED

kafka.integration.PlaintextTopicMetadataTest > testIsrAfterBrokerShutDownAndJoinsBack STARTED

kafka.integration.PlaintextTopicMetadataTest > testIsrAfterBrokerShutDownAndJoinsBack PASSED

kafka.integration.PlaintextTopicMetadataTest > testAutoCreateTopicWithCollision STARTED

kafka.integration.PlaintextTopicMetadataTest > testAutoCreateTopicWithCollision PASSED

kafka.integration.PlaintextTopicMetadataTest > testAliveBrokerListWithNoTopics STARTED

kafka.integration.PlaintextTopicMetadataTest > testAliveBrokerListWithNoTopics PASSED

kafka.integration.PlaintextTopicMetadataTest > testAutoCreateTopic STARTED

kafka.integration.PlaintextTopicMetadataTest > testAutoCreateTopic PASSED

kafka.integration.PlaintextTopicMetadataTest > testGetAllTopicMetadata STARTED

kafka.integration.PlaintextTopicMetadataTest > testGetAllTopicMetadata PASSED

kafka.integration.PlaintextTopicMetadataTest > testAliveBrokersListWithNoTopicsAfterNewBrokerStartup STARTED

kafka.integration.PlaintextTopicMetadataTest > testAliveBrokersListWithNoTopicsAfterNewBrokerStartup PASSED

kafka.integration.PlaintextTopicMetadataTest > testBasicTopicMetadata STARTED

kafka.integration.PlaintextTopicMetadataTest > testBasicTopicMetadata PASSED

kafka.integration.PlaintextTopicMetadataTest > testAutoCreateTopicWithInvalidReplication STARTED

kafka.integration.PlaintextTopicMetadataTest > testAutoCreateTopicWithInvalidReplication PASSED

kafka.integration.PlaintextTopicMetadataTest > testAliveBrokersListWithNoTopicsAfterABrokerShutdown STARTED

kafka.integration.PlaintextTopicMetadataTest > testAliveBrokersListWithNoTopicsAfterABrokerShutdown PASSED

integration.kafka.api.GroupCoordinatorIntegrationTest > testGroupCoordinatorPropagatesOfffsetsTopicCompressionCodec STARTED

integration.kafka.api.GroupCoordinatorIntegrationTest > testGroupCoordinatorPropagatesOfffsetsTopicCompressionCodec PASSED

912 tests completed, 1 failed
:kafka-trunk-jdk8:core:test FAILED
:test_core_2_10 FAILED

FAILURE: Build failed with an exception.

* What went wrong:
Execution failed for task ':core:test'.
> There were failing tests. See the report at: file://<https://builds.apache.org/job/kafka-trunk-jdk8/ws/core/build/reports/tests/test/index.html>

* Try:
Run with --stacktrace option to get the stack trace. Run with --info or --debug option to get more log output.

BUILD FAILED

Total time: 44 mins 9.739 secs
Build step 'Execute shell' marked build as failure
Recording test results
Setting GRADLE_2_4_RC_2_HOME=/home/jenkins/jenkins-slave/tools/hudson.plugins.gradle.GradleInstallation/Gradle_2.4-rc-2
Setting GRADLE_2_4_RC_2_HOME=/home/jenkins/jenkins-slave/tools/hudson.plugins.gradle.GradleInstallation/Gradle_2.4-rc-2

Build failed in Jenkins: kafka-trunk-jdk8 #896

Posted by Apache Jenkins Server <je...@builds.apache.org>.
See <https://builds.apache.org/job/kafka-trunk-jdk8/896/changes>

Changes:

[junrao] KAFKA-4079; Documentation for secure quotas

[wangguoz] MINOR: Allow creation of statestore without logging enabled or explicit

[jason] KAFKA-4183; Centralize checking for optional and default values in

[jason] MINOR: Add KafkaServerStartable constructor overload for compatibility

[jason] KAFKA-3283; Remove beta from new consumer documentation

------------------------------------------
[...truncated 11626 lines...]
               ^
<https://builds.apache.org/job/kafka-trunk-jdk8/ws/core/src/main/scala/kafka/server/KafkaApis.scala>:311: value timestamp in class PartitionData is deprecated: see corresponding Javadoc for more information.
              if (partitionData.timestamp == OffsetCommitRequest.DEFAULT_TIMESTAMP)
                                ^
<https://builds.apache.org/job/kafka-trunk-jdk8/ws/core/src/main/scala/kafka/server/KafkaApis.scala>:314: value timestamp in class PartitionData is deprecated: see corresponding Javadoc for more information.
                offsetRetention + partitionData.timestamp
                                                ^
<https://builds.apache.org/job/kafka-trunk-jdk8/ws/core/src/main/scala/kafka/server/ReplicaFetcherThread.scala>:291: method fromReplica in object FetchRequest is deprecated: see corresponding Javadoc for more information.
      else JFetchRequest.fromReplica(replicaId, maxWait, minBytes, requestMap)
                         ^
<https://builds.apache.org/job/kafka-trunk-jdk8/ws/core/src/main/scala/kafka/tools/ConsoleProducer.scala>:43: class OldProducer in package producer is deprecated: This class has been deprecated and will be removed in a future release. Please use org.apache.kafka.clients.producer.KafkaProducer instead.
            new OldProducer(getOldProducerProps(config))
                ^
<https://builds.apache.org/job/kafka-trunk-jdk8/ws/core/src/main/scala/kafka/tools/ConsoleProducer.scala>:45: class NewShinyProducer in package producer is deprecated: This class has been deprecated and will be removed in a future release. Please use org.apache.kafka.clients.producer.KafkaProducer instead.
            new NewShinyProducer(getNewProducerProps(config))
                ^
15 warnings found
warning: [options] bootstrap class path not set in conjunction with -source 1.7
1 warning
:core:processResources UP-TO-DATE
:core:classes
:core:copyDependantLibs
:core:jar
:examples:compileJavawarning: [options] bootstrap class path not set in conjunction with -source 1.7
1 warning

:examples:processResources UP-TO-DATE
:examples:classes
:examples:checkstyleMain
:examples:compileTestJava UP-TO-DATE
:examples:processTestResources UP-TO-DATE
:examples:testClasses UP-TO-DATE
:examples:checkstyleTest UP-TO-DATE
:examples:test UP-TO-DATE
:log4j-appender:compileJavawarning: [options] bootstrap class path not set in conjunction with -source 1.7
1 warning

:log4j-appender:processResources UP-TO-DATE
:log4j-appender:classes
:log4j-appender:checkstyleMain
:log4j-appender:compileTestJavawarning: [options] bootstrap class path not set in conjunction with -source 1.7
1 warning

:log4j-appender:processTestResources UP-TO-DATE
:log4j-appender:testClasses
:log4j-appender:checkstyleTest
:log4j-appender:test

org.apache.kafka.log4jappender.KafkaLog4jAppenderTest > testLog4jAppends STARTED

org.apache.kafka.log4jappender.KafkaLog4jAppenderTest > testLog4jAppends PASSED

org.apache.kafka.log4jappender.KafkaLog4jAppenderTest > testKafkaLog4jConfigs STARTED

org.apache.kafka.log4jappender.KafkaLog4jAppenderTest > testKafkaLog4jConfigs PASSED
:core:compileTestJava UP-TO-DATE
:core:compileTestScala
<https://builds.apache.org/job/kafka-trunk-jdk8/ws/core/src/test/scala/unit/kafka/metrics/MetricsTest.scala>:88: method createAndShutdownStep in class MetricsTest is deprecated: This test has been deprecated and it will be removed in a future release
    createAndShutdownStep("group0", "consumer0", "producer0")
    ^
<https://builds.apache.org/job/kafka-trunk-jdk8/ws/core/src/test/scala/unit/kafka/server/FetchRequestTest.scala>:158: constructor FetchRequest in class FetchRequest is deprecated: see corresponding Javadoc for more information.
    val fetchRequest = new FetchRequest(Int.MaxValue, 0, createPartitionMap(maxPartitionBytes, Seq(topicPartition)))
                       ^
two warnings found
:core:processTestResources UP-TO-DATE
:core:testClasses
:connect:api:compileJavawarning: [options] bootstrap class path not set in conjunction with -source 1.7
1 warning

:connect:api:processResources UP-TO-DATE
:connect:api:classes
:connect:api:copyDependantLibs
:connect:api:jar
:connect:json:compileJavawarning: [options] bootstrap class path not set in conjunction with -source 1.7
1 warning

:connect:json:processResources UP-TO-DATE
:connect:json:classes
:connect:json:copyDependantLibs
:connect:json:jar
:streams:compileJavawarning: [options] bootstrap class path not set in conjunction with -source 1.7
Note: Some input files use unchecked or unsafe operations.
Note: Recompile with -Xlint:unchecked for details.
1 warning

:streams:processResources UP-TO-DATE
:streams:classes
:streams:checkstyleMain
:streams:compileTestJavawarning: [options] bootstrap class path not set in conjunction with -source 1.7
<https://builds.apache.org/job/kafka-trunk-jdk8/ws/streams/src/test/java/org/apache/kafka/streams/kstream/internals/KStreamImplTest.java>:203: warning: non-varargs call of varargs method with inexact argument type for last parameter;
        testStream.branch(null);
                          ^
  cast to Predicate<String,String> for a varargs call
  cast to Predicate<String,String>[] for a non-varargs call and to suppress this warning
Note: <https://builds.apache.org/job/kafka-trunk-jdk8/ws/streams/src/test/java/org/apache/kafka/streams/processor/internals/StreamsMetadataStateTest.java> uses or overrides a deprecated API.
Note: Recompile with -Xlint:deprecation for details.
Note: Some input files use unchecked or unsafe operations.
Note: Recompile with -Xlint:unchecked for details.
2 warnings

:streams:processTestResources
:streams:testClasses
:streams:checkstyleTest
:streams:test

org.apache.kafka.streams.integration.InternalTopicIntegrationTest > shouldCompactTopicsForStateChangelogs STARTED

org.apache.kafka.streams.integration.InternalTopicIntegrationTest > shouldCompactTopicsForStateChangelogs PASSED

org.apache.kafka.streams.integration.InternalTopicIntegrationTest > shouldUseCompactAndDeleteForWindowStoreChangelogs STARTED

org.apache.kafka.streams.integration.InternalTopicIntegrationTest > shouldUseCompactAndDeleteForWindowStoreChangelogs PASSED

org.apache.kafka.streams.integration.KStreamRepartitionJoinTest > shouldCorrectlyRepartitionOnJoinOperations[0] STARTED

org.apache.kafka.streams.integration.KStreamRepartitionJoinTest > shouldCorrectlyRepartitionOnJoinOperations[0] PASSED

org.apache.kafka.streams.integration.KStreamRepartitionJoinTest > shouldCorrectlyRepartitionOnJoinOperations[1] STARTED

org.apache.kafka.streams.integration.KStreamRepartitionJoinTest > shouldCorrectlyRepartitionOnJoinOperations[1] PASSED

org.apache.kafka.streams.integration.KStreamKTableJoinIntegrationTest > shouldCountClicksPerRegion[0] STARTED

org.apache.kafka.streams.integration.KStreamKTableJoinIntegrationTest > shouldCountClicksPerRegion[0] PASSED

org.apache.kafka.streams.integration.KStreamKTableJoinIntegrationTest > shouldCountClicksPerRegion[1] STARTED

org.apache.kafka.streams.integration.KStreamKTableJoinIntegrationTest > shouldCountClicksPerRegion[1] PASSED

org.apache.kafka.streams.integration.ResetIntegrationTest > testReprocessingFromScratchAfterReset STARTED

org.apache.kafka.streams.integration.ResetIntegrationTest > testReprocessingFromScratchAfterReset PASSED

org.apache.kafka.streams.integration.KStreamAggregationDedupIntegrationTest > shouldReduce STARTED

org.apache.kafka.streams.integration.KStreamAggregationDedupIntegrationTest > shouldReduce PASSED

org.apache.kafka.streams.integration.KStreamAggregationDedupIntegrationTest > shouldReduceWindowed STARTED

org.apache.kafka.streams.integration.KStreamAggregationDedupIntegrationTest > shouldReduceWindowed PASSED

org.apache.kafka.streams.integration.RegexSourceIntegrationTest > testShouldReadFromRegexAndNamedTopics STARTED

org.apache.kafka.streams.integration.RegexSourceIntegrationTest > testShouldReadFromRegexAndNamedTopics PASSED

org.apache.kafka.streams.integration.RegexSourceIntegrationTest > testRegexMatchesTopicsAWhenCreated STARTED

org.apache.kafka.streams.integration.RegexSourceIntegrationTest > testRegexMatchesTopicsAWhenCreated PASSED

org.apache.kafka.streams.integration.RegexSourceIntegrationTest > testMultipleConsumersCanReadFromPartitionedTopic STARTED

org.apache.kafka.streams.integration.RegexSourceIntegrationTest > testMultipleConsumersCanReadFromPartitionedTopic PASSED

org.apache.kafka.streams.integration.RegexSourceIntegrationTest > testRegexMatchesTopicsAWhenDeleted STARTED

org.apache.kafka.streams.integration.RegexSourceIntegrationTest > testRegexMatchesTopicsAWhenDeleted PASSED

org.apache.kafka.streams.integration.RegexSourceIntegrationTest > testNoMessagesSentExceptionFromOverlappingPatterns STARTED

org.apache.kafka.streams.integration.RegexSourceIntegrationTest > testNoMessagesSentExceptionFromOverlappingPatterns PASSED

org.apache.kafka.streams.integration.KStreamAggregationIntegrationTest > shouldReduce[0] STARTED

org.apache.kafka.streams.integration.KStreamAggregationIntegrationTest > shouldReduce[0] PASSED

org.apache.kafka.streams.integration.KStreamAggregationIntegrationTest > shouldAggregate[0] STARTED

org.apache.kafka.streams.integration.KStreamAggregationIntegrationTest > shouldAggregate[0] PASSED

org.apache.kafka.streams.integration.KStreamAggregationIntegrationTest > shouldCount[0] STARTED

org.apache.kafka.streams.integration.KStreamAggregationIntegrationTest > shouldCount[0] PASSED

org.apache.kafka.streams.integration.KStreamAggregationIntegrationTest > shouldGroupByKey[0] STARTED

org.apache.kafka.streams.integration.KStreamAggregationIntegrationTest > shouldGroupByKey[0] PASSED

org.apache.kafka.streams.integration.KStreamAggregationIntegrationTest > shouldReduceWindowed[0] STARTED

org.apache.kafka.streams.integration.KStreamAggregationIntegrationTest > shouldReduceWindowed[0] PASSED

org.apache.kafka.streams.integration.KStreamAggregationIntegrationTest > shouldAggregateWindowed[0] STARTED

org.apache.kafka.streams.integration.KStreamAggregationIntegrationTest > shouldAggregateWindowed[0] PASSED

org.apache.kafka.streams.integration.KStreamAggregationIntegrationTest > shouldReduce[1] STARTED

org.apache.kafka.streams.integration.KStreamAggregationIntegrationTest > shouldReduce[1] PASSED

org.apache.kafka.streams.integration.KStreamAggregationIntegrationTest > shouldAggregate[1] STARTED

org.apache.kafka.streams.integration.KStreamAggregationIntegrationTest > shouldAggregate[1] PASSED

org.apache.kafka.streams.integration.KStreamAggregationIntegrationTest > shouldCount[1] STARTED

org.apache.kafka.streams.integration.KStreamAggregationIntegrationTest > shouldCount[1] PASSED

org.apache.kafka.streams.integration.KStreamAggregationIntegrationTest > shouldGroupByKey[1] STARTED

org.apache.kafka.streams.integration.KStreamAggregationIntegrationTest > shouldGroupByKey[1] PASSED

org.apache.kafka.streams.integration.KStreamAggregationIntegrationTest > shouldReduceWindowed[1] STARTED

org.apache.kafka.streams.integration.KStreamAggregationIntegrationTest > shouldReduceWindowed[1] PASSED

org.apache.kafka.streams.integration.KStreamAggregationIntegrationTest > shouldAggregateWindowed[1] STARTED

org.apache.kafka.streams.integration.KStreamAggregationIntegrationTest > shouldAggregateWindowed[1] PASSED

org.apache.kafka.streams.integration.FanoutIntegrationTest > shouldFanoutTheInput[0] STARTED

org.apache.kafka.streams.integration.FanoutIntegrationTest > shouldFanoutTheInput[0] PASSED

org.apache.kafka.streams.integration.FanoutIntegrationTest > shouldFanoutTheInput[1] STARTED

org.apache.kafka.streams.integration.FanoutIntegrationTest > shouldFanoutTheInput[1] PASSED

org.apache.kafka.streams.integration.QueryableStateIntegrationTest > shouldBeAbleToQueryState[0] STARTED

org.apache.kafka.streams.integration.QueryableStateIntegrationTest > shouldBeAbleToQueryState[0] PASSED

org.apache.kafka.streams.integration.QueryableStateIntegrationTest > shouldNotMakeStoreAvailableUntilAllStoresAvailable[0] STARTED

org.apache.kafka.streams.integration.QueryableStateIntegrationTest > shouldNotMakeStoreAvailableUntilAllStoresAvailable[0] PASSED

org.apache.kafka.streams.integration.QueryableStateIntegrationTest > queryOnRebalance[0] STARTED

org.apache.kafka.streams.integration.QueryableStateIntegrationTest > queryOnRebalance[0] PASSED

org.apache.kafka.streams.integration.QueryableStateIntegrationTest > concurrentAccesses[0] STARTED

org.apache.kafka.streams.integration.QueryableStateIntegrationTest > concurrentAccesses[0] PASSED

org.apache.kafka.streams.integration.QueryableStateIntegrationTest > shouldBeAbleToQueryState[1] STARTED

org.apache.kafka.streams.integration.QueryableStateIntegrationTest > shouldBeAbleToQueryState[1] PASSED

org.apache.kafka.streams.integration.QueryableStateIntegrationTest > shouldNotMakeStoreAvailableUntilAllStoresAvailable[1] STARTED

org.apache.kafka.streams.integration.QueryableStateIntegrationTest > shouldNotMakeStoreAvailableUntilAllStoresAvailable[1] PASSED

org.apache.kafka.streams.integration.QueryableStateIntegrationTest > queryOnRebalance[1] STARTED
ERROR: Could not install GRADLE_2_4_RC_2_HOME
java.lang.NullPointerException
Build timed out (after 180 minutes). Marking the build as failed.
Build was aborted
Recording test results
Setting GRADLE_2_4_RC_2_HOME=/home/jenkins/jenkins-slave/tools/hudson.plugins.gradle.GradleInstallation/Gradle_2.4-rc-2
Setting GRADLE_2_4_RC_2_HOME=/home/jenkins/jenkins-slave/tools/hudson.plugins.gradle.GradleInstallation/Gradle_2.4-rc-2

Build failed in Jenkins: kafka-trunk-jdk8 #895

Posted by Apache Jenkins Server <je...@builds.apache.org>.
See <https://builds.apache.org/job/kafka-trunk-jdk8/895/changes>

Changes:

[wangguoz] HOTFIX: logic in QuerybaleStateIntegrationTest.shouldBeAbleToQueryState

[wangguoz] KAFKA-4175: Can't have StandbyTasks in KafkaStreams where

[wangguoz] KAFKA-4163: NPE in StreamsMetadataState during re-balance operations

------------------------------------------
[...truncated 13351 lines...]

org.apache.kafka.streams.state.internals.InMemoryLRUCacheStoreTest > testRestore PASSED

org.apache.kafka.streams.state.internals.InMemoryLRUCacheStoreTest > testPutGetRange STARTED

org.apache.kafka.streams.state.internals.InMemoryLRUCacheStoreTest > testPutGetRange PASSED

org.apache.kafka.streams.state.internals.InMemoryLRUCacheStoreTest > testPutGetRangeWithDefaultSerdes STARTED

org.apache.kafka.streams.state.internals.InMemoryLRUCacheStoreTest > testPutGetRangeWithDefaultSerdes PASSED

org.apache.kafka.streams.state.internals.DelegatingPeekingKeyValueIteratorTest > shouldPeekNext STARTED

org.apache.kafka.streams.state.internals.DelegatingPeekingKeyValueIteratorTest > shouldPeekNext PASSED

org.apache.kafka.streams.state.internals.DelegatingPeekingKeyValueIteratorTest > shouldPeekAndIterate STARTED

org.apache.kafka.streams.state.internals.DelegatingPeekingKeyValueIteratorTest > shouldPeekAndIterate PASSED

org.apache.kafka.streams.state.internals.DelegatingPeekingKeyValueIteratorTest > shouldThrowNoSuchElementWhenNoMoreItemsLeftAndPeekNextCalled STARTED

org.apache.kafka.streams.state.internals.DelegatingPeekingKeyValueIteratorTest > shouldThrowNoSuchElementWhenNoMoreItemsLeftAndPeekNextCalled PASSED

org.apache.kafka.streams.state.internals.DelegatingPeekingKeyValueIteratorTest > shouldThrowNoSuchElementWhenNoMoreItemsLeftAndNextCalled STARTED

org.apache.kafka.streams.state.internals.DelegatingPeekingKeyValueIteratorTest > shouldThrowNoSuchElementWhenNoMoreItemsLeftAndNextCalled PASSED

org.apache.kafka.streams.state.internals.MergedSortedCacheWindowStoreIteratorTest > shouldIterateOverValueFromBothIterators STARTED

org.apache.kafka.streams.state.internals.MergedSortedCacheWindowStoreIteratorTest > shouldIterateOverValueFromBothIterators PASSED

org.apache.kafka.streams.state.internals.StreamThreadStateStoreProviderTest > shouldReturnEmptyListIfNoStoresFoundWithName STARTED

org.apache.kafka.streams.state.internals.StreamThreadStateStoreProviderTest > shouldReturnEmptyListIfNoStoresFoundWithName PASSED

org.apache.kafka.streams.state.internals.StreamThreadStateStoreProviderTest > shouldThrowInvalidStoreExceptionIfKVStoreClosed STARTED

org.apache.kafka.streams.state.internals.StreamThreadStateStoreProviderTest > shouldThrowInvalidStoreExceptionIfKVStoreClosed PASSED

org.apache.kafka.streams.state.internals.StreamThreadStateStoreProviderTest > shouldThrowInvalidStoreExceptionIfNotAllStoresAvailable STARTED

org.apache.kafka.streams.state.internals.StreamThreadStateStoreProviderTest > shouldThrowInvalidStoreExceptionIfNotAllStoresAvailable PASSED

org.apache.kafka.streams.state.internals.StreamThreadStateStoreProviderTest > shouldFindWindowStores STARTED

org.apache.kafka.streams.state.internals.StreamThreadStateStoreProviderTest > shouldFindWindowStores PASSED

org.apache.kafka.streams.state.internals.StreamThreadStateStoreProviderTest > shouldReturnEmptyListIfStoreExistsButIsNotOfTypeValueStore STARTED

org.apache.kafka.streams.state.internals.StreamThreadStateStoreProviderTest > shouldReturnEmptyListIfStoreExistsButIsNotOfTypeValueStore PASSED

org.apache.kafka.streams.state.internals.StreamThreadStateStoreProviderTest > shouldFindKeyValueStores STARTED

org.apache.kafka.streams.state.internals.StreamThreadStateStoreProviderTest > shouldFindKeyValueStores PASSED

org.apache.kafka.streams.state.internals.StreamThreadStateStoreProviderTest > shouldThrowInvalidStoreExceptionIfWindowStoreClosed STARTED

org.apache.kafka.streams.state.internals.StreamThreadStateStoreProviderTest > shouldThrowInvalidStoreExceptionIfWindowStoreClosed PASSED

org.apache.kafka.streams.state.StoresTest > shouldCreateInMemoryStoreSupplierWithLoggedConfig STARTED

org.apache.kafka.streams.state.StoresTest > shouldCreateInMemoryStoreSupplierWithLoggedConfig PASSED

org.apache.kafka.streams.state.StoresTest > shouldCreatePersistenStoreSupplierNotLogged STARTED

org.apache.kafka.streams.state.StoresTest > shouldCreatePersistenStoreSupplierNotLogged PASSED

org.apache.kafka.streams.state.StoresTest > shouldCreatePersistenStoreSupplierWithLoggedConfig STARTED

org.apache.kafka.streams.state.StoresTest > shouldCreatePersistenStoreSupplierWithLoggedConfig PASSED

org.apache.kafka.streams.state.StoresTest > shouldCreateInMemoryStoreSupplierNotLogged STARTED

org.apache.kafka.streams.state.StoresTest > shouldCreateInMemoryStoreSupplierNotLogged PASSED

org.apache.kafka.streams.integration.KStreamAggregationDedupIntegrationTest > shouldReduce STARTED

org.apache.kafka.streams.integration.KStreamAggregationDedupIntegrationTest > shouldReduce PASSED

org.apache.kafka.streams.integration.KStreamAggregationDedupIntegrationTest > shouldReduceWindowed STARTED

org.apache.kafka.streams.integration.KStreamAggregationDedupIntegrationTest > shouldReduceWindowed PASSED

org.apache.kafka.streams.integration.InternalTopicIntegrationTest > shouldCompactTopicsForStateChangelogs STARTED

org.apache.kafka.streams.integration.InternalTopicIntegrationTest > shouldCompactTopicsForStateChangelogs PASSED

org.apache.kafka.streams.integration.InternalTopicIntegrationTest > shouldUseCompactAndDeleteForWindowStoreChangelogs STARTED

org.apache.kafka.streams.integration.InternalTopicIntegrationTest > shouldUseCompactAndDeleteForWindowStoreChangelogs PASSED

org.apache.kafka.streams.integration.KStreamAggregationIntegrationTest > shouldReduce[0] STARTED

org.apache.kafka.streams.integration.KStreamAggregationIntegrationTest > shouldReduce[0] PASSED

org.apache.kafka.streams.integration.KStreamAggregationIntegrationTest > shouldAggregate[0] STARTED

org.apache.kafka.streams.integration.KStreamAggregationIntegrationTest > shouldAggregate[0] PASSED

org.apache.kafka.streams.integration.KStreamAggregationIntegrationTest > shouldCount[0] STARTED

org.apache.kafka.streams.integration.KStreamAggregationIntegrationTest > shouldCount[0] PASSED

org.apache.kafka.streams.integration.KStreamAggregationIntegrationTest > shouldGroupByKey[0] STARTED

org.apache.kafka.streams.integration.KStreamAggregationIntegrationTest > shouldGroupByKey[0] PASSED

org.apache.kafka.streams.integration.KStreamAggregationIntegrationTest > shouldReduceWindowed[0] STARTED

org.apache.kafka.streams.integration.KStreamAggregationIntegrationTest > shouldReduceWindowed[0] PASSED

org.apache.kafka.streams.integration.KStreamAggregationIntegrationTest > shouldAggregateWindowed[0] STARTED

org.apache.kafka.streams.integration.KStreamAggregationIntegrationTest > shouldAggregateWindowed[0] PASSED

org.apache.kafka.streams.integration.KStreamAggregationIntegrationTest > shouldReduce[1] STARTED

org.apache.kafka.streams.integration.KStreamAggregationIntegrationTest > shouldReduce[1] PASSED

org.apache.kafka.streams.integration.KStreamAggregationIntegrationTest > shouldAggregate[1] STARTED

org.apache.kafka.streams.integration.KStreamAggregationIntegrationTest > shouldAggregate[1] PASSED

org.apache.kafka.streams.integration.KStreamAggregationIntegrationTest > shouldCount[1] STARTED

org.apache.kafka.streams.integration.KStreamAggregationIntegrationTest > shouldCount[1] PASSED

org.apache.kafka.streams.integration.KStreamAggregationIntegrationTest > shouldGroupByKey[1] STARTED

org.apache.kafka.streams.integration.KStreamAggregationIntegrationTest > shouldGroupByKey[1] PASSED

org.apache.kafka.streams.integration.KStreamAggregationIntegrationTest > shouldReduceWindowed[1] STARTED

org.apache.kafka.streams.integration.KStreamAggregationIntegrationTest > shouldReduceWindowed[1] PASSED

org.apache.kafka.streams.integration.KStreamAggregationIntegrationTest > shouldAggregateWindowed[1] STARTED

org.apache.kafka.streams.integration.KStreamAggregationIntegrationTest > shouldAggregateWindowed[1] PASSED

org.apache.kafka.streams.integration.KStreamKTableJoinIntegrationTest > shouldCountClicksPerRegion[0] STARTED

org.apache.kafka.streams.integration.KStreamKTableJoinIntegrationTest > shouldCountClicksPerRegion[0] PASSED

org.apache.kafka.streams.integration.KStreamKTableJoinIntegrationTest > shouldCountClicksPerRegion[1] STARTED

org.apache.kafka.streams.integration.KStreamKTableJoinIntegrationTest > shouldCountClicksPerRegion[1] PASSED

org.apache.kafka.streams.integration.FanoutIntegrationTest > shouldFanoutTheInput[0] STARTED

org.apache.kafka.streams.integration.FanoutIntegrationTest > shouldFanoutTheInput[0] PASSED

org.apache.kafka.streams.integration.FanoutIntegrationTest > shouldFanoutTheInput[1] STARTED

org.apache.kafka.streams.integration.FanoutIntegrationTest > shouldFanoutTheInput[1] PASSED

org.apache.kafka.streams.integration.QueryableStateIntegrationTest > shouldBeAbleToQueryState[0] STARTED

org.apache.kafka.streams.integration.QueryableStateIntegrationTest > shouldBeAbleToQueryState[0] PASSED

org.apache.kafka.streams.integration.QueryableStateIntegrationTest > shouldNotMakeStoreAvailableUntilAllStoresAvailable[0] STARTED

org.apache.kafka.streams.integration.QueryableStateIntegrationTest > shouldNotMakeStoreAvailableUntilAllStoresAvailable[0] PASSED

org.apache.kafka.streams.integration.QueryableStateIntegrationTest > queryOnRebalance[0] STARTED

org.apache.kafka.streams.integration.QueryableStateIntegrationTest > queryOnRebalance[0] FAILED
    java.lang.AssertionError: Condition not met within timeout 30000. waiting for metadata, store and value to be non null
        at org.apache.kafka.test.TestUtils.waitForCondition(TestUtils.java:276)
        at org.apache.kafka.streams.integration.QueryableStateIntegrationTest.verifyAllKVKeys(QueryableStateIntegrationTest.java:263)
        at org.apache.kafka.streams.integration.QueryableStateIntegrationTest.queryOnRebalance(QueryableStateIntegrationTest.java:342)

org.apache.kafka.streams.integration.QueryableStateIntegrationTest > concurrentAccesses[0] STARTED

org.apache.kafka.streams.integration.QueryableStateIntegrationTest > concurrentAccesses[0] PASSED

org.apache.kafka.streams.integration.QueryableStateIntegrationTest > shouldBeAbleToQueryState[1] STARTED

org.apache.kafka.streams.integration.QueryableStateIntegrationTest > shouldBeAbleToQueryState[1] PASSED

org.apache.kafka.streams.integration.QueryableStateIntegrationTest > shouldNotMakeStoreAvailableUntilAllStoresAvailable[1] STARTED

org.apache.kafka.streams.integration.QueryableStateIntegrationTest > shouldNotMakeStoreAvailableUntilAllStoresAvailable[1] PASSED

org.apache.kafka.streams.integration.QueryableStateIntegrationTest > queryOnRebalance[1] STARTED

org.apache.kafka.streams.integration.QueryableStateIntegrationTest > queryOnRebalance[1] PASSED

org.apache.kafka.streams.integration.QueryableStateIntegrationTest > concurrentAccesses[1] STARTED

org.apache.kafka.streams.integration.QueryableStateIntegrationTest > concurrentAccesses[1] PASSED

org.apache.kafka.streams.integration.ResetIntegrationTest > testReprocessingFromScratchAfterReset STARTED

org.apache.kafka.streams.integration.ResetIntegrationTest > testReprocessingFromScratchAfterReset FAILED
    java.lang.AssertionError: Condition not met within timeout 30000. Did not receive 10 number of records
        at org.apache.kafka.test.TestUtils.waitForCondition(TestUtils.java:276)
        at org.apache.kafka.streams.integration.utils.IntegrationTestUtils.waitUntilMinKeyValueRecordsReceived(IntegrationTestUtils.java:211)
        at org.apache.kafka.streams.integration.utils.IntegrationTestUtils.waitUntilMinKeyValueRecordsReceived(IntegrationTestUtils.java:180)
        at org.apache.kafka.streams.integration.ResetIntegrationTest.testReprocessingFromScratchAfterReset(ResetIntegrationTest.java:120)

org.apache.kafka.streams.integration.KStreamRepartitionJoinTest > shouldCorrectlyRepartitionOnJoinOperations[0] STARTED
ERROR: Could not install GRADLE_2_4_RC_2_HOME
java.lang.NullPointerException

org.apache.kafka.streams.integration.KStreamRepartitionJoinTest > shouldCorrectlyRepartitionOnJoinOperations[0] PASSED

org.apache.kafka.streams.integration.KStreamRepartitionJoinTest > shouldCorrectlyRepartitionOnJoinOperations[1] STARTED

org.apache.kafka.streams.integration.KStreamRepartitionJoinTest > shouldCorrectlyRepartitionOnJoinOperations[1] PASSED

org.apache.kafka.streams.integration.RegexSourceIntegrationTest > testShouldReadFromRegexAndNamedTopics STARTED

org.apache.kafka.streams.integration.RegexSourceIntegrationTest > testShouldReadFromRegexAndNamedTopics PASSED

org.apache.kafka.streams.integration.RegexSourceIntegrationTest > testRegexMatchesTopicsAWhenCreated STARTED

org.apache.kafka.streams.integration.RegexSourceIntegrationTest > testRegexMatchesTopicsAWhenCreated PASSED

org.apache.kafka.streams.integration.RegexSourceIntegrationTest > testMultipleConsumersCanReadFromPartitionedTopic STARTED

org.apache.kafka.streams.integration.RegexSourceIntegrationTest > testMultipleConsumersCanReadFromPartitionedTopic PASSED

org.apache.kafka.streams.integration.RegexSourceIntegrationTest > testRegexMatchesTopicsAWhenDeleted STARTED

org.apache.kafka.streams.integration.RegexSourceIntegrationTest > testRegexMatchesTopicsAWhenDeleted PASSED

org.apache.kafka.streams.integration.RegexSourceIntegrationTest > testNoMessagesSentExceptionFromOverlappingPatterns STARTED

org.apache.kafka.streams.integration.RegexSourceIntegrationTest > testNoMessagesSentExceptionFromOverlappingPatterns PASSED

460 tests completed, 2 failed
:streams:test FAILED

FAILURE: Build failed with an exception.

* What went wrong:
Execution failed for task ':streams:test'.
> There were failing tests. See the report at: file://<https://builds.apache.org/job/kafka-trunk-jdk8/ws/streams/build/reports/tests/test/index.html>

* Try:
Run with --stacktrace option to get the stack trace. Run with --info or --debug option to get more log output.

BUILD FAILED

Total time: 2 hrs 49 mins 54.904 secs
Build step 'Execute shell' marked build as failure
Recording test results
Setting GRADLE_2_4_RC_2_HOME=/home/jenkins/jenkins-slave/tools/hudson.plugins.gradle.GradleInstallation/Gradle_2.4-rc-2
Setting GRADLE_2_4_RC_2_HOME=/home/jenkins/jenkins-slave/tools/hudson.plugins.gradle.GradleInstallation/Gradle_2.4-rc-2

Build failed in Jenkins: kafka-trunk-jdk8 #894

Posted by Apache Jenkins Server <je...@builds.apache.org>.
See <https://builds.apache.org/job/kafka-trunk-jdk8/894/changes>

Changes:

[ismael] MINOR: Fix reference to argument in `LogSegment.translateOffset`

------------------------------------------
[...truncated 3559 lines...]

kafka.integration.SaslSslTopicMetadataTest > testIsrAfterBrokerShutDownAndJoinsBack PASSED

kafka.integration.SaslSslTopicMetadataTest > testAutoCreateTopicWithCollision STARTED

kafka.integration.SaslSslTopicMetadataTest > testAutoCreateTopicWithCollision PASSED

kafka.integration.SaslSslTopicMetadataTest > testAliveBrokerListWithNoTopics STARTED

kafka.integration.SaslSslTopicMetadataTest > testAliveBrokerListWithNoTopics PASSED

kafka.integration.SaslSslTopicMetadataTest > testAutoCreateTopic STARTED

kafka.integration.SaslSslTopicMetadataTest > testAutoCreateTopic PASSED

kafka.integration.SaslSslTopicMetadataTest > testGetAllTopicMetadata STARTED

kafka.integration.SaslSslTopicMetadataTest > testGetAllTopicMetadata PASSED

kafka.integration.SaslSslTopicMetadataTest > testAliveBrokersListWithNoTopicsAfterNewBrokerStartup STARTED

kafka.integration.SaslSslTopicMetadataTest > testAliveBrokersListWithNoTopicsAfterNewBrokerStartup PASSED

kafka.integration.SaslSslTopicMetadataTest > testBasicTopicMetadata STARTED

kafka.integration.SaslSslTopicMetadataTest > testBasicTopicMetadata PASSED

kafka.integration.SaslSslTopicMetadataTest > testAutoCreateTopicWithInvalidReplication STARTED

kafka.integration.SaslSslTopicMetadataTest > testAutoCreateTopicWithInvalidReplication PASSED

kafka.integration.SaslSslTopicMetadataTest > testAliveBrokersListWithNoTopicsAfterABrokerShutdown STARTED

kafka.integration.SaslSslTopicMetadataTest > testAliveBrokersListWithNoTopicsAfterABrokerShutdown PASSED

kafka.integration.PrimitiveApiTest > testMultiProduce STARTED

kafka.integration.PrimitiveApiTest > testMultiProduce PASSED

kafka.integration.PrimitiveApiTest > testDefaultEncoderProducerAndFetch STARTED

kafka.integration.PrimitiveApiTest > testDefaultEncoderProducerAndFetch PASSED

kafka.integration.PrimitiveApiTest > testFetchRequestCanProperlySerialize STARTED

kafka.integration.PrimitiveApiTest > testFetchRequestCanProperlySerialize PASSED

kafka.integration.PrimitiveApiTest > testPipelinedProduceRequests STARTED

kafka.integration.PrimitiveApiTest > testPipelinedProduceRequests PASSED

kafka.integration.PrimitiveApiTest > testProduceAndMultiFetch STARTED

kafka.integration.PrimitiveApiTest > testProduceAndMultiFetch PASSED

kafka.integration.PrimitiveApiTest > testDefaultEncoderProducerAndFetchWithCompression STARTED

kafka.integration.PrimitiveApiTest > testDefaultEncoderProducerAndFetchWithCompression PASSED

kafka.integration.PrimitiveApiTest > testConsumerEmptyTopic STARTED

kafka.integration.PrimitiveApiTest > testConsumerEmptyTopic PASSED

kafka.integration.PrimitiveApiTest > testEmptyFetchRequest STARTED

kafka.integration.PrimitiveApiTest > testEmptyFetchRequest PASSED

kafka.integration.UncleanLeaderElectionTest > testUncleanLeaderElectionEnabled STARTED

kafka.integration.UncleanLeaderElectionTest > testUncleanLeaderElectionEnabled PASSED

kafka.integration.UncleanLeaderElectionTest > testCleanLeaderElectionDisabledByTopicOverride STARTED

kafka.integration.UncleanLeaderElectionTest > testCleanLeaderElectionDisabledByTopicOverride PASSED

kafka.integration.UncleanLeaderElectionTest > testUncleanLeaderElectionDisabled STARTED

kafka.integration.UncleanLeaderElectionTest > testUncleanLeaderElectionDisabled PASSED

kafka.integration.UncleanLeaderElectionTest > testUncleanLeaderElectionInvalidTopicOverride STARTED

kafka.integration.UncleanLeaderElectionTest > testUncleanLeaderElectionInvalidTopicOverride PASSED

kafka.integration.UncleanLeaderElectionTest > testUncleanLeaderElectionEnabledByTopicOverride STARTED

kafka.integration.UncleanLeaderElectionTest > testUncleanLeaderElectionEnabledByTopicOverride PASSED

kafka.integration.MinIsrConfigTest > testDefaultKafkaConfig STARTED

kafka.integration.MinIsrConfigTest > testDefaultKafkaConfig PASSED

kafka.integration.SaslPlaintextTopicMetadataTest > testIsrAfterBrokerShutDownAndJoinsBack STARTED

kafka.integration.SaslPlaintextTopicMetadataTest > testIsrAfterBrokerShutDownAndJoinsBack PASSED

kafka.integration.SaslPlaintextTopicMetadataTest > testAutoCreateTopicWithCollision STARTED

kafka.integration.SaslPlaintextTopicMetadataTest > testAutoCreateTopicWithCollision PASSED

kafka.integration.SaslPlaintextTopicMetadataTest > testAliveBrokerListWithNoTopics STARTED

kafka.integration.SaslPlaintextTopicMetadataTest > testAliveBrokerListWithNoTopics PASSED

kafka.integration.SaslPlaintextTopicMetadataTest > testAutoCreateTopic STARTED

kafka.integration.SaslPlaintextTopicMetadataTest > testAutoCreateTopic PASSED

kafka.integration.SaslPlaintextTopicMetadataTest > testGetAllTopicMetadata STARTED

kafka.integration.SaslPlaintextTopicMetadataTest > testGetAllTopicMetadata PASSED

kafka.integration.SaslPlaintextTopicMetadataTest > testAliveBrokersListWithNoTopicsAfterNewBrokerStartup STARTED

kafka.integration.SaslPlaintextTopicMetadataTest > testAliveBrokersListWithNoTopicsAfterNewBrokerStartup PASSED

kafka.integration.SaslPlaintextTopicMetadataTest > testBasicTopicMetadata STARTED

kafka.integration.SaslPlaintextTopicMetadataTest > testBasicTopicMetadata PASSED

kafka.integration.SaslPlaintextTopicMetadataTest > testAutoCreateTopicWithInvalidReplication STARTED

kafka.integration.SaslPlaintextTopicMetadataTest > testAutoCreateTopicWithInvalidReplication PASSED

kafka.integration.SaslPlaintextTopicMetadataTest > testAliveBrokersListWithNoTopicsAfterABrokerShutdown STARTED

kafka.integration.SaslPlaintextTopicMetadataTest > testAliveBrokersListWithNoTopicsAfterABrokerShutdown PASSED

kafka.integration.AutoOffsetResetTest > testResetToLatestWhenOffsetTooLow STARTED

kafka.integration.AutoOffsetResetTest > testResetToLatestWhenOffsetTooLow PASSED

kafka.integration.AutoOffsetResetTest > testResetToEarliestWhenOffsetTooLow STARTED

kafka.integration.AutoOffsetResetTest > testResetToEarliestWhenOffsetTooLow PASSED

kafka.integration.AutoOffsetResetTest > testResetToEarliestWhenOffsetTooHigh STARTED

kafka.integration.AutoOffsetResetTest > testResetToEarliestWhenOffsetTooHigh PASSED

kafka.integration.AutoOffsetResetTest > testResetToLatestWhenOffsetTooHigh STARTED

kafka.integration.AutoOffsetResetTest > testResetToLatestWhenOffsetTooHigh PASSED

kafka.integration.SslTopicMetadataTest > testIsrAfterBrokerShutDownAndJoinsBack STARTED

kafka.integration.SslTopicMetadataTest > testIsrAfterBrokerShutDownAndJoinsBack PASSED

kafka.integration.SslTopicMetadataTest > testAutoCreateTopicWithCollision STARTED

kafka.integration.SslTopicMetadataTest > testAutoCreateTopicWithCollision PASSED

kafka.integration.SslTopicMetadataTest > testAliveBrokerListWithNoTopics STARTED

kafka.integration.SslTopicMetadataTest > testAliveBrokerListWithNoTopics PASSED

kafka.integration.SslTopicMetadataTest > testAutoCreateTopic STARTED

kafka.integration.SslTopicMetadataTest > testAutoCreateTopic PASSED

kafka.integration.SslTopicMetadataTest > testGetAllTopicMetadata STARTED

kafka.integration.SslTopicMetadataTest > testGetAllTopicMetadata PASSED

kafka.integration.SslTopicMetadataTest > testAliveBrokersListWithNoTopicsAfterNewBrokerStartup STARTED

kafka.integration.SslTopicMetadataTest > testAliveBrokersListWithNoTopicsAfterNewBrokerStartup PASSED

kafka.integration.SslTopicMetadataTest > testBasicTopicMetadata STARTED

kafka.integration.SslTopicMetadataTest > testBasicTopicMetadata PASSED

kafka.integration.SslTopicMetadataTest > testAutoCreateTopicWithInvalidReplication STARTED

kafka.integration.SslTopicMetadataTest > testAutoCreateTopicWithInvalidReplication PASSED

kafka.integration.SslTopicMetadataTest > testAliveBrokersListWithNoTopicsAfterABrokerShutdown STARTED

kafka.integration.SslTopicMetadataTest > testAliveBrokersListWithNoTopicsAfterABrokerShutdown PASSED

kafka.integration.FetcherTest > testFetcher STARTED

kafka.integration.FetcherTest > testFetcher FAILED
    java.lang.AssertionError: Timed out waiting for data chunk 1
        at org.junit.Assert.fail(Assert.java:88)
        at org.junit.Assert.assertTrue(Assert.java:41)
        at org.junit.Assert.assertNotNull(Assert.java:712)
        at kafka.integration.FetcherTest.fetch(FetcherTest.scala:86)
        at kafka.integration.FetcherTest.testFetcher(FetcherTest.scala:73)

kafka.integration.PlaintextTopicMetadataTest > testIsrAfterBrokerShutDownAndJoinsBack STARTED

kafka.integration.PlaintextTopicMetadataTest > testIsrAfterBrokerShutDownAndJoinsBack PASSED

kafka.integration.PlaintextTopicMetadataTest > testAutoCreateTopicWithCollision STARTED

kafka.integration.PlaintextTopicMetadataTest > testAutoCreateTopicWithCollision PASSED

kafka.integration.PlaintextTopicMetadataTest > testAliveBrokerListWithNoTopics STARTED

kafka.integration.PlaintextTopicMetadataTest > testAliveBrokerListWithNoTopics PASSED

kafka.integration.PlaintextTopicMetadataTest > testAutoCreateTopic STARTED

kafka.integration.PlaintextTopicMetadataTest > testAutoCreateTopic PASSED

kafka.integration.PlaintextTopicMetadataTest > testGetAllTopicMetadata STARTED

kafka.integration.PlaintextTopicMetadataTest > testGetAllTopicMetadata PASSED

kafka.integration.PlaintextTopicMetadataTest > testAliveBrokersListWithNoTopicsAfterNewBrokerStartup STARTED

kafka.integration.PlaintextTopicMetadataTest > testAliveBrokersListWithNoTopicsAfterNewBrokerStartup PASSED

kafka.integration.PlaintextTopicMetadataTest > testBasicTopicMetadata STARTED

kafka.integration.PlaintextTopicMetadataTest > testBasicTopicMetadata PASSED

kafka.integration.PlaintextTopicMetadataTest > testAutoCreateTopicWithInvalidReplication STARTED

kafka.integration.PlaintextTopicMetadataTest > testAutoCreateTopicWithInvalidReplication PASSED

kafka.integration.PlaintextTopicMetadataTest > testAliveBrokersListWithNoTopicsAfterABrokerShutdown STARTED

kafka.integration.PlaintextTopicMetadataTest > testAliveBrokersListWithNoTopicsAfterABrokerShutdown PASSED

integration.kafka.api.GroupCoordinatorIntegrationTest > testGroupCoordinatorPropagatesOfffsetsTopicCompressionCodec STARTED

integration.kafka.api.GroupCoordinatorIntegrationTest > testGroupCoordinatorPropagatesOfffsetsTopicCompressionCodec PASSED

912 tests completed, 1 failed
:kafka-trunk-jdk8:core:test FAILED
:test_core_2_10 FAILED

FAILURE: Build failed with an exception.

* What went wrong:
Execution failed for task ':core:test'.
> There were failing tests. See the report at: file://<https://builds.apache.org/job/kafka-trunk-jdk8/ws/core/build/reports/tests/test/index.html>

* Try:
Run with --stacktrace option to get the stack trace. Run with --info or --debug option to get more log output.

BUILD FAILED

Total time: 43 mins 51.624 secs
Build step 'Execute shell' marked build as failure
Recording test results
Setting GRADLE_2_4_RC_2_HOME=/home/jenkins/jenkins-slave/tools/hudson.plugins.gradle.GradleInstallation/Gradle_2.4-rc-2
Setting GRADLE_2_4_RC_2_HOME=/home/jenkins/jenkins-slave/tools/hudson.plugins.gradle.GradleInstallation/Gradle_2.4-rc-2