You are viewing a plain text version of this content. The canonical link for it is here.
Posted to commits@logging.apache.org by Apache Jenkins Server <je...@builds.apache.org> on 2017/07/20 16:23:25 UTC

Build failed in Jenkins: logging-log4net » PR-1 #36

See <https://builds.apache.org/job/logging-log4net/job/PR-1/36/display/redirect>

------------------------------------------
[...truncated 15.03 KB...]
     [exec] The .NET Core tools collect usage data in order to improve your experience. The data is anonymous and does not include command-line arguments. The data is collected by Microsoft and shared with the community.
     [exec] You can opt out of telemetry by setting a DOTNET_CLI_TELEMETRY_OPTOUT environment variable to 1 using your favorite shell.
     [exec] You can read more about .NET Core tools telemetry @ https://aka.ms/dotnet-cli-telemetry.
     [exec] 
     [exec] Configuring...
     [exec] -------------------
     [exec] A command is running to initially populate your local package cache, to improve restore speed and enable offline access. This command will take up to a minute to complete and will only happen once.
     [exec] Decompressing 0%Decompressing 1%Decompressing 2%Decompressing 3%Decompressing 4%Decompressing 5%Decompressing 6%Decompressing 7%Decompressing 8%Decompressing 9%Decompressing 10%Decompressing 11%Decompressing 12%Decompressing 13%Decompressing 14%Decompressing 15%Decompressing 16%Decompressing 17%Decompressing 18%Decompressing 19%Decompressing 20%Decompressing 21%Decompressing 22%Decompressing 23%Decompressing 24%Decompressing 25%Decompressing 26%Decompressing 27%Decompressing 28%Decompressing 29%Decompressing 30%Decompressing 31%Decompressing 32%Decompressing 33%Decompressing 34%Decompressing 35%Decompressing 36%Decompressing 37%Decompressing 38%Decompressing 39%Decompressing 40%Decompressing 41%Decompressing 42%Decompressing 43%Decompressing 44%Decompressing 45%Decompressing 46%Decompressing 47%Decompressing 48%Decompressing 49%Decompressing 50%Decompressing 51%Decompressing 52%Decompressing 53%Decompressing 54%Decompressing 55%Decompressing 56%Decompressing 57%Decompressing 58%Decompressing 59%Decompressing 60%Decompressing 61%Decompressing 62%Decompressing 63%Decompressing 64%Decompressing 65%Decompressing 66%Decompressing 67%Decompressing 68%Decompressing 69%Decompressing 70%Decompressing 71%Decompressing 72%Decompressing 73%Decompressing 74%Decompressing 75%Decompressing 76%Decompressing 77%Decompressing 78%Decompressing 79%Decompressing 80%Decompressing 81%Decompressing 82%Decompressing 83%Decompressing 84%Decompressing 85%Decompressing 86%Decompressing 87%Decompressing 88%Decompressing 89%Decompressing 90%Decompressing 91%Decompressing 92%Decompressing 93%Decompressing 94%Decompressing 95%Decompressing 96%Decompressing 97%Decompressing 98%Decompressing 99%Decompressing 100% 6205 ms
     [exec] Expanding 0%Expanding 1%Expanding 2%Expanding 3%Expanding 4%Expanding 5%Expanding 6%Expanding 7%Expanding 8%Expanding 9%Expanding 10%Expanding 11%Expanding 12%Expanding 13%Expanding 14%Expanding 15%Expanding 16%Expanding 17%Expanding 18%Expanding 19%Expanding 20%Expanding 21%Expanding 22%Expanding 23%Expanding 24%Expanding 25%Expanding 26%Expanding 27%Expanding 28%Expanding 29%Expanding 30%Expanding 31%Expanding 32%Expanding 33%Expanding 34%Expanding 35%Expanding 36%Expanding 37%Expanding 38%Expanding 39%Expanding 40%Expanding 41%Expanding 42%Expanding 43%Expanding 44%Expanding 45%Expanding 46%Expanding 47%Expanding 48%Expanding 49%Expanding 50%Expanding 51%Expanding 52%Expanding 53%Expanding 54%Expanding 55%Expanding 56%Expanding 57%Expanding 58%Expanding 59%Expanding 60%Expanding 61%Expanding 62%Expanding 63%Expanding 64%Expanding 65%Expanding 66%Expanding 67%Expanding 68%Expanding 69%Expanding 70%Expanding 71%Expanding 72%Expanding 73%Expanding 74%Expanding 75%Expanding 76%Expanding 77%Expanding 78%Expanding 79%Expanding 80%Expanding 81%Expanding 82%Expanding 83%Expanding 84%Expanding 85%Expanding 86%Expanding 87%Expanding 88%Expanding 89%Expanding 90%Expanding 91%Expanding 92%Expanding 93%Expanding 94%Expanding 95%Expanding 96%Expanding 97%Expanding 98%Expanding 99%Expanding 100% 5211 ms
     [exec]   Restoring packages for /home/jenkins/jenkins-slave/workspace/logging-log4net_PR-1-M7ZPLFZLL73IPXISLYO4GQBIZ6ETV2ZDBKCZX4H7HI63IOI75V6Q/netstandard/log4net/log4net.csproj...
     [exec]   Restoring packages for /home/jenkins/jenkins-slave/workspace/logging-log4net_PR-1-M7ZPLFZLL73IPXISLYO4GQBIZ6ETV2ZDBKCZX4H7HI63IOI75V6Q/netstandard/log4net.tests/log4net.tests.csproj...
     [exec]   Installing System.Runtime.Serialization.Formatters 4.3.0.
     [exec]   Installing System.Diagnostics.TraceSource 4.0.0.
     [exec] /usr/share/dotnet/sdk/1.0.4/NuGet.targets(97,5): warning : Detected package downgrade: System.AppContext from 4.3.0 to 4.1.0  [/home/jenkins/jenkins-slave/workspace/logging-log4net_PR-1-M7ZPLFZLL73IPXISLYO4GQBIZ6ETV2ZDBKCZX4H7HI63IOI75V6Q/netstandard/log4net.netstandard.sln]
     [exec] /usr/share/dotnet/sdk/1.0.4/NuGet.targets(97,5): warning :  log4net (>= 2.0.9) -> NETStandard.Library (>= 1.6.1) -> System.AppContext (>= 4.3.0)  [/home/jenkins/jenkins-slave/workspace/logging-log4net_PR-1-M7ZPLFZLL73IPXISLYO4GQBIZ6ETV2ZDBKCZX4H7HI63IOI75V6Q/netstandard/log4net.netstandard.sln]
     [exec] /usr/share/dotnet/sdk/1.0.4/NuGet.targets(97,5): warning :  log4net (>= 2.0.9) -> System.AppContext (>= 4.1.0) [/home/jenkins/jenkins-slave/workspace/logging-log4net_PR-1-M7ZPLFZLL73IPXISLYO4GQBIZ6ETV2ZDBKCZX4H7HI63IOI75V6Q/netstandard/log4net.netstandard.sln]
     [exec] /usr/share/dotnet/sdk/1.0.4/NuGet.targets(97,5): warning : Detected package downgrade: System.Console from 4.3.0 to 4.0.0  [/home/jenkins/jenkins-slave/workspace/logging-log4net_PR-1-M7ZPLFZLL73IPXISLYO4GQBIZ6ETV2ZDBKCZX4H7HI63IOI75V6Q/netstandard/log4net.netstandard.sln]
     [exec] /usr/share/dotnet/sdk/1.0.4/NuGet.targets(97,5): warning :  log4net (>= 2.0.9) -> NETStandard.Library (>= 1.6.1) -> System.Console (>= 4.3.0)  [/home/jenkins/jenkins-slave/workspace/logging-log4net_PR-1-M7ZPLFZLL73IPXISLYO4GQBIZ6ETV2ZDBKCZX4H7HI63IOI75V6Q/netstandard/log4net.netstandard.sln]
     [exec] /usr/share/dotnet/sdk/1.0.4/NuGet.targets(97,5): warning :  log4net (>= 2.0.9) -> System.Console (>= 4.0.0) [/home/jenkins/jenkins-slave/workspace/logging-log4net_PR-1-M7ZPLFZLL73IPXISLYO4GQBIZ6ETV2ZDBKCZX4H7HI63IOI75V6Q/netstandard/log4net.netstandard.sln]
     [exec] /usr/share/dotnet/sdk/1.0.4/NuGet.targets(97,5): warning : Detected package downgrade: System.Diagnostics.Debug from 4.3.0 to 4.0.11  [/home/jenkins/jenkins-slave/workspace/logging-log4net_PR-1-M7ZPLFZLL73IPXISLYO4GQBIZ6ETV2ZDBKCZX4H7HI63IOI75V6Q/netstandard/log4net.netstandard.sln]
     [exec] /usr/share/dotnet/sdk/1.0.4/NuGet.targets(97,5): warning :  log4net (>= 2.0.9) -> NETStandard.Library (>= 1.6.1) -> System.Diagnostics.Debug (>= 4.3.0)  [/home/jenkins/jenkins-slave/workspace/logging-log4net_PR-1-M7ZPLFZLL73IPXISLYO4GQBIZ6ETV2ZDBKCZX4H7HI63IOI75V6Q/netstandard/log4net.netstandard.sln]
     [exec] /usr/share/dotnet/sdk/1.0.4/NuGet.targets(97,5): warning :  log4net (>= 2.0.9) -> System.Diagnostics.Debug (>= 4.0.11) [/home/jenkins/jenkins-slave/workspace/logging-log4net_PR-1-M7ZPLFZLL73IPXISLYO4GQBIZ6ETV2ZDBKCZX4H7HI63IOI75V6Q/netstandard/log4net.netstandard.sln]
     [exec] /usr/share/dotnet/sdk/1.0.4/NuGet.targets(97,5): warning : Detected package downgrade: System.IO.FileSystem from 4.3.0 to 4.0.1  [/home/jenkins/jenkins-slave/workspace/logging-log4net_PR-1-M7ZPLFZLL73IPXISLYO4GQBIZ6ETV2ZDBKCZX4H7HI63IOI75V6Q/netstandard/log4net.netstandard.sln]
     [exec] /usr/share/dotnet/sdk/1.0.4/NuGet.targets(97,5): warning :  log4net (>= 2.0.9) -> NETStandard.Library (>= 1.6.1) -> System.IO.FileSystem (>= 4.3.0)  [/home/jenkins/jenkins-slave/workspace/logging-log4net_PR-1-M7ZPLFZLL73IPXISLYO4GQBIZ6ETV2ZDBKCZX4H7HI63IOI75V6Q/netstandard/log4net.netstandard.sln]
     [exec] /usr/share/dotnet/sdk/1.0.4/NuGet.targets(97,5): warning :  log4net (>= 2.0.9) -> System.IO.FileSystem (>= 4.0.1) [/home/jenkins/jenkins-slave/workspace/logging-log4net_PR-1-M7ZPLFZLL73IPXISLYO4GQBIZ6ETV2ZDBKCZX4H7HI63IOI75V6Q/netstandard/log4net.netstandard.sln]
     [exec] /usr/share/dotnet/sdk/1.0.4/NuGet.targets(97,5): warning : Detected package downgrade: System.Linq from 4.3.0 to 4.1.0  [/home/jenkins/jenkins-slave/workspace/logging-log4net_PR-1-M7ZPLFZLL73IPXISLYO4GQBIZ6ETV2ZDBKCZX4H7HI63IOI75V6Q/netstandard/log4net.netstandard.sln]
     [exec] /usr/share/dotnet/sdk/1.0.4/NuGet.targets(97,5): warning :  log4net (>= 2.0.9) -> NETStandard.Library (>= 1.6.1) -> System.Linq (>= 4.3.0)  [/home/jenkins/jenkins-slave/workspace/logging-log4net_PR-1-M7ZPLFZLL73IPXISLYO4GQBIZ6ETV2ZDBKCZX4H7HI63IOI75V6Q/netstandard/log4net.netstandard.sln]
     [exec] /usr/share/dotnet/sdk/1.0.4/NuGet.targets(97,5): warning :  log4net (>= 2.0.9) -> System.Linq (>= 4.1.0) [/home/jenkins/jenkins-slave/workspace/logging-log4net_PR-1-M7ZPLFZLL73IPXISLYO4GQBIZ6ETV2ZDBKCZX4H7HI63IOI75V6Q/netstandard/log4net.netstandard.sln]
     [exec] /usr/share/dotnet/sdk/1.0.4/NuGet.targets(97,5): warning : Detected package downgrade: System.Net.Sockets from 4.3.0 to 4.1.0  [/home/jenkins/jenkins-slave/workspace/logging-log4net_PR-1-M7ZPLFZLL73IPXISLYO4GQBIZ6ETV2ZDBKCZX4H7HI63IOI75V6Q/netstandard/log4net.netstandard.sln]
     [exec] /usr/share/dotnet/sdk/1.0.4/NuGet.targets(97,5): warning :  log4net (>= 2.0.9) -> NETStandard.Library (>= 1.6.1) -> System.Net.Sockets (>= 4.3.0)  [/home/jenkins/jenkins-slave/workspace/logging-log4net_PR-1-M7ZPLFZLL73IPXISLYO4GQBIZ6ETV2ZDBKCZX4H7HI63IOI75V6Q/netstandard/log4net.netstandard.sln]
     [exec] /usr/share/dotnet/sdk/1.0.4/NuGet.targets(97,5): warning :  log4net (>= 2.0.9) -> System.Net.Sockets (>= 4.1.0) [/home/jenkins/jenkins-slave/workspace/logging-log4net_PR-1-M7ZPLFZLL73IPXISLYO4GQBIZ6ETV2ZDBKCZX4H7HI63IOI75V6Q/netstandard/log4net.netstandard.sln]
     [exec] /usr/share/dotnet/sdk/1.0.4/NuGet.targets(97,5): warning : Detected package downgrade: System.Reflection.Extensions from 4.3.0 to 4.0.1  [/home/jenkins/jenkins-slave/workspace/logging-log4net_PR-1-M7ZPLFZLL73IPXISLYO4GQBIZ6ETV2ZDBKCZX4H7HI63IOI75V6Q/netstandard/log4net.netstandard.sln]
     [exec] /usr/share/dotnet/sdk/1.0.4/NuGet.targets(97,5): warning :  log4net (>= 2.0.9) -> NETStandard.Library (>= 1.6.1) -> System.Reflection.Extensions (>= 4.3.0)  [/home/jenkins/jenkins-slave/workspace/logging-log4net_PR-1-M7ZPLFZLL73IPXISLYO4GQBIZ6ETV2ZDBKCZX4H7HI63IOI75V6Q/netstandard/log4net.netstandard.sln]
     [exec] /usr/share/dotnet/sdk/1.0.4/NuGet.targets(97,5): warning :  log4net (>= 2.0.9) -> System.Reflection.Extensions (>= 4.0.1) [/home/jenkins/jenkins-slave/workspace/logging-log4net_PR-1-M7ZPLFZLL73IPXISLYO4GQBIZ6ETV2ZDBKCZX4H7HI63IOI75V6Q/netstandard/log4net.netstandard.sln]
     [exec] /usr/share/dotnet/sdk/1.0.4/NuGet.targets(97,5): warning : Detected package downgrade: System.Runtime.Extensions from 4.3.0 to 4.1.0  [/home/jenkins/jenkins-slave/workspace/logging-log4net_PR-1-M7ZPLFZLL73IPXISLYO4GQBIZ6ETV2ZDBKCZX4H7HI63IOI75V6Q/netstandard/log4net.netstandard.sln]
     [exec] /usr/share/dotnet/sdk/1.0.4/NuGet.targets(97,5): warning :  log4net (>= 2.0.9) -> NETStandard.Library (>= 1.6.1) -> System.Runtime.Extensions (>= 4.3.0)  [/home/jenkins/jenkins-slave/workspace/logging-log4net_PR-1-M7ZPLFZLL73IPXISLYO4GQBIZ6ETV2ZDBKCZX4H7HI63IOI75V6Q/netstandard/log4net.netstandard.sln]
     [exec] /usr/share/dotnet/sdk/1.0.4/NuGet.targets(97,5): warning :  log4net (>= 2.0.9) -> System.Runtime.Extensions (>= 4.1.0) [/home/jenkins/jenkins-slave/workspace/logging-log4net_PR-1-M7ZPLFZLL73IPXISLYO4GQBIZ6ETV2ZDBKCZX4H7HI63IOI75V6Q/netstandard/log4net.netstandard.sln]
     [exec] /usr/share/dotnet/sdk/1.0.4/NuGet.targets(97,5): warning : Detected package downgrade: System.Runtime.InteropServices from 4.3.0 to 4.1.0  [/home/jenkins/jenkins-slave/workspace/logging-log4net_PR-1-M7ZPLFZLL73IPXISLYO4GQBIZ6ETV2ZDBKCZX4H7HI63IOI75V6Q/netstandard/log4net.netstandard.sln]
     [exec] /usr/share/dotnet/sdk/1.0.4/NuGet.targets(97,5): warning :  log4net (>= 2.0.9) -> NETStandard.Library (>= 1.6.1) -> System.Runtime.InteropServices (>= 4.3.0)  [/home/jenkins/jenkins-slave/workspace/logging-log4net_PR-1-M7ZPLFZLL73IPXISLYO4GQBIZ6ETV2ZDBKCZX4H7HI63IOI75V6Q/netstandard/log4net.netstandard.sln]
     [exec] /usr/share/dotnet/sdk/1.0.4/NuGet.targets(97,5): warning :  log4net (>= 2.0.9) -> System.Runtime.InteropServices (>= 4.1.0) [/home/jenkins/jenkins-slave/workspace/logging-log4net_PR-1-M7ZPLFZLL73IPXISLYO4GQBIZ6ETV2ZDBKCZX4H7HI63IOI75V6Q/netstandard/log4net.netstandard.sln]
     [exec] /usr/share/dotnet/sdk/1.0.4/NuGet.targets(97,5): warning : Detected package downgrade: System.Runtime.InteropServices.RuntimeInformation from 4.3.0 to 4.0.0  [/home/jenkins/jenkins-slave/workspace/logging-log4net_PR-1-M7ZPLFZLL73IPXISLYO4GQBIZ6ETV2ZDBKCZX4H7HI63IOI75V6Q/netstandard/log4net.netstandard.sln]
     [exec] /usr/share/dotnet/sdk/1.0.4/NuGet.targets(97,5): warning :  log4net (>= 2.0.9) -> NETStandard.Library (>= 1.6.1) -> System.Runtime.InteropServices.RuntimeInformation (>= 4.3.0)  [/home/jenkins/jenkins-slave/workspace/logging-log4net_PR-1-M7ZPLFZLL73IPXISLYO4GQBIZ6ETV2ZDBKCZX4H7HI63IOI75V6Q/netstandard/log4net.netstandard.sln]
     [exec] /usr/share/dotnet/sdk/1.0.4/NuGet.targets(97,5): warning :  log4net (>= 2.0.9) -> System.Runtime.InteropServices.RuntimeInformation (>= 4.0.0) [/home/jenkins/jenkins-slave/workspace/logging-log4net_PR-1-M7ZPLFZLL73IPXISLYO4GQBIZ6ETV2ZDBKCZX4H7HI63IOI75V6Q/netstandard/log4net.netstandard.sln]
     [exec] /usr/share/dotnet/sdk/1.0.4/NuGet.targets(97,5): warning : Detected package downgrade: System.Text.RegularExpressions from 4.3.0 to 4.1.0  [/home/jenkins/jenkins-slave/workspace/logging-log4net_PR-1-M7ZPLFZLL73IPXISLYO4GQBIZ6ETV2ZDBKCZX4H7HI63IOI75V6Q/netstandard/log4net.netstandard.sln]
     [exec] /usr/share/dotnet/sdk/1.0.4/NuGet.targets(97,5): warning :  log4net (>= 2.0.9) -> NETStandard.Library (>= 1.6.1) -> System.Text.RegularExpressions (>= 4.3.0)  [/home/jenkins/jenkins-slave/workspace/logging-log4net_PR-1-M7ZPLFZLL73IPXISLYO4GQBIZ6ETV2ZDBKCZX4H7HI63IOI75V6Q/netstandard/log4net.netstandard.sln]
     [exec] /usr/share/dotnet/sdk/1.0.4/NuGet.targets(97,5): warning :  log4net (>= 2.0.9) -> System.Text.RegularExpressions (>= 4.1.0) [/home/jenkins/jenkins-slave/workspace/logging-log4net_PR-1-M7ZPLFZLL73IPXISLYO4GQBIZ6ETV2ZDBKCZX4H7HI63IOI75V6Q/netstandard/log4net.netstandard.sln]
     [exec] /usr/share/dotnet/sdk/1.0.4/NuGet.targets(97,5): warning : Detected package downgrade: System.Threading from 4.3.0 to 4.0.11  [/home/jenkins/jenkins-slave/workspace/logging-log4net_PR-1-M7ZPLFZLL73IPXISLYO4GQBIZ6ETV2ZDBKCZX4H7HI63IOI75V6Q/netstandard/log4net.netstandard.sln]
     [exec] /usr/share/dotnet/sdk/1.0.4/NuGet.targets(97,5): warning :  log4net (>= 2.0.9) -> NETStandard.Library (>= 1.6.1) -> System.Threading (>= 4.3.0)  [/home/jenkins/jenkins-slave/workspace/logging-log4net_PR-1-M7ZPLFZLL73IPXISLYO4GQBIZ6ETV2ZDBKCZX4H7HI63IOI75V6Q/netstandard/log4net.netstandard.sln]
     [exec] /usr/share/dotnet/sdk/1.0.4/NuGet.targets(97,5): warning :  log4net (>= 2.0.9) -> System.Threading (>= 4.0.11) [/home/jenkins/jenkins-slave/workspace/logging-log4net_PR-1-M7ZPLFZLL73IPXISLYO4GQBIZ6ETV2ZDBKCZX4H7HI63IOI75V6Q/netstandard/log4net.netstandard.sln]
     [exec] /usr/share/dotnet/sdk/1.0.4/NuGet.targets(97,5): warning : Detected package downgrade: System.Threading.Timer from 4.3.0 to 4.0.1  [/home/jenkins/jenkins-slave/workspace/logging-log4net_PR-1-M7ZPLFZLL73IPXISLYO4GQBIZ6ETV2ZDBKCZX4H7HI63IOI75V6Q/netstandard/log4net.netstandard.sln]
     [exec] /usr/share/dotnet/sdk/1.0.4/NuGet.targets(97,5): warning :  log4net (>= 2.0.9) -> NETStandard.Library (>= 1.6.1) -> System.Threading.Timer (>= 4.3.0)  [/home/jenkins/jenkins-slave/workspace/logging-log4net_PR-1-M7ZPLFZLL73IPXISLYO4GQBIZ6ETV2ZDBKCZX4H7HI63IOI75V6Q/netstandard/log4net.netstandard.sln]
     [exec] /usr/share/dotnet/sdk/1.0.4/NuGet.targets(97,5): warning :  log4net (>= 2.0.9) -> System.Threading.Timer (>= 4.0.1) [/home/jenkins/jenkins-slave/workspace/logging-log4net_PR-1-M7ZPLFZLL73IPXISLYO4GQBIZ6ETV2ZDBKCZX4H7HI63IOI75V6Q/netstandard/log4net.netstandard.sln]
     [exec] /usr/share/dotnet/sdk/1.0.4/NuGet.targets(97,5): warning : Detected package downgrade: System.Xml.ReaderWriter from 4.3.0 to 4.0.11  [/home/jenkins/jenkins-slave/workspace/logging-log4net_PR-1-M7ZPLFZLL73IPXISLYO4GQBIZ6ETV2ZDBKCZX4H7HI63IOI75V6Q/netstandard/log4net.netstandard.sln]
     [exec] /usr/share/dotnet/sdk/1.0.4/NuGet.targets(97,5): warning :  log4net (>= 2.0.9) -> NETStandard.Library (>= 1.6.1) -> System.Xml.ReaderWriter (>= 4.3.0)  [/home/jenkins/jenkins-slave/workspace/logging-log4net_PR-1-M7ZPLFZLL73IPXISLYO4GQBIZ6ETV2ZDBKCZX4H7HI63IOI75V6Q/netstandard/log4net.netstandard.sln]
     [exec] /usr/share/dotnet/sdk/1.0.4/NuGet.targets(97,5): warning :  log4net (>= 2.0.9) -> System.Xml.ReaderWriter (>= 4.0.11) [/home/jenkins/jenkins-slave/workspace/logging-log4net_PR-1-M7ZPLFZLL73IPXISLYO4GQBIZ6ETV2ZDBKCZX4H7HI63IOI75V6Q/netstandard/log4net.netstandard.sln]
     [exec]   Generating MSBuild file /home/jenkins/jenkins-slave/workspace/logging-log4net_PR-1-M7ZPLFZLL73IPXISLYO4GQBIZ6ETV2ZDBKCZX4H7HI63IOI75V6Q/netstandard/log4net/obj/log4net.csproj.nuget.g.props.
     [exec]   Generating MSBuild file /home/jenkins/jenkins-slave/workspace/logging-log4net_PR-1-M7ZPLFZLL73IPXISLYO4GQBIZ6ETV2ZDBKCZX4H7HI63IOI75V6Q/netstandard/log4net/obj/log4net.csproj.nuget.g.targets.
     [exec]   Writing lock file to disk. Path: /home/jenkins/jenkins-slave/workspace/logging-log4net_PR-1-M7ZPLFZLL73IPXISLYO4GQBIZ6ETV2ZDBKCZX4H7HI63IOI75V6Q/netstandard/log4net/obj/project.assets.json
     [exec]   Restore completed in 976.64 ms for /home/jenkins/jenkins-slave/workspace/logging-log4net_PR-1-M7ZPLFZLL73IPXISLYO4GQBIZ6ETV2ZDBKCZX4H7HI63IOI75V6Q/netstandard/log4net/log4net.csproj.
     [exec]   Installing NuGet.Packaging.Core.Types 3.5.0-beta2-1484.
     [exec]   Installing System.Xml.XmlSerializer 4.0.11.
     [exec]   Installing NuGet.Packaging.Core 3.5.0-beta2-1484.
     [exec]   Installing NuGet.Common 3.5.0-beta2-1484.
     [exec]   Installing NuGet.Frameworks 3.5.0-beta2-1484.
     [exec]   Installing NuGet.Versioning 3.5.0-beta2-1484.
     [exec]   Installing System.Private.DataContractSerialization 4.1.1.
     [exec]   Installing NUnit 3.4.1.
     [exec]   Installing NuGet.Packaging 3.5.0-beta2-1484.
     [exec]   Installing NuGet.RuntimeModel 3.5.0-beta2-1484.
     [exec]   Installing Microsoft.NETCore.App 1.0.4.
     [exec]   Installing System.Runtime.Serialization.Json 4.0.2.
     [exec]   Installing Microsoft.NET.Test.Sdk 15.0.0-preview-20170106-08.
     [exec]   Installing System.ComponentModel.EventBasedAsync 4.0.11.
     [exec]   Installing System.Xml.XPath.XmlDocument 4.0.1.
     [exec]   Installing System.Diagnostics.TextWriterTraceListener 4.0.0.
     [exec]   Installing Microsoft.DotNet.ProjectModel 1.0.0-rc3-003121.
     [exec]   Installing dotnet-test-nunit 3.4.0-beta-2.
     [exec]   Installing System.Net.Http 4.1.1.
     [exec]   Installing Microsoft.DiaSymReader 1.0.8.
     [exec]   Installing Microsoft.DiaSymReader.Native 1.4.0-rc2.
     [exec]   Installing Microsoft.NETCore.DotNetHostPolicy 1.0.3.
     [exec]   Installing System.Net.Security 4.0.0.
     [exec]   Installing Microsoft.NETCore.Runtime.CoreCLR 1.0.6.
     [exec]   Installing Microsoft.TestPlatform.TestHost 15.0.0-preview-20170106-08.
     [exec]   Installing NUnit.Portable.Agent 3.4.0-beta-2.
     [exec]   Installing Microsoft.Extensions.Testing.Abstractions 1.0.0-preview2-003121.
     [exec]   Installing Microsoft.NETCore.Jit 1.0.6.
     [exec]   Installing Microsoft.TestPlatform.ObjectModel 15.0.0-preview-20170106-08.
     [exec] /usr/share/dotnet/sdk/1.0.4/NuGet.targets(97,5): warning : Detected package downgrade: System.AppContext from 4.3.0 to 4.1.0  [/home/jenkins/jenkins-slave/workspace/logging-log4net_PR-1-M7ZPLFZLL73IPXISLYO4GQBIZ6ETV2ZDBKCZX4H7HI63IOI75V6Q/netstandard/log4net.netstandard.sln]
     [exec] /usr/share/dotnet/sdk/1.0.4/NuGet.targets(97,5): warning :  log4net.tests (>= 2.0.9) -> log4net (>= 2.0.9) -> NETStandard.Library (>= 1.6.1) -> System.AppContext (>= 4.3.0)  [/home/jenkins/jenkins-slave/workspace/logging-log4net_PR-1-M7ZPLFZLL73IPXISLYO4GQBIZ6ETV2ZDBKCZX4H7HI63IOI75V6Q/netstandard/log4net.netstandard.sln]
     [exec] /usr/share/dotnet/sdk/1.0.4/NuGet.targets(97,5): warning :  log4net.tests (>= 2.0.9) -> log4net (>= 2.0.9) -> System.AppContext (>= 4.1.0) [/home/jenkins/jenkins-slave/workspace/logging-log4net_PR-1-M7ZPLFZLL73IPXISLYO4GQBIZ6ETV2ZDBKCZX4H7HI63IOI75V6Q/netstandard/log4net.netstandard.sln]
     [exec] /usr/share/dotnet/sdk/1.0.4/NuGet.targets(97,5): warning : Detected package downgrade: System.Console from 4.3.0 to 4.0.0  [/home/jenkins/jenkins-slave/workspace/logging-log4net_PR-1-M7ZPLFZLL73IPXISLYO4GQBIZ6ETV2ZDBKCZX4H7HI63IOI75V6Q/netstandard/log4net.netstandard.sln]
     [exec] /usr/share/dotnet/sdk/1.0.4/NuGet.targets(97,5): warning :  log4net.tests (>= 2.0.9) -> log4net (>= 2.0.9) -> NETStandard.Library (>= 1.6.1) -> System.Console (>= 4.3.0)  [/home/jenkins/jenkins-slave/workspace/logging-log4net_PR-1-M7ZPLFZLL73IPXISLYO4GQBIZ6ETV2ZDBKCZX4H7HI63IOI75V6Q/netstandard/log4net.netstandard.sln]
     [exec] /usr/share/dotnet/sdk/1.0.4/NuGet.targets(97,5): warning :  log4net.tests (>= 2.0.9) -> log4net (>= 2.0.9) -> System.Console (>= 4.0.0) [/home/jenkins/jenkins-slave/workspace/logging-log4net_PR-1-M7ZPLFZLL73IPXISLYO4GQBIZ6ETV2ZDBKCZX4H7HI63IOI75V6Q/netstandard/log4net.netstandard.sln]
     [exec] /usr/share/dotnet/sdk/1.0.4/NuGet.targets(97,5): warning : Detected package downgrade: System.Diagnostics.Debug from 4.3.0 to 4.0.11  [/home/jenkins/jenkins-slave/workspace/logging-log4net_PR-1-M7ZPLFZLL73IPXISLYO4GQBIZ6ETV2ZDBKCZX4H7HI63IOI75V6Q/netstandard/log4net.netstandard.sln]
     [exec] /usr/share/dotnet/sdk/1.0.4/NuGet.targets(97,5): warning :  log4net.tests (>= 2.0.9) -> log4net (>= 2.0.9) -> NETStandard.Library (>= 1.6.1) -> System.Diagnostics.Debug (>= 4.3.0)  [/home/jenkins/jenkins-slave/workspace/logging-log4net_PR-1-M7ZPLFZLL73IPXISLYO4GQBIZ6ETV2ZDBKCZX4H7HI63IOI75V6Q/netstandard/log4net.netstandard.sln]
     [exec] /usr/share/dotnet/sdk/1.0.4/NuGet.targets(97,5): warning :  log4net.tests (>= 2.0.9) -> log4net (>= 2.0.9) -> System.Diagnostics.Debug (>= 4.0.11) [/home/jenkins/jenkins-slave/workspace/logging-log4net_PR-1-M7ZPLFZLL73IPXISLYO4GQBIZ6ETV2ZDBKCZX4H7HI63IOI75V6Q/netstandard/log4net.netstandard.sln]
     [exec] /usr/share/dotnet/sdk/1.0.4/NuGet.targets(97,5): warning : Detected package downgrade: System.IO.FileSystem from 4.3.0 to 4.0.1  [/home/jenkins/jenkins-slave/workspace/logging-log4net_PR-1-M7ZPLFZLL73IPXISLYO4GQBIZ6ETV2ZDBKCZX4H7HI63IOI75V6Q/netstandard/log4net.netstandard.sln]
     [exec] /usr/share/dotnet/sdk/1.0.4/NuGet.targets(97,5): warning :  log4net.tests (>= 2.0.9) -> log4net (>= 2.0.9) -> NETStandard.Library (>= 1.6.1) -> System.IO.FileSystem (>= 4.3.0)  [/home/jenkins/jenkins-slave/workspace/logging-log4net_PR-1-M7ZPLFZLL73IPXISLYO4GQBIZ6ETV2ZDBKCZX4H7HI63IOI75V6Q/netstandard/log4net.netstandard.sln]
     [exec] /usr/share/dotnet/sdk/1.0.4/NuGet.targets(97,5): warning :  log4net.tests (>= 2.0.9) -> log4net (>= 2.0.9) -> System.IO.FileSystem (>= 4.0.1) [/home/jenkins/jenkins-slave/workspace/logging-log4net_PR-1-M7ZPLFZLL73IPXISLYO4GQBIZ6ETV2ZDBKCZX4H7HI63IOI75V6Q/netstandard/log4net.netstandard.sln]
     [exec] /usr/share/dotnet/sdk/1.0.4/NuGet.targets(97,5): warning : Detected package downgrade: System.Linq from 4.3.0 to 4.1.0  [/home/jenkins/jenkins-slave/workspace/logging-log4net_PR-1-M7ZPLFZLL73IPXISLYO4GQBIZ6ETV2ZDBKCZX4H7HI63IOI75V6Q/netstandard/log4net.netstandard.sln]
     [exec] /usr/share/dotnet/sdk/1.0.4/NuGet.targets(97,5): warning :  log4net.tests (>= 2.0.9) -> log4net (>= 2.0.9) -> NETStandard.Library (>= 1.6.1) -> System.Linq (>= 4.3.0)  [/home/jenkins/jenkins-slave/workspace/logging-log4net_PR-1-M7ZPLFZLL73IPXISLYO4GQBIZ6ETV2ZDBKCZX4H7HI63IOI75V6Q/netstandard/log4net.netstandard.sln]
     [exec] /usr/share/dotnet/sdk/1.0.4/NuGet.targets(97,5): warning :  log4net.tests (>= 2.0.9) -> log4net (>= 2.0.9) -> System.Linq (>= 4.1.0) [/home/jenkins/jenkins-slave/workspace/logging-log4net_PR-1-M7ZPLFZLL73IPXISLYO4GQBIZ6ETV2ZDBKCZX4H7HI63IOI75V6Q/netstandard/log4net.netstandard.sln]
     [exec] /usr/share/dotnet/sdk/1.0.4/NuGet.targets(97,5): warning : Detected package downgrade: System.Net.Sockets from 4.3.0 to 4.1.0  [/home/jenkins/jenkins-slave/workspace/logging-log4net_PR-1-M7ZPLFZLL73IPXISLYO4GQBIZ6ETV2ZDBKCZX4H7HI63IOI75V6Q/netstandard/log4net.netstandard.sln]
     [exec] /usr/share/dotnet/sdk/1.0.4/NuGet.targets(97,5): warning :  log4net.tests (>= 2.0.9) -> log4net (>= 2.0.9) -> NETStandard.Library (>= 1.6.1) -> System.Net.Sockets (>= 4.3.0)  [/home/jenkins/jenkins-slave/workspace/logging-log4net_PR-1-M7ZPLFZLL73IPXISLYO4GQBIZ6ETV2ZDBKCZX4H7HI63IOI75V6Q/netstandard/log4net.netstandard.sln]
     [exec] /usr/share/dotnet/sdk/1.0.4/NuGet.targets(97,5): warning :  log4net.tests (>= 2.0.9) -> log4net (>= 2.0.9) -> System.Net.Sockets (>= 4.1.0) [/home/jenkins/jenkins-slave/workspace/logging-log4net_PR-1-M7ZPLFZLL73IPXISLYO4GQBIZ6ETV2ZDBKCZX4H7HI63IOI75V6Q/netstandard/log4net.netstandard.sln]
     [exec] /usr/share/dotnet/sdk/1.0.4/NuGet.targets(97,5): warning : Detected package downgrade: System.Reflection.Extensions from 4.3.0 to 4.0.1  [/home/jenkins/jenkins-slave/workspace/logging-log4net_PR-1-M7ZPLFZLL73IPXISLYO4GQBIZ6ETV2ZDBKCZX4H7HI63IOI75V6Q/netstandard/log4net.netstandard.sln]
     [exec] /usr/share/dotnet/sdk/1.0.4/NuGet.targets(97,5): warning :  log4net.tests (>= 2.0.9) -> log4net (>= 2.0.9) -> NETStandard.Library (>= 1.6.1) -> System.Reflection.Extensions (>= 4.3.0)  [/home/jenkins/jenkins-slave/workspace/logging-log4net_PR-1-M7ZPLFZLL73IPXISLYO4GQBIZ6ETV2ZDBKCZX4H7HI63IOI75V6Q/netstandard/log4net.netstandard.sln]
     [exec] /usr/share/dotnet/sdk/1.0.4/NuGet.targets(97,5): warning :  log4net.tests (>= 2.0.9) -> log4net (>= 2.0.9) -> System.Reflection.Extensions (>= 4.0.1) [/home/jenkins/jenkins-slave/workspace/logging-log4net_PR-1-M7ZPLFZLL73IPXISLYO4GQBIZ6ETV2ZDBKCZX4H7HI63IOI75V6Q/netstandard/log4net.netstandard.sln]
     [exec] /usr/share/dotnet/sdk/1.0.4/NuGet.targets(97,5): warning : Detected package downgrade: System.Runtime.Extensions from 4.3.0 to 4.1.0  [/home/jenkins/jenkins-slave/workspace/logging-log4net_PR-1-M7ZPLFZLL73IPXISLYO4GQBIZ6ETV2ZDBKCZX4H7HI63IOI75V6Q/netstandard/log4net.netstandard.sln]
     [exec] /usr/share/dotnet/sdk/1.0.4/NuGet.targets(97,5): warning :  log4net.tests (>= 2.0.9) -> log4net (>= 2.0.9) -> NETStandard.Library (>= 1.6.1) -> System.Runtime.Extensions (>= 4.3.0)  [/home/jenkins/jenkins-slave/workspace/logging-log4net_PR-1-M7ZPLFZLL73IPXISLYO4GQBIZ6ETV2ZDBKCZX4H7HI63IOI75V6Q/netstandard/log4net.netstandard.sln]
     [exec] /usr/share/dotnet/sdk/1.0.4/NuGet.targets(97,5): warning :  log4net.tests (>= 2.0.9) -> log4net (>= 2.0.9) -> System.Runtime.Extensions (>= 4.1.0) [/home/jenkins/jenkins-slave/workspace/logging-log4net_PR-1-M7ZPLFZLL73IPXISLYO4GQBIZ6ETV2ZDBKCZX4H7HI63IOI75V6Q/netstandard/log4net.netstandard.sln]
     [exec] /usr/share/dotnet/sdk/1.0.4/NuGet.targets(97,5): warning : Detected package downgrade: System.Runtime.InteropServices from 4.3.0 to 4.1.0  [/home/jenkins/jenkins-slave/workspace/logging-log4net_PR-1-M7ZPLFZLL73IPXISLYO4GQBIZ6ETV2ZDBKCZX4H7HI63IOI75V6Q/netstandard/log4net.netstandard.sln]
     [exec] /usr/share/dotnet/sdk/1.0.4/NuGet.targets(97,5): warning :  log4net.tests (>= 2.0.9) -> log4net (>= 2.0.9) -> NETStandard.Library (>= 1.6.1) -> System.Runtime.InteropServices (>= 4.3.0)  [/home/jenkins/jenkins-slave/workspace/logging-log4net_PR-1-M7ZPLFZLL73IPXISLYO4GQBIZ6ETV2ZDBKCZX4H7HI63IOI75V6Q/netstandard/log4net.netstandard.sln]
     [exec] /usr/share/dotnet/sdk/1.0.4/NuGet.targets(97,5): warning :  log4net.tests (>= 2.0.9) -> log4net (>= 2.0.9) -> System.Runtime.InteropServices (>= 4.1.0) [/home/jenkins/jenkins-slave/workspace/logging-log4net_PR-1-M7ZPLFZLL73IPXISLYO4GQBIZ6ETV2ZDBKCZX4H7HI63IOI75V6Q/netstandard/log4net.netstandard.sln]
     [exec] /usr/share/dotnet/sdk/1.0.4/NuGet.targets(97,5): warning : Detected package downgrade: System.Runtime.InteropServices.RuntimeInformation from 4.3.0 to 4.0.0  [/home/jenkins/jenkins-slave/workspace/logging-log4net_PR-1-M7ZPLFZLL73IPXISLYO4GQBIZ6ETV2ZDBKCZX4H7HI63IOI75V6Q/netstandard/log4net.netstandard.sln]
     [exec] /usr/share/dotnet/sdk/1.0.4/NuGet.targets(97,5): warning :  log4net.tests (>= 2.0.9) -> log4net (>= 2.0.9) -> NETStandard.Library (>= 1.6.1) -> System.Runtime.InteropServices.RuntimeInformation (>= 4.3.0)  [/home/jenkins/jenkins-slave/workspace/logging-log4net_PR-1-M7ZPLFZLL73IPXISLYO4GQBIZ6ETV2ZDBKCZX4H7HI63IOI75V6Q/netstandard/log4net.netstandard.sln]
     [exec] /usr/share/dotnet/sdk/1.0.4/NuGet.targets(97,5): warning :  log4net.tests (>= 2.0.9) -> log4net (>= 2.0.9) -> System.Runtime.InteropServices.RuntimeInformation (>= 4.0.0) [/home/jenkins/jenkins-slave/workspace/logging-log4net_PR-1-M7ZPLFZLL73IPXISLYO4GQBIZ6ETV2ZDBKCZX4H7HI63IOI75V6Q/netstandard/log4net.netstandard.sln]
     [exec] /usr/share/dotnet/sdk/1.0.4/NuGet.targets(97,5): warning : Detected package downgrade: System.Text.RegularExpressions from 4.3.0 to 4.1.0  [/home/jenkins/jenkins-slave/workspace/logging-log4net_PR-1-M7ZPLFZLL73IPXISLYO4GQBIZ6ETV2ZDBKCZX4H7HI63IOI75V6Q/netstandard/log4net.netstandard.sln]
     [exec] /usr/share/dotnet/sdk/1.0.4/NuGet.targets(97,5): warning :  log4net.tests (>= 2.0.9) -> log4net (>= 2.0.9) -> NETStandard.Library (>= 1.6.1) -> System.Text.RegularExpressions (>= 4.3.0)  [/home/jenkins/jenkins-slave/workspace/logging-log4net_PR-1-M7ZPLFZLL73IPXISLYO4GQBIZ6ETV2ZDBKCZX4H7HI63IOI75V6Q/netstandard/log4net.netstandard.sln]
     [exec] /usr/share/dotnet/sdk/1.0.4/NuGet.targets(97,5): warning :  log4net.tests (>= 2.0.9) -> log4net (>= 2.0.9) -> System.Text.RegularExpressions (>= 4.1.0) [/home/jenkins/jenkins-slave/workspace/logging-log4net_PR-1-M7ZPLFZLL73IPXISLYO4GQBIZ6ETV2ZDBKCZX4H7HI63IOI75V6Q/netstandard/log4net.netstandard.sln]
     [exec] /usr/share/dotnet/sdk/1.0.4/NuGet.targets(97,5): warning : Detected package downgrade: System.Threading from 4.3.0 to 4.0.11  [/home/jenkins/jenkins-slave/workspace/logging-log4net_PR-1-M7ZPLFZLL73IPXISLYO4GQBIZ6ETV2ZDBKCZX4H7HI63IOI75V6Q/netstandard/log4net.netstandard.sln]
     [exec] /usr/share/dotnet/sdk/1.0.4/NuGet.targets(97,5): warning :  log4net.tests (>= 2.0.9) -> log4net (>= 2.0.9) -> NETStandard.Library (>= 1.6.1) -> System.Threading (>= 4.3.0)  [/home/jenkins/jenkins-slave/workspace/logging-log4net_PR-1-M7ZPLFZLL73IPXISLYO4GQBIZ6ETV2ZDBKCZX4H7HI63IOI75V6Q/netstandard/log4net.netstandard.sln]
     [exec] /usr/share/dotnet/sdk/1.0.4/NuGet.targets(97,5): warning :  log4net.tests (>= 2.0.9) -> log4net (>= 2.0.9) -> System.Threading (>= 4.0.11) [/home/jenkins/jenkins-slave/workspace/logging-log4net_PR-1-M7ZPLFZLL73IPXISLYO4GQBIZ6ETV2ZDBKCZX4H7HI63IOI75V6Q/netstandard/log4net.netstandard.sln]
     [exec] /usr/share/dotnet/sdk/1.0.4/NuGet.targets(97,5): warning : Detected package downgrade: System.Threading.Timer from 4.3.0 to 4.0.1  [/home/jenkins/jenkins-slave/workspace/logging-log4net_PR-1-M7ZPLFZLL73IPXISLYO4GQBIZ6ETV2ZDBKCZX4H7HI63IOI75V6Q/netstandard/log4net.netstandard.sln]
     [exec] /usr/share/dotnet/sdk/1.0.4/NuGet.targets(97,5): warning :  log4net.tests (>= 2.0.9) -> log4net (>= 2.0.9) -> NETStandard.Library (>= 1.6.1) -> System.Threading.Timer (>= 4.3.0)  [/home/jenkins/jenkins-slave/workspace/logging-log4net_PR-1-M7ZPLFZLL73IPXISLYO4GQBIZ6ETV2ZDBKCZX4H7HI63IOI75V6Q/netstandard/log4net.netstandard.sln]
     [exec] /usr/share/dotnet/sdk/1.0.4/NuGet.targets(97,5): warning :  log4net.tests (>= 2.0.9) -> log4net (>= 2.0.9) -> System.Threading.Timer (>= 4.0.1) [/home/jenkins/jenkins-slave/workspace/logging-log4net_PR-1-M7ZPLFZLL73IPXISLYO4GQBIZ6ETV2ZDBKCZX4H7HI63IOI75V6Q/netstandard/log4net.netstandard.sln]
     [exec] /usr/share/dotnet/sdk/1.0.4/NuGet.targets(97,5): warning : Detected package downgrade: System.Xml.ReaderWriter from 4.3.0 to 4.0.11  [/home/jenkins/jenkins-slave/workspace/logging-log4net_PR-1-M7ZPLFZLL73IPXISLYO4GQBIZ6ETV2ZDBKCZX4H7HI63IOI75V6Q/netstandard/log4net.netstandard.sln]
     [exec] /usr/share/dotnet/sdk/1.0.4/NuGet.targets(97,5): warning :  log4net.tests (>= 2.0.9) -> log4net (>= 2.0.9) -> NETStandard.Library (>= 1.6.1) -> System.Xml.ReaderWriter (>= 4.3.0)  [/home/jenkins/jenkins-slave/workspace/logging-log4net_PR-1-M7ZPLFZLL73IPXISLYO4GQBIZ6ETV2ZDBKCZX4H7HI63IOI75V6Q/netstandard/log4net.netstandard.sln]
     [exec] /usr/share/dotnet/sdk/1.0.4/NuGet.targets(97,5): warning :  log4net.tests (>= 2.0.9) -> log4net (>= 2.0.9) -> System.Xml.ReaderWriter (>= 4.0.11) [/home/jenkins/jenkins-slave/workspace/logging-log4net_PR-1-M7ZPLFZLL73IPXISLYO4GQBIZ6ETV2ZDBKCZX4H7HI63IOI75V6Q/netstandard/log4net.netstandard.sln]
     [exec] /usr/share/dotnet/sdk/1.0.4/NuGet.targets(97,5): warning : Detected package downgrade: System.Reflection.TypeExtensions from 4.3.0 to 4.1.0  [/home/jenkins/jenkins-slave/workspace/logging-log4net_PR-1-M7ZPLFZLL73IPXISLYO4GQBIZ6ETV2ZDBKCZX4H7HI63IOI75V6Q/netstandard/log4net.netstandard.sln]
     [exec] /usr/share/dotnet/sdk/1.0.4/NuGet.targets(97,5): warning :  log4net.tests (>= 2.0.9) -> log4net (>= 2.0.9) -> NETStandard.Library (>= 1.6.1) -> System.Linq.Expressions (>= 4.3.0) -> System.Reflection.TypeExtensions (>= 4.3.0)  [/home/jenkins/jenkins-slave/workspace/logging-log4net_PR-1-M7ZPLFZLL73IPXISLYO4GQBIZ6ETV2ZDBKCZX4H7HI63IOI75V6Q/netstandard/log4net.netstandard.sln]
     [exec] /usr/share/dotnet/sdk/1.0.4/NuGet.targets(97,5): warning :  log4net.tests (>= 2.0.9) -> log4net (>= 2.0.9) -> System.Reflection.TypeExtensions (>= 4.1.0) [/home/jenkins/jenkins-slave/workspace/logging-log4net_PR-1-M7ZPLFZLL73IPXISLYO4GQBIZ6ETV2ZDBKCZX4H7HI63IOI75V6Q/netstandard/log4net.netstandard.sln]
     [exec]   Generating MSBuild file /home/jenkins/jenkins-slave/workspace/logging-log4net_PR-1-M7ZPLFZLL73IPXISLYO4GQBIZ6ETV2ZDBKCZX4H7HI63IOI75V6Q/netstandard/log4net.tests/obj/log4net.tests.csproj.nuget.g.props.
     [exec]   Generating MSBuild file /home/jenkins/jenkins-slave/workspace/logging-log4net_PR-1-M7ZPLFZLL73IPXISLYO4GQBIZ6ETV2ZDBKCZX4H7HI63IOI75V6Q/netstandard/log4net.tests/obj/log4net.tests.csproj.nuget.g.targets.
     [exec]   Writing lock file to disk. Path: /home/jenkins/jenkins-slave/workspace/logging-log4net_PR-1-M7ZPLFZLL73IPXISLYO4GQBIZ6ETV2ZDBKCZX4H7HI63IOI75V6Q/netstandard/log4net.tests/obj/project.assets.json
     [exec]   Restore completed in 4.35 sec for /home/jenkins/jenkins-slave/workspace/logging-log4net_PR-1-M7ZPLFZLL73IPXISLYO4GQBIZ6ETV2ZDBKCZX4H7HI63IOI75V6Q/netstandard/log4net.tests/log4net.tests.csproj.
     [exec]   
     [exec]   NuGet Config files used:
     [exec]       /var/workspaces/jenkins/.nuget/NuGet/NuGet.Config
     [exec]   
     [exec]   Feeds used:
     [exec]       https://api.nuget.org/v3/index.json
     [exec]   
     [exec]   Installed:
     [exec]       2 package(s) to /home/jenkins/jenkins-slave/workspace/logging-log4net_PR-1-M7ZPLFZLL73IPXISLYO4GQBIZ6ETV2ZDBKCZX4H7HI63IOI75V6Q/netstandard/log4net/log4net.csproj
     [exec]       31 package(s) to /home/jenkins/jenkins-slave/workspace/logging-log4net_PR-1-M7ZPLFZLL73IPXISLYO4GQBIZ6ETV2ZDBKCZX4H7HI63IOI75V6Q/netstandard/log4net.tests/log4net.tests.csproj
     [echo] dotnet build log4net
     [exec] Microsoft (R) Build Engine version 15.1.1012.6693
     [exec] Copyright (C) Microsoft Corporation. All rights reserved.
     [exec] 
     [exec] /home/jenkins/jenkins-slave/workspace/logging-log4net_PR-1-M7ZPLFZLL73IPXISLYO4GQBIZ6ETV2ZDBKCZX4H7HI63IOI75V6Q/src/log4net/Appender/ColoredSmtpAppender.cs(5,18): error CS0234: The type or namespace name 'Mail' does not exist in the namespace 'System.Net' (are you missing an assembly reference?) [/home/jenkins/jenkins-slave/workspace/logging-log4net_PR-1-M7ZPLFZLL73IPXISLYO4GQBIZ6ETV2ZDBKCZX4H7HI63IOI75V6Q/netstandard/log4net/log4net.csproj]
     [exec] /home/jenkins/jenkins-slave/workspace/logging-log4net_PR-1-M7ZPLFZLL73IPXISLYO4GQBIZ6ETV2ZDBKCZX4H7HI63IOI75V6Q/src/log4net/Appender/ColoredSmtpAppender.cs(7,14): error CS0234: The type or namespace name 'Web' does not exist in the namespace 'System' (are you missing an assembly reference?) [/home/jenkins/jenkins-slave/workspace/logging-log4net_PR-1-M7ZPLFZLL73IPXISLYO4GQBIZ6ETV2ZDBKCZX4H7HI63IOI75V6Q/netstandard/log4net/log4net.csproj]
     [exec] /home/jenkins/jenkins-slave/workspace/logging-log4net_PR-1-M7ZPLFZLL73IPXISLYO4GQBIZ6ETV2ZDBKCZX4H7HI63IOI75V6Q/src/log4net/Appender/ColoredSmtpAppender.cs(49,40): error CS0246: The type or namespace name 'SmtpAppender' could not be found (are you missing a using directive or an assembly reference?) [/home/jenkins/jenkins-slave/workspace/logging-log4net_PR-1-M7ZPLFZLL73IPXISLYO4GQBIZ6ETV2ZDBKCZX4H7HI63IOI75V6Q/netstandard/log4net/log4net.csproj]
     [exec] /home/jenkins/jenkins-slave/workspace/logging-log4net_PR-1-M7ZPLFZLL73IPXISLYO4GQBIZ6ETV2ZDBKCZX4H7HI63IOI75V6Q/src/log4net/Appender/ColoredSmtpAppender.cs(53,33): error CS0115: 'ColoredSmtpAppender.SendBuffer(LoggingEvent[])': no suitable method found to override [/home/jenkins/jenkins-slave/workspace/logging-log4net_PR-1-M7ZPLFZLL73IPXISLYO4GQBIZ6ETV2ZDBKCZX4H7HI63IOI75V6Q/netstandard/log4net/log4net.csproj]
     [exec] /home/jenkins/jenkins-slave/workspace/logging-log4net_PR-1-M7ZPLFZLL73IPXISLYO4GQBIZ6ETV2ZDBKCZX4H7HI63IOI75V6Q/src/log4net/Appender/ColoredSmtpAppender.cs(148,33): error CS0115: 'ColoredSmtpAppender.SendEmail(string)': no suitable method found to override [/home/jenkins/jenkins-slave/workspace/logging-log4net_PR-1-M7ZPLFZLL73IPXISLYO4GQBIZ6ETV2ZDBKCZX4H7HI63IOI75V6Q/netstandard/log4net/log4net.csproj]
     [exec] /home/jenkins/jenkins-slave/workspace/logging-log4net_PR-1-M7ZPLFZLL73IPXISLYO4GQBIZ6ETV2ZDBKCZX4H7HI63IOI75V6Q/src/log4net/Appender/ColoredSmtpAppender.cs(234,30): error CS0115: 'ColoredSmtpAppender.ActivateOptions()': no suitable method found to override [/home/jenkins/jenkins-slave/workspace/logging-log4net_PR-1-M7ZPLFZLL73IPXISLYO4GQBIZ6ETV2ZDBKCZX4H7HI63IOI75V6Q/netstandard/log4net/log4net.csproj]
     [exec] 
     [exec] Build FAILED.
     [exec] 
     [exec] /home/jenkins/jenkins-slave/workspace/logging-log4net_PR-1-M7ZPLFZLL73IPXISLYO4GQBIZ6ETV2ZDBKCZX4H7HI63IOI75V6Q/src/log4net/Appender/ColoredSmtpAppender.cs(5,18): error CS0234: The type or namespace name 'Mail' does not exist in the namespace 'System.Net' (are you missing an assembly reference?) [/home/jenkins/jenkins-slave/workspace/logging-log4net_PR-1-M7ZPLFZLL73IPXISLYO4GQBIZ6ETV2ZDBKCZX4H7HI63IOI75V6Q/netstandard/log4net/log4net.csproj]
     [exec] /home/jenkins/jenkins-slave/workspace/logging-log4net_PR-1-M7ZPLFZLL73IPXISLYO4GQBIZ6ETV2ZDBKCZX4H7HI63IOI75V6Q/src/log4net/Appender/ColoredSmtpAppender.cs(7,14): error CS0234: The type or namespace name 'Web' does not exist in the namespace 'System' (are you missing an assembly reference?) [/home/jenkins/jenkins-slave/workspace/logging-log4net_PR-1-M7ZPLFZLL73IPXISLYO4GQBIZ6ETV2ZDBKCZX4H7HI63IOI75V6Q/netstandard/log4net/log4net.csproj]
     [exec] /home/jenkins/jenkins-slave/workspace/logging-log4net_PR-1-M7ZPLFZLL73IPXISLYO4GQBIZ6ETV2ZDBKCZX4H7HI63IOI75V6Q/src/log4net/Appender/ColoredSmtpAppender.cs(49,40): error CS0246: The type or namespace name 'SmtpAppender' could not be found (are you missing a using directive or an assembly reference?) [/home/jenkins/jenkins-slave/workspace/logging-log4net_PR-1-M7ZPLFZLL73IPXISLYO4GQBIZ6ETV2ZDBKCZX4H7HI63IOI75V6Q/netstandard/log4net/log4net.csproj]
     [exec] /home/jenkins/jenkins-slave/workspace/logging-log4net_PR-1-M7ZPLFZLL73IPXISLYO4GQBIZ6ETV2ZDBKCZX4H7HI63IOI75V6Q/src/log4net/Appender/ColoredSmtpAppender.cs(53,33): error CS0115: 'ColoredSmtpAppender.SendBuffer(LoggingEvent[])': no suitable method found to override [/home/jenkins/jenkins-slave/workspace/logging-log4net_PR-1-M7ZPLFZLL73IPXISLYO4GQBIZ6ETV2ZDBKCZX4H7HI63IOI75V6Q/netstandard/log4net/log4net.csproj]
     [exec] /home/jenkins/jenkins-slave/workspace/logging-log4net_PR-1-M7ZPLFZLL73IPXISLYO4GQBIZ6ETV2ZDBKCZX4H7HI63IOI75V6Q/src/log4net/Appender/ColoredSmtpAppender.cs(148,33): error CS0115: 'ColoredSmtpAppender.SendEmail(string)': no suitable method found to override [/home/jenkins/jenkins-slave/workspace/logging-log4net_PR-1-M7ZPLFZLL73IPXISLYO4GQBIZ6ETV2ZDBKCZX4H7HI63IOI75V6Q/netstandard/log4net/log4net.csproj]
     [exec] /home/jenkins/jenkins-slave/workspace/logging-log4net_PR-1-M7ZPLFZLL73IPXISLYO4GQBIZ6ETV2ZDBKCZX4H7HI63IOI75V6Q/src/log4net/Appender/ColoredSmtpAppender.cs(234,30): error CS0115: 'ColoredSmtpAppender.ActivateOptions()': no suitable method found to override [/home/jenkins/jenkins-slave/workspace/logging-log4net_PR-1-M7ZPLFZLL73IPXISLYO4GQBIZ6ETV2ZDBKCZX4H7HI63IOI75V6Q/netstandard/log4net/log4net.csproj]
     [exec]     0 Warning(s)
     [exec]     6 Error(s)
     [exec] 
     [exec] Time Elapsed 00:00:02.88

BUILD FAILED

/home/jenkins/jenkins-slave/workspace/logging-log4net_PR-1-M7ZPLFZLL73IPXISLYO4GQBIZ6ETV2ZDBKCZX4H7HI63IOI75V6Q/log4net.build(1778,8):
External Program Failed: dotnet (return code was 1)

Total time: 36.3 seconds.

[Pipeline] }
$ docker stop --time=1 c96be9dec8f00e35cb0aed15c934a5724db9f24df372f2632fb8cc225f35c827
$ docker rm -f c96be9dec8f00e35cb0aed15c934a5724db9f24df372f2632fb8cc225f35c827
[Pipeline] // withDockerContainer
[Pipeline] }
[Pipeline] // script
[Pipeline] }
[Pipeline] // stage
[Pipeline] stage
[Pipeline] { (build net-3.5)
Stage 'build net-3.5' skipped due to earlier failure(s)
[Pipeline] }
[Pipeline] // stage
[Pipeline] stage
[Pipeline] { (build net-3.5-cp)
Stage 'build net-3.5-cp' skipped due to earlier failure(s)
[Pipeline] }
[Pipeline] // stage
[Pipeline] stage
[Pipeline] { (build net-4.0)
Stage 'build net-4.0' skipped due to earlier failure(s)
[Pipeline] }
[Pipeline] // stage
[Pipeline] stage
[Pipeline] { (build net-4.0-cp)
Stage 'build net-4.0-cp' skipped due to earlier failure(s)
[Pipeline] }
[Pipeline] // stage
[Pipeline] stage
[Pipeline] { (build net-4.5)
Stage 'build net-4.5' skipped due to earlier failure(s)
[Pipeline] }
[Pipeline] // stage
[Pipeline] stage
[Pipeline] { (build mono-2.0)
Stage 'build mono-2.0' skipped due to earlier failure(s)
[Pipeline] }
[Pipeline] // stage
[Pipeline] stage
[Pipeline] { (build mono-3.5)
Stage 'build mono-3.5' skipped due to earlier failure(s)
[Pipeline] }
[Pipeline] // stage
[Pipeline] stage
[Pipeline] { (build mono-4.0)
Stage 'build mono-4.0' skipped due to earlier failure(s)
[Pipeline] }
[Pipeline] // stage
[Pipeline] stage
[Pipeline] { (build site)
Stage 'build site' skipped due to earlier failure(s)
[Pipeline] }
[Pipeline] // stage
[Pipeline] stage
[Pipeline] { (prepare package)
Stage 'prepare package' skipped due to earlier failure(s)
[Pipeline] }
[Pipeline] // stage
[Pipeline] stage
[Pipeline] { (check test results)
Stage 'check test results' skipped due to earlier failure(s)
[Pipeline] }
[Pipeline] // stage
[Pipeline] stage
[Pipeline] { (publish site)
Stage 'publish site' skipped due to earlier failure(s)
[Pipeline] }
[Pipeline] // stage
[Pipeline] stage
[Pipeline] { (Declarative: Post Actions)
[Pipeline] step