You are viewing a plain text version of this content. The canonical link for it is here.
Posted to builds@cassandra.apache.org by Apache Jenkins Server <je...@builds.apache.org> on 2023/05/05 03:50:23 UTC
Build complete: Cassandra-4.0 #576 [UNSTABLE] 682ae0c64c9159c6c884252820ce1236fde39e17
-------------------------------------------------------------------------------
Build Cassandra-4.0 #576 Still Unstable
URL: https://ci-cassandra.apache.org/job/Cassandra-4.0/576/
-------------------------------------------------------------------------------
Changes:
[Brandon Williams] Suppress CVE-2023-2251
-------------------------------------------------------------------------------
Failed Tests:
6 tests failed.
FAILED: dtest-offheap.topology_test.TestTopology.test_decommissioned_node_cant_rejoin
FAILED: dtest-offheap.cqlsh_tests.test_cqlsh_copy.TestCqlshCopy.test_bulk_round_trip_with_backoff
FAILED: org.apache.cassandra.net.ProxyHandlerConnectionsTest.testExpireSome-compression
FAILED: org.apache.cassandra.metrics.TableMetricsTest.testLoggedPartitionsPerBatchMultiTable
FAILED: org.apache.cassandra.distributed.test.FailingRepairTest.testFailingMessage[VALIDATION_REQ/parallel/true]
FAILED: org.apache.cassandra.distributed.test.FailingRepairTest.testFailingMessage[VALIDATION_REQ/parallel/true]
-------------------------------------------------------------------------------
For complete test report and logs see https://nightlies.apache.org/cassandra/Cassandra-4.0/576/