You are viewing a plain text version of this content. The canonical link for it is here.
Posted to dev@zookeeper.apache.org by Apache Jenkins Server <je...@builds.apache.org> on 2015/09/08 09:22:38 UTC
Failed: ZOOKEEPER-2266 PreCommit Build #2860
Jira: https://issues.apache.org/jira/browse/ZOOKEEPER-2266
Build: https://builds.apache.org/job/PreCommit-ZOOKEEPER-Build/2860/
###################################################################################
########################## LAST 60 LINES OF THE CONSOLE ###########################
[...truncated 373836 lines...]
[exec]
[exec] -1 tests included. The patch doesn't appear to include any new or modified tests.
[exec] Please justify why no new tests are needed for this patch.
[exec] Also please list what manual steps were performed to verify this patch.
[exec]
[exec] +1 javadoc. The javadoc tool did not generate any warning messages.
[exec]
[exec] +1 javac. The applied patch does not increase the total number of javac compiler warnings.
[exec]
[exec] +1 findbugs. The patch does not introduce any new Findbugs (version 2.0.3) warnings.
[exec]
[exec] +1 release audit. The applied patch does not increase the total number of release audit warnings.
[exec]
[exec] +1 core tests. The patch passed core unit tests.
[exec]
[exec] +1 contrib tests. The patch passed contrib unit tests.
[exec]
[exec] Test results: https://builds.apache.org/job/PreCommit-ZOOKEEPER-Build/2860//testReport/
[exec] Findbugs warnings: https://builds.apache.org/job/PreCommit-ZOOKEEPER-Build/2860//artifact/trunk/build/test/findbugs/newPatchFindbugsWarnings.html
[exec] Console output: https://builds.apache.org/job/PreCommit-ZOOKEEPER-Build/2860//console
[exec]
[exec] This message is automatically generated.
[exec]
[exec]
[exec] ======================================================================
[exec] ======================================================================
[exec] Adding comment to Jira.
[exec] ======================================================================
[exec] ======================================================================
[exec]
[exec]
[exec] Comment added.
[exec] 1f3651e1081cdbec680e0ffdf362c5725fab594c logged out
[exec]
[exec]
[exec] ======================================================================
[exec] ======================================================================
[exec] Finished build.
[exec] ======================================================================
[exec] ======================================================================
[exec]
[exec]
BUILD FAILED
/home/jenkins/jenkins-slave/workspace/PreCommit-ZOOKEEPER-Build/trunk/build.xml:1787: exec returned: 1
Total time: 13 minutes 45 seconds
Build step 'Execute shell' marked build as failure
Archiving artifacts
Sending artifact delta relative to PreCommit-ZOOKEEPER-Build #2859
Archived 24 artifacts
Archive block size is 32768
Received 8 blocks and 33549907 bytes
Compression is 0.8%
Took 7.5 sec
Recording test results
Description set: ZOOKEEPER-2266
Email was triggered for: Failure
Sending email for trigger: Failure
###################################################################################
############################## FAILED TESTS (if any) ##############################
All tests passed
Success: ZOOKEEPER-1803 PreCommit Build #2863
Posted by Apache Jenkins Server <je...@builds.apache.org>.
Jira: https://issues.apache.org/jira/browse/ZOOKEEPER-1803
Build: https://builds.apache.org/job/PreCommit-ZOOKEEPER-Build/2863/
###################################################################################
########################## LAST 60 LINES OF THE CONSOLE ###########################
[...truncated 376199 lines...]
[exec] +1 overall. Here are the results of testing the latest attachment
[exec] http://issues.apache.org/jira/secure/attachment/12754640/ZOOKEEPER-1803-02.patch
[exec] against trunk revision 1701505.
[exec]
[exec] +1 @author. The patch does not contain any @author tags.
[exec]
[exec] +0 tests included. The patch appears to be a documentation patch that doesn't require tests.
[exec]
[exec] +1 javadoc. The javadoc tool did not generate any warning messages.
[exec]
[exec] +1 javac. The applied patch does not increase the total number of javac compiler warnings.
[exec]
[exec] +1 findbugs. The patch does not introduce any new Findbugs (version 2.0.3) warnings.
[exec]
[exec] +1 release audit. The applied patch does not increase the total number of release audit warnings.
[exec]
[exec] +1 core tests. The patch passed core unit tests.
[exec]
[exec] +1 contrib tests. The patch passed contrib unit tests.
[exec]
[exec] Test results: https://builds.apache.org/job/PreCommit-ZOOKEEPER-Build/2863//testReport/
[exec] Findbugs warnings: https://builds.apache.org/job/PreCommit-ZOOKEEPER-Build/2863//artifact/trunk/build/test/findbugs/newPatchFindbugsWarnings.html
[exec] Console output: https://builds.apache.org/job/PreCommit-ZOOKEEPER-Build/2863//console
[exec]
[exec] This message is automatically generated.
[exec]
[exec]
[exec] ======================================================================
[exec] ======================================================================
[exec] Adding comment to Jira.
[exec] ======================================================================
[exec] ======================================================================
[exec]
[exec]
[exec] Comment added.
[exec] 9aece975e186f5857c97b4d75adcbf8585e02ca8 logged out
[exec]
[exec]
[exec] ======================================================================
[exec] ======================================================================
[exec] Finished build.
[exec] ======================================================================
[exec] ======================================================================
[exec]
[exec]
BUILD SUCCESSFUL
Total time: 13 minutes 15 seconds
Archiving artifacts
Sending artifact delta relative to PreCommit-ZOOKEEPER-Build #2859
Archived 24 artifacts
Archive block size is 32768
Received 10 blocks and 33477793 bytes
Compression is 1.0%
Took 8.9 sec
Recording test results
Description set: ZOOKEEPER-1803
Email was triggered for: Success
Sending email for trigger: Success
###################################################################################
############################## FAILED TESTS (if any) ##############################
All tests passed
Failed: ZOOKEEPER-2268 PreCommit Build #2862
Posted by Apache Jenkins Server <je...@builds.apache.org>.
Jira: https://issues.apache.org/jira/browse/ZOOKEEPER-2268
Build: https://builds.apache.org/job/PreCommit-ZOOKEEPER-Build/2862/
###################################################################################
########################## LAST 60 LINES OF THE CONSOLE ###########################
[...truncated 371604 lines...]
[exec]
[exec] -1 tests included. The patch doesn't appear to include any new or modified tests.
[exec] Please justify why no new tests are needed for this patch.
[exec] Also please list what manual steps were performed to verify this patch.
[exec]
[exec] +1 javadoc. The javadoc tool did not generate any warning messages.
[exec]
[exec] +1 javac. The applied patch does not increase the total number of javac compiler warnings.
[exec]
[exec] +1 findbugs. The patch does not introduce any new Findbugs (version 2.0.3) warnings.
[exec]
[exec] +1 release audit. The applied patch does not increase the total number of release audit warnings.
[exec]
[exec] -1 core tests. The patch failed core unit tests.
[exec]
[exec] +1 contrib tests. The patch passed contrib unit tests.
[exec]
[exec] Test results: https://builds.apache.org/job/PreCommit-ZOOKEEPER-Build/2862//testReport/
[exec] Findbugs warnings: https://builds.apache.org/job/PreCommit-ZOOKEEPER-Build/2862//artifact/trunk/build/test/findbugs/newPatchFindbugsWarnings.html
[exec] Console output: https://builds.apache.org/job/PreCommit-ZOOKEEPER-Build/2862//console
[exec]
[exec] This message is automatically generated.
[exec]
[exec]
[exec] ======================================================================
[exec] ======================================================================
[exec] Adding comment to Jira.
[exec] ======================================================================
[exec] ======================================================================
[exec]
[exec]
[exec] Comment added.
[exec] e3283237cebbb33b8bfa424b32690d56407a1500 logged out
[exec]
[exec]
[exec] ======================================================================
[exec] ======================================================================
[exec] Finished build.
[exec] ======================================================================
[exec] ======================================================================
[exec]
[exec]
BUILD FAILED
/home/jenkins/jenkins-slave/workspace/PreCommit-ZOOKEEPER-Build/trunk/build.xml:1787: exec returned: 2
Total time: 7 minutes 50 seconds
Build step 'Execute shell' marked build as failure
Archiving artifacts
Sending artifact delta relative to PreCommit-ZOOKEEPER-Build #2859
Archived 7 artifacts
Archive block size is 32768
Received 10 blocks and 239056 bytes
Compression is 57.8%
Took 0.8 sec
Recording test results
Description set: ZOOKEEPER-2268
Email was triggered for: Failure
Sending email for trigger: Failure
###################################################################################
############################## FAILED TESTS (if any) ##############################
1 tests failed.
REGRESSION: org.apache.zookeeper.test.ReconfigTest.testPortChange
Error Message:
expected:<test[1]> but was:<test[0]>
Stack Trace:
junit.framework.AssertionFailedError: expected:<test[1]> but was:<test[0]>
at org.apache.zookeeper.test.ReconfigTest.testNormalOperation(ReconfigTest.java:150)
at org.apache.zookeeper.test.ReconfigTest.testPortChange(ReconfigTest.java:598)
at org.apache.zookeeper.JUnit4ZKTestRunner$LoggedInvokeMethod.evaluate(JUnit4ZKTestRunner.java:79)
Failed: ZOOKEEPER-1803 PreCommit Build #2861
Posted by Apache Jenkins Server <je...@builds.apache.org>.
Jira: https://issues.apache.org/jira/browse/ZOOKEEPER-1803
Build: https://builds.apache.org/job/PreCommit-ZOOKEEPER-Build/2861/
###################################################################################
########################## LAST 60 LINES OF THE CONSOLE ###########################
[...truncated 373904 lines...]
[exec]
[exec] +1 @author. The patch does not contain any @author tags.
[exec]
[exec] +0 tests included. The patch appears to be a documentation patch that doesn't require tests.
[exec]
[exec] +1 javadoc. The javadoc tool did not generate any warning messages.
[exec]
[exec] +1 javac. The applied patch does not increase the total number of javac compiler warnings.
[exec]
[exec] +1 findbugs. The patch does not introduce any new Findbugs (version 2.0.3) warnings.
[exec]
[exec] +1 release audit. The applied patch does not increase the total number of release audit warnings.
[exec]
[exec] -1 core tests. The patch failed core unit tests.
[exec]
[exec] +1 contrib tests. The patch passed contrib unit tests.
[exec]
[exec] Test results: https://builds.apache.org/job/PreCommit-ZOOKEEPER-Build/2861//testReport/
[exec] Findbugs warnings: https://builds.apache.org/job/PreCommit-ZOOKEEPER-Build/2861//artifact/trunk/build/test/findbugs/newPatchFindbugsWarnings.html
[exec] Console output: https://builds.apache.org/job/PreCommit-ZOOKEEPER-Build/2861//console
[exec]
[exec] This message is automatically generated.
[exec]
[exec]
[exec] ======================================================================
[exec] ======================================================================
[exec] Adding comment to Jira.
[exec] ======================================================================
[exec] ======================================================================
[exec]
[exec]
[exec] Comment added.
[exec] 0c1324da6be62f8edfa72003be9573040820b648 logged out
[exec]
[exec]
[exec] ======================================================================
[exec] ======================================================================
[exec] Finished build.
[exec] ======================================================================
[exec] ======================================================================
[exec]
[exec]
BUILD FAILED
/home/jenkins/jenkins-slave/workspace/PreCommit-ZOOKEEPER-Build/trunk/build.xml:1787: exec returned: 1
Total time: 13 minutes 33 seconds
Build step 'Execute shell' marked build as failure
Archiving artifacts
Sending artifact delta relative to PreCommit-ZOOKEEPER-Build #2859
Archived 24 artifacts
Archive block size is 32768
Received 10 blocks and 33217727 bytes
Compression is 1.0%
Took 7.6 sec
Recording test results
Description set: ZOOKEEPER-1803
Email was triggered for: Failure
Sending email for trigger: Failure
###################################################################################
############################## FAILED TESTS (if any) ##############################
All tests passed