You are viewing a plain text version of this content. The canonical link for it is here.
Posted to dev@atlas.apache.org by Apache Jenkins Server <je...@builds.apache.org> on 2018/04/13 14:19:30 UTC

Build failed in Jenkins: PreCommit-ATLAS-Build-Test #264-master-

See <https://builds.apache.org/job/PreCommit-ATLAS-Build-Test/264/display/redirect>

------------------------------------------
[...truncated 327.45 KB...]
[INFO] 
[INFO] --- maven-resources-plugin:2.7:copy-resources (copy-resources-solr) @ atlas-repository ---
[INFO] Using 'UTF-8' encoding to copy filtered resources.
[INFO] Copying 9 resources
[INFO] 
[INFO] --- maven-remote-resources-plugin:1.5:process (default) @ atlas-repository ---
[INFO] 
[INFO] --- maven-resources-plugin:2.7:resources (default-resources) @ atlas-repository ---
[INFO] Using 'UTF-8' encoding to copy filtered resources.
[INFO] skip non existing resourceDirectory <https://builds.apache.org/job/PreCommit-ATLAS-Build-Test/ws/repository/src/main/resources>
[INFO] Copying 2 resources to META-INF
[INFO] Copying 3 resources
[INFO] 
[INFO] --- maven-compiler-plugin:3.7.0:compile (default-compile) @ atlas-repository ---
[INFO] Changes detected - recompiling the module!
[INFO] Compiling 128 source files to <https://builds.apache.org/job/PreCommit-ATLAS-Build-Test/ws/repository/target/classes>
[INFO] <https://builds.apache.org/job/PreCommit-ATLAS-Build-Test/ws/repository/src/main/java/org/apache/atlas/repository/converters/AtlasInstanceConverter.java>: Some input files use or override a deprecated API.
[INFO] <https://builds.apache.org/job/PreCommit-ATLAS-Build-Test/ws/repository/src/main/java/org/apache/atlas/repository/converters/AtlasInstanceConverter.java>: Recompile with -Xlint:deprecation for details.
[INFO] <https://builds.apache.org/job/PreCommit-ATLAS-Build-Test/ws/repository/src/main/java/org/apache/atlas/util/SearchPredicateUtil.java>: Some input files use unchecked or unsafe operations.
[INFO] <https://builds.apache.org/job/PreCommit-ATLAS-Build-Test/ws/repository/src/main/java/org/apache/atlas/util/SearchPredicateUtil.java>: Recompile with -Xlint:unchecked for details.
[INFO] 
[INFO] --- maven-resources-plugin:2.7:testResources (default-testResources) @ atlas-repository ---
[INFO] Using 'UTF-8' encoding to copy filtered resources.
[INFO] Copying 29 resources
[INFO] Copying 3 resources
[INFO] 
[INFO] --- maven-compiler-plugin:3.7.0:testCompile (default-testCompile) @ atlas-repository ---
[INFO] Changes detected - recompiling the module!
[INFO] Compiling 40 source files to <https://builds.apache.org/job/PreCommit-ATLAS-Build-Test/ws/repository/target/test-classes>
[INFO] <https://builds.apache.org/job/PreCommit-ATLAS-Build-Test/ws/repository/src/test/java/org/apache/atlas/query/BasicTestSetup.java>: <https://builds.apache.org/job/PreCommit-ATLAS-Build-Test/ws/repository/src/test/java/org/apache/atlas/query/BasicTestSetup.java> uses or overrides a deprecated API.
[INFO] <https://builds.apache.org/job/PreCommit-ATLAS-Build-Test/ws/repository/src/test/java/org/apache/atlas/query/BasicTestSetup.java>: Recompile with -Xlint:deprecation for details.
[INFO] <https://builds.apache.org/job/PreCommit-ATLAS-Build-Test/ws/repository/src/test/java/org/apache/atlas/repository/impexp/UniqueListTest.java>: Some input files use unchecked or unsafe operations.
[INFO] <https://builds.apache.org/job/PreCommit-ATLAS-Build-Test/ws/repository/src/test/java/org/apache/atlas/repository/impexp/UniqueListTest.java>: Recompile with -Xlint:unchecked for details.
[INFO] 
[INFO] --- maven-surefire-plugin:2.18.1:test (default-test) @ atlas-repository ---
[INFO] Surefire report directory: <https://builds.apache.org/job/PreCommit-ATLAS-Build-Test/ws/repository/target/surefire-reports>
[INFO] Using configured provider org.apache.maven.surefire.testng.TestNGProvider

-------------------------------------------------------
 T E S T S
-------------------------------------------------------
Running org.apache.atlas.repository.store.graph.AtlasTypeDefGraphStoreTest
Running org.apache.atlas.repository.audit.InMemoryAuditRepositoryTest
Running org.apache.atlas.query.GremlinQueryComposerTest
Running org.apache.atlas.utils.TestResourceFileUtils
Running org.apache.atlas.services.MetricsServiceTest
Running org.apache.atlas.repository.store.graph.v1.InverseReferenceUpdateHardDeleteV1Test
Running org.apache.atlas.repository.store.graph.v1.AtlasRelationshipStoreSoftDeleteV1Test
Running org.apache.atlas.repository.migration.HiveStocksTest
Running org.apache.atlas.repository.migration.HiveParititionTest
Running org.apache.atlas.repository.store.graph.v1.AtlasRelationshipStoreHardDeleteV1Test
Running org.apache.atlas.repository.impexp.ImportTransformerJSONTest
Running org.apache.atlas.repository.store.graph.v1.AtlasEntityStoreV1BulkImportPercentTest
Running org.apache.atlas.repository.impexp.ImportTransformerTest
Running org.apache.atlas.repository.impexp.UniqueListTest
Running org.apache.atlas.repository.audit.CassandraAuditRepositoryTest
Running org.apache.atlas.query.DSLParsingTest
Running org.apache.atlas.repository.migration.RelationshipMappingTest
Running org.apache.atlas.query.DSLQueriesTest
Running org.apache.atlas.repository.impexp.ZipSourceTest
Running org.apache.atlas.repository.userprofile.UserProfileServiceTest
Running org.apache.atlas.repository.impexp.ImportServiceTest
Running org.apache.atlas.repository.impexp.ZipSinkTest
Running org.apache.atlas.repository.store.graph.v1.AtlasRelationshipStoreV1Test
Running org.apache.atlas.repository.store.graph.v1.AtlasEntityDefStoreV1Test
Running org.apache.atlas.glossary.PaginationHelperTest
Running org.apache.atlas.TestModules
Running org.apache.atlas.glossary.GlossaryServiceTest
Running org.apache.atlas.repository.impexp.ExportServiceTest
Running org.apache.atlas.repository.impexp.AtlasImportRequestTest
Running org.apache.atlas.repository.store.graph.v1.InverseReferenceUpdateSoftDeleteV1Test
Running org.apache.atlas.repository.impexp.TypeAttributeDifferenceTest
Running org.apache.atlas.repository.impexp.ImportTransformsTest
Running org.apache.atlas.utils.ObjectUpdateSynchronizerTest
Running org.apache.atlas.repository.store.graph.v1.AtlasEntityStoreV1Test
Running org.apache.atlas.repository.store.graph.v1.AtlasRelationshipDefStoreV1Test
Running org.apache.atlas.repository.store.graph.v1.InverseReferenceUpdateV1Test
Tests run: 0, Failures: 0, Errors: 0, Skipped: 0, Time elapsed: 2.384 sec - in org.apache.atlas.utils.TestResourceFileUtils
Tests run: 0, Failures: 0, Errors: 0, Skipped: 0, Time elapsed: 2.299 sec - in org.apache.atlas.repository.store.graph.v1.AtlasRelationshipStoreV1Test
Tests run: 6, Failures: 0, Errors: 0, Skipped: 0, Time elapsed: 2.679 sec - in org.apache.atlas.repository.audit.InMemoryAuditRepositoryTest
Tests run: 0, Failures: 0, Errors: 0, Skipped: 0, Time elapsed: 2.544 sec - in org.apache.atlas.TestModules
Tests run: 4, Failures: 0, Errors: 0, Skipped: 0, Time elapsed: 2.819 sec - in org.apache.atlas.repository.impexp.UniqueListTest
Tests run: 0, Failures: 0, Errors: 0, Skipped: 0, Time elapsed: 2.301 sec - in org.apache.atlas.repository.store.graph.v1.InverseReferenceUpdateV1Test
Tests run: 8, Failures: 0, Errors: 0, Skipped: 0, Time elapsed: 2.998 sec - in org.apache.atlas.repository.impexp.ImportTransformerTest
Tests run: 20, Failures: 0, Errors: 0, Skipped: 0, Time elapsed: 2.97 sec - in org.apache.atlas.glossary.PaginationHelperTest
Tests run: 6, Failures: 0, Errors: 0, Skipped: 0, Time elapsed: 3.426 sec - in org.apache.atlas.repository.impexp.TypeAttributeDifferenceTest
Tests run: 1, Failures: 0, Errors: 0, Skipped: 0, Time elapsed: 4.414 sec - in org.apache.atlas.repository.impexp.ImportTransformerJSONTest
Tests run: 3, Failures: 0, Errors: 0, Skipped: 0, Time elapsed: 3.99 sec - in org.apache.atlas.repository.impexp.ImportTransformsTest
Tests run: 9, Failures: 0, Errors: 0, Skipped: 0, Time elapsed: 4.517 sec - in org.apache.atlas.repository.store.graph.v1.AtlasEntityStoreV1BulkImportPercentTest
Tests run: 8, Failures: 0, Errors: 0, Skipped: 0, Time elapsed: 4.663 sec - in org.apache.atlas.query.DSLParsingTest
Tests run: 8, Failures: 0, Errors: 0, Skipped: 0, Time elapsed: 4.612 sec - in org.apache.atlas.repository.impexp.ZipSinkTest
Tests run: 6, Failures: 0, Errors: 0, Skipped: 0, Time elapsed: 4.695 sec - in org.apache.atlas.repository.impexp.AtlasImportRequestTest
Tests run: 9, Failures: 0, Errors: 0, Skipped: 0, Time elapsed: 4.539 sec - in org.apache.atlas.utils.ObjectUpdateSynchronizerTest
Tests run: 6, Failures: 0, Errors: 0, Skipped: 0, Time elapsed: 5.212 sec - in org.apache.atlas.repository.impexp.ZipSourceTest
Tests run: 39, Failures: 0, Errors: 0, Skipped: 0, Time elapsed: 8.4 sec - in org.apache.atlas.query.GremlinQueryComposerTest
Tests run: 7, Failures: 0, Errors: 0, Skipped: 7, Time elapsed: 17.118 sec - in org.apache.atlas.repository.audit.CassandraAuditRepositoryTest
Tests run: 10, Failures: 0, Errors: 0, Skipped: 0, Time elapsed: 58.892 sec - in org.apache.atlas.repository.store.graph.v1.AtlasRelationshipDefStoreV1Test
Tests run: 1, Failures: 0, Errors: 0, Skipped: 0, Time elapsed: 59.747 sec - in org.apache.atlas.repository.store.graph.v1.AtlasEntityDefStoreV1Test
Tests run: 1, Failures: 0, Errors: 0, Skipped: 0, Time elapsed: 62.852 sec - in org.apache.atlas.services.MetricsServiceTest
Tests run: 1, Failures: 0, Errors: 0, Skipped: 0, Time elapsed: 77.896 sec - in org.apache.atlas.repository.migration.RelationshipMappingTest
Tests run: 5, Failures: 0, Errors: 0, Skipped: 0, Time elapsed: 78.732 sec - in org.apache.atlas.repository.store.graph.v1.InverseReferenceUpdateHardDeleteV1Test
Tests run: 4, Failures: 0, Errors: 0, Skipped: 0, Time elapsed: 83.275 sec - in org.apache.atlas.repository.store.graph.v1.AtlasRelationshipStoreSoftDeleteV1Test
Tests run: 10, Failures: 0, Errors: 0, Skipped: 0, Time elapsed: 86.922 sec - in org.apache.atlas.repository.impexp.ExportServiceTest
Tests run: 14, Failures: 0, Errors: 0, Skipped: 0, Time elapsed: 86.764 sec - in org.apache.atlas.repository.store.graph.v1.AtlasEntityStoreV1Test
Tests run: 4, Failures: 0, Errors: 0, Skipped: 0, Time elapsed: 87.397 sec - in org.apache.atlas.repository.store.graph.v1.AtlasRelationshipStoreHardDeleteV1Test
Tests run: 35, Failures: 0, Errors: 0, Skipped: 0, Time elapsed: 88.355 sec - in org.apache.atlas.glossary.GlossaryServiceTest
Tests run: 12, Failures: 0, Errors: 0, Skipped: 0, Time elapsed: 89.03 sec - in org.apache.atlas.repository.userprofile.UserProfileServiceTest
Tests run: 5, Failures: 0, Errors: 0, Skipped: 0, Time elapsed: 90.133 sec - in org.apache.atlas.repository.store.graph.v1.InverseReferenceUpdateSoftDeleteV1Test
Tests run: 18, Failures: 0, Errors: 0, Skipped: 0, Time elapsed: 93.981 sec - in org.apache.atlas.repository.store.graph.AtlasTypeDefGraphStoreTest
Tests run: 1, Failures: 1, Errors: 0, Skipped: 0, Time elapsed: 96.895 sec <<< FAILURE! - in org.apache.atlas.repository.migration.HiveParititionTest
fileImporterTest(org.apache.atlas.repository.migration.HiveParititionTest)  Time elapsed: 33.33 sec  <<< FAILURE!
java.lang.AssertionError: expected [136] but found [154]
	at org.testng.Assert.fail(Assert.java:94)
	at org.testng.Assert.failNotEquals(Assert.java:496)
	at org.testng.Assert.assertEquals(Assert.java:125)
	at org.testng.Assert.assertEquals(Assert.java:267)
	at org.testng.Assert.assertEquals(Assert.java:277)
	at org.apache.atlas.repository.migration.MigrationBaseAsserts.assertMigrationStatus(MigrationBaseAsserts.java:189)
	at org.apache.atlas.repository.migration.HiveParititionTest.fileImporterTest(HiveParititionTest.java:58)

Tests run: 10, Failures: 0, Errors: 0, Skipped: 0, Time elapsed: 101.706 sec - in org.apache.atlas.repository.impexp.ImportServiceTest
Tests run: 1, Failures: 1, Errors: 0, Skipped: 0, Time elapsed: 104.293 sec <<< FAILURE! - in org.apache.atlas.repository.migration.HiveStocksTest
migrateStocks(org.apache.atlas.repository.migration.HiveStocksTest)  Time elapsed: 43.624 sec  <<< FAILURE!
java.lang.AssertionError: expected [187] but found [226]
	at org.testng.Assert.fail(Assert.java:94)
	at org.testng.Assert.failNotEquals(Assert.java:496)
	at org.testng.Assert.assertEquals(Assert.java:125)
	at org.testng.Assert.assertEquals(Assert.java:267)
	at org.testng.Assert.assertEquals(Assert.java:277)
	at org.apache.atlas.repository.migration.MigrationBaseAsserts.assertMigrationStatus(MigrationBaseAsserts.java:189)
	at org.apache.atlas.repository.migration.HiveStocksTest.migrateStocks(HiveStocksTest.java:61)

Tests run: 246, Failures: 0, Errors: 0, Skipped: 0, Time elapsed: 157.432 sec - in org.apache.atlas.query.DSLQueriesTest

Results :

Failed tests: 
  HiveParititionTest.fileImporterTest:58->MigrationBaseAsserts.assertMigrationStatus:189 expected [136] but found [154]
  HiveStocksTest.migrateStocks:61->MigrationBaseAsserts.assertMigrationStatus:189 expected [187] but found [226]

Tests run: 518, Failures: 2, Errors: 0, Skipped: 7

[INFO] ------------------------------------------------------------------------
[INFO] Reactor Summary:
[INFO] 
[INFO] Apache Atlas Server Build Tools .................... SUCCESS [  0.896 s]
[INFO] apache-atlas ....................................... SUCCESS [  3.241 s]
[INFO] Apache Atlas Test Utility Tools .................... SUCCESS [  5.267 s]
[INFO] Open Connector Framework (OCF) ..................... SUCCESS [  3.437 s]
[INFO] Open Metadata Repository Services (OMRS) ........... SUCCESS [  5.248 s]
[INFO] Open Metadata and Governance (OMAG) Server APIs .... SUCCESS [  1.089 s]
[INFO] Apache Atlas Integration ........................... SUCCESS [ 36.600 s]
[INFO] Apache Atlas Common ................................ SUCCESS [  4.063 s]
[INFO] Apache Atlas Client ................................ SUCCESS [  0.229 s]
[INFO] atlas-client-common ................................ SUCCESS [  1.053 s]
[INFO] atlas-client-v1 .................................... SUCCESS [  3.049 s]
[INFO] Apache Atlas Server API ............................ SUCCESS [  1.286 s]
[INFO] Apache Atlas Notification .......................... SUCCESS [ 19.733 s]
[INFO] atlas-client-v2 .................................... SUCCESS [  0.669 s]
[INFO] Apache Atlas Graph Database Projects ............... SUCCESS [  0.090 s]
[INFO] Apache Atlas Graph Database API .................... SUCCESS [  0.609 s]
[INFO] Graph Database Common Code ......................... SUCCESS [  0.773 s]
[INFO] Apache Atlas JanusGraph DB Impl .................... SUCCESS [02:24 min]
[INFO] Apache Atlas Graph Database Implementation Dependencies SUCCESS [  2.043 s]
[INFO] Shaded version of Apache hbase client .............. SUCCESS [  8.351 s]
[INFO] Apache Atlas Titan 0.5.4 Graph DB Impl ............. SUCCESS [ 27.454 s]
[INFO] Shaded version of Apache hbase server .............. SUCCESS [ 20.335 s]
[INFO] Apache Atlas Authorization ......................... SUCCESS [  3.421 s]
[INFO] Apache Atlas Repository ............................ FAILURE [02:47 min]
[INFO] Apache Atlas UI .................................... SKIPPED
[INFO] Apache Atlas Web Application ....................... SKIPPED
[INFO] Apache Atlas Documentation ......................... SKIPPED
[INFO] Apache Atlas FileSystem Model ...................... SKIPPED
[INFO] Apache Atlas Plugin Classloader .................... SKIPPED
[INFO] Apache Atlas Hive Bridge Shim ...................... SKIPPED
[INFO] Apache Atlas Hive Bridge ........................... SKIPPED
[INFO] Apache Atlas Falcon Bridge Shim .................... SKIPPED
[INFO] Apache Atlas Falcon Bridge ......................... SKIPPED
[INFO] Apache Atlas Sqoop Bridge Shim ..................... SKIPPED
[INFO] Apache Atlas Sqoop Bridge .......................... SKIPPED
[INFO] Apache Atlas Storm Bridge Shim ..................... SKIPPED
[INFO] Apache Atlas Storm Bridge .......................... SKIPPED
[INFO] Apache Atlas Hbase Bridge Shim ..................... SKIPPED
[INFO] Apache Atlas Hbase Bridge .......................... SKIPPED
[INFO] Apache Atlas Migration Exporter .................... SKIPPED
[INFO] Apache Atlas Distribution .......................... SKIPPED
[INFO] ------------------------------------------------------------------------
[INFO] BUILD FAILURE
[INFO] ------------------------------------------------------------------------
[INFO] Total time: 07:42 min
[INFO] Finished at: 2018-04-13T14:19:27Z
[INFO] Final Memory: 160M/2383M
[INFO] ------------------------------------------------------------------------
[ERROR] Failed to execute goal org.apache.maven.plugins:maven-surefire-plugin:2.18.1:test (default-test) on project atlas-repository: There are test failures.
[ERROR] 
[ERROR] Please refer to <https://builds.apache.org/job/PreCommit-ATLAS-Build-Test/ws/repository/target/surefire-reports> for the individual test results.
[ERROR] -> [Help 1]
[ERROR] 
[ERROR] To see the full stack trace of the errors, re-run Maven with the -e switch.
[ERROR] Re-run Maven using the -X switch to enable full debug logging.
[ERROR] 
[ERROR] For more information about the errors and possible solutions, please read the following articles:
[ERROR] [Help 1] http://cwiki.apache.org/confluence/display/MAVEN/MojoFailureException
[ERROR] 
[ERROR] After correcting the problems, you can resume the build with the command
[ERROR]   mvn <goals> -rf :atlas-repository




{color:green}+1 overall{color}.  

    {color:green}+1 @author{color}.  The patch does not contain any @author tags.

Test results: https://builds.apache.org/job/PreCommit-ATLAS-Build-Test/264//testReport/
Console output: https://builds.apache.org/job/PreCommit-ATLAS-Build-Test/264//console

This message is automatically generated.


======================================================================
======================================================================
    Adding comment to Jira.
======================================================================
======================================================================




======================================================================
======================================================================
    Finished build.
======================================================================
======================================================================


+ EXIT_CODE=0
+ '[' -d <https://builds.apache.org/job/PreCommit-ATLAS-Build-Test/ws/../atlas_patchprocess_6407> ']'
+ '[' -d <https://builds.apache.org/job/PreCommit-ATLAS-Build-Test/ws/atlas_patchprocess_6407> ']'
+ mv <https://builds.apache.org/job/PreCommit-ATLAS-Build-Test/ws/atlas_patchprocess_6407> <https://builds.apache.org/job/PreCommit-ATLAS-Build-Test/ws/patchprocess>
+ rm -f <https://builds.apache.org/job/PreCommit-ATLAS-Build-Test/ws/../atlas_patchprocess_6407>
+ exit 0
[description-setter] Could not determine description.
Set build name.
New build name is '#264-master-'
Archiving artifacts
ERROR: No artifacts found that match the file pattern "distro/target/*.tar.gz, webapp/target/*.war, **/target/**/*application.log". Configuration error?
ERROR: ?distro/target/*.tar.gz? doesn?t match anything: ?distro? exists but not ?distro/target/*.tar.gz?
Build step 'Archive the artifacts' changed build result to FAILURE

Jenkins build is back to normal : PreCommit-ATLAS-Build-Test #267-master-

Posted by Apache Jenkins Server <je...@builds.apache.org>.
See <https://builds.apache.org/job/PreCommit-ATLAS-Build-Test/267/display/redirect>


Build failed in Jenkins: PreCommit-ATLAS-Build-Test #266-master-

Posted by Apache Jenkins Server <je...@builds.apache.org>.
See <https://builds.apache.org/job/PreCommit-ATLAS-Build-Test/266/display/redirect>

------------------------------------------
[...truncated 238.97 KB...]
[INFO] Exclude: **/${sys:atlas.data}/**
[INFO] Exclude: **/policy-store.txt
[INFO] Exclude: **/*rebel*.xml
[INFO] Exclude: **/*rebel*.xml.bak
[INFO] Exclude: **/test/resources/**
[INFO] 167 resources included (use -debug for more details)
[INFO] Rat check: Summary over all files. Unapproved: 0, unknown: 0, generated: 0, approved: 167 licenses.
[INFO] 
[INFO] --- maven-resources-plugin:2.7:copy-resources (copy-resources-solr) @ atlas-repository ---
[INFO] Using 'UTF-8' encoding to copy filtered resources.
[INFO] Copying 9 resources
[INFO] 
[INFO] --- maven-remote-resources-plugin:1.5:process (default) @ atlas-repository ---
[INFO] 
[INFO] --- maven-resources-plugin:2.7:resources (default-resources) @ atlas-repository ---
[INFO] Using 'UTF-8' encoding to copy filtered resources.
[INFO] skip non existing resourceDirectory <https://builds.apache.org/job/PreCommit-ATLAS-Build-Test/ws/repository/src/main/resources>
[INFO] Copying 2 resources to META-INF
[INFO] Copying 3 resources
[INFO] 
[INFO] --- maven-compiler-plugin:3.7.0:compile (default-compile) @ atlas-repository ---
[INFO] Changes detected - recompiling the module!
[INFO] Compiling 128 source files to <https://builds.apache.org/job/PreCommit-ATLAS-Build-Test/ws/repository/target/classes>
[INFO] <https://builds.apache.org/job/PreCommit-ATLAS-Build-Test/ws/repository/src/main/java/org/apache/atlas/repository/converters/AtlasInstanceConverter.java>: Some input files use or override a deprecated API.
[INFO] <https://builds.apache.org/job/PreCommit-ATLAS-Build-Test/ws/repository/src/main/java/org/apache/atlas/repository/converters/AtlasInstanceConverter.java>: Recompile with -Xlint:deprecation for details.
[INFO] <https://builds.apache.org/job/PreCommit-ATLAS-Build-Test/ws/repository/src/main/java/org/apache/atlas/util/SearchPredicateUtil.java>: Some input files use unchecked or unsafe operations.
[INFO] <https://builds.apache.org/job/PreCommit-ATLAS-Build-Test/ws/repository/src/main/java/org/apache/atlas/util/SearchPredicateUtil.java>: Recompile with -Xlint:unchecked for details.
[INFO] 
[INFO] --- maven-resources-plugin:2.7:testResources (default-testResources) @ atlas-repository ---
[INFO] Using 'UTF-8' encoding to copy filtered resources.
[INFO] Copying 31 resources
[INFO] Copying 3 resources
[INFO] 
[INFO] --- maven-compiler-plugin:3.7.0:testCompile (default-testCompile) @ atlas-repository ---
[INFO] Changes detected - recompiling the module!
[INFO] Compiling 42 source files to <https://builds.apache.org/job/PreCommit-ATLAS-Build-Test/ws/repository/target/test-classes>
[INFO] <https://builds.apache.org/job/PreCommit-ATLAS-Build-Test/ws/repository/src/test/java/org/apache/atlas/query/BasicTestSetup.java>: <https://builds.apache.org/job/PreCommit-ATLAS-Build-Test/ws/repository/src/test/java/org/apache/atlas/query/BasicTestSetup.java> uses or overrides a deprecated API.
[INFO] <https://builds.apache.org/job/PreCommit-ATLAS-Build-Test/ws/repository/src/test/java/org/apache/atlas/query/BasicTestSetup.java>: Recompile with -Xlint:deprecation for details.
[INFO] <https://builds.apache.org/job/PreCommit-ATLAS-Build-Test/ws/repository/src/test/java/org/apache/atlas/repository/impexp/UniqueListTest.java>: Some input files use unchecked or unsafe operations.
[INFO] <https://builds.apache.org/job/PreCommit-ATLAS-Build-Test/ws/repository/src/test/java/org/apache/atlas/repository/impexp/UniqueListTest.java>: Recompile with -Xlint:unchecked for details.
[INFO] 
[INFO] --- maven-surefire-plugin:2.18.1:test (default-test) @ atlas-repository ---
[INFO] Surefire report directory: <https://builds.apache.org/job/PreCommit-ATLAS-Build-Test/ws/repository/target/surefire-reports>
[INFO] Using configured provider org.apache.maven.surefire.testng.TestNGProvider

-------------------------------------------------------
 T E S T S
-------------------------------------------------------
Running org.apache.atlas.repository.impexp.ImportTransformerTest
Running org.apache.atlas.repository.store.graph.v1.AtlasEntityStoreV1BulkImportPercentTest
Running org.apache.atlas.repository.store.graph.v1.InverseReferenceUpdateSoftDeleteV1Test
Running org.apache.atlas.repository.userprofile.UserProfileServiceTest
Running org.apache.atlas.repository.impexp.ImportTransformsTest
Running org.apache.atlas.repository.store.graph.v1.AtlasRelationshipStoreV1Test
Running org.apache.atlas.repository.migration.HiveStocksTest
Running org.apache.atlas.repository.store.graph.v1.AtlasRelationshipStoreSoftDeleteV1Test
Running org.apache.atlas.repository.audit.CassandraAuditRepositoryTest
Running org.apache.atlas.repository.store.graph.AtlasTypeDefGraphStoreTest
Running org.apache.atlas.repository.impexp.ExportServiceTest
Running org.apache.atlas.repository.store.graph.v1.AtlasRelationshipDefStoreV1Test
Running org.apache.atlas.repository.store.graph.v1.AtlasEntityStoreV1Test
Running org.apache.atlas.repository.migration.PathTest
Running org.apache.atlas.repository.store.graph.v1.AtlasRelationshipStoreHardDeleteV1Test
Running org.apache.atlas.repository.audit.InMemoryAuditRepositoryTest
Running org.apache.atlas.repository.impexp.ImportServiceTest
Running org.apache.atlas.repository.store.graph.v1.InverseReferenceUpdateHardDeleteV1Test
Running org.apache.atlas.repository.store.graph.v1.InverseReferenceUpdateV1Test
Running org.apache.atlas.repository.store.graph.v1.AtlasEntityDefStoreV1Test
Running org.apache.atlas.repository.migration.MigrationProgressServiceTest
Running org.apache.atlas.repository.migration.RelationshipMappingTest
Running org.apache.atlas.repository.impexp.ImportTransformerJSONTest
Running org.apache.atlas.repository.impexp.TypeAttributeDifferenceTest
Running org.apache.atlas.repository.impexp.UniqueListTest
Running org.apache.atlas.repository.impexp.ZipSourceTest
Running org.apache.atlas.repository.migration.HiveParititionTest
Tests run: 0, Failures: 0, Errors: 0, Skipped: 0, Time elapsed: 2.533 sec - in org.apache.atlas.repository.store.graph.v1.AtlasRelationshipStoreV1Test
Tests run: 8, Failures: 0, Errors: 0, Skipped: 0, Time elapsed: 3.057 sec - in org.apache.atlas.repository.impexp.ImportTransformerTest
Running org.apache.atlas.services.MetricsServiceTest
Running org.apache.atlas.query.DSLParsingTest
Running org.apache.atlas.repository.impexp.AtlasImportRequestTest
Running org.apache.atlas.query.GremlinQueryComposerTest
Tests run: 0, Failures: 0, Errors: 0, Skipped: 0, Time elapsed: 2.781 sec - in org.apache.atlas.repository.store.graph.v1.InverseReferenceUpdateV1Test
Running org.apache.atlas.repository.impexp.ZipSinkTest
Tests run: 4, Failures: 0, Errors: 0, Skipped: 0, Time elapsed: 2.763 sec - in org.apache.atlas.repository.impexp.UniqueListTest
Tests run: 6, Failures: 0, Errors: 0, Skipped: 0, Time elapsed: 4.026 sec - in org.apache.atlas.repository.audit.InMemoryAuditRepositoryTest
Tests run: 1, Failures: 0, Errors: 0, Skipped: 0, Time elapsed: 3.915 sec - in org.apache.atlas.repository.impexp.ImportTransformerJSONTest
Running org.apache.atlas.query.DSLQueriesTest
Running org.apache.atlas.glossary.PaginationHelperTest
Tests run: 9, Failures: 0, Errors: 0, Skipped: 0, Time elapsed: 5.513 sec - in org.apache.atlas.repository.store.graph.v1.AtlasEntityStoreV1BulkImportPercentTest
Running org.apache.atlas.glossary.GlossaryServiceTest
Running org.apache.atlas.TestModules
Tests run: 3, Failures: 0, Errors: 0, Skipped: 0, Time elapsed: 6.263 sec - in org.apache.atlas.repository.impexp.ImportTransformsTest
Running org.apache.atlas.utils.ObjectUpdateSynchronizerTest
Tests run: 6, Failures: 0, Errors: 0, Skipped: 0, Time elapsed: 5.647 sec - in org.apache.atlas.repository.impexp.TypeAttributeDifferenceTest
Tests run: 6, Failures: 0, Errors: 0, Skipped: 0, Time elapsed: 5.414 sec - in org.apache.atlas.repository.impexp.ZipSourceTest
Running org.apache.atlas.utils.TestResourceFileUtils
Tests run: 4, Failures: 0, Errors: 0, Skipped: 0, Time elapsed: 7.096 sec - in org.apache.atlas.repository.migration.MigrationProgressServiceTest
Tests run: 0, Failures: 0, Errors: 0, Skipped: 0, Time elapsed: 1.494 sec - in org.apache.atlas.TestModules
Tests run: 20, Failures: 0, Errors: 0, Skipped: 0, Time elapsed: 2.998 sec - in org.apache.atlas.glossary.PaginationHelperTest
Tests run: 6, Failures: 0, Errors: 0, Skipped: 0, Time elapsed: 5.449 sec - in org.apache.atlas.repository.impexp.AtlasImportRequestTest
Tests run: 0, Failures: 0, Errors: 0, Skipped: 0, Time elapsed: 1.406 sec - in org.apache.atlas.utils.TestResourceFileUtils
Tests run: 8, Failures: 0, Errors: 0, Skipped: 0, Time elapsed: 5.95 sec - in org.apache.atlas.query.DSLParsingTest
Tests run: 8, Failures: 0, Errors: 0, Skipped: 0, Time elapsed: 5.729 sec - in org.apache.atlas.repository.impexp.ZipSinkTest
Tests run: 9, Failures: 0, Errors: 0, Skipped: 0, Time elapsed: 3.24 sec - in org.apache.atlas.utils.ObjectUpdateSynchronizerTest
Tests run: 39, Failures: 0, Errors: 0, Skipped: 0, Time elapsed: 13.473 sec - in org.apache.atlas.query.GremlinQueryComposerTest
Tests run: 6, Failures: 0, Errors: 0, Skipped: 0, Time elapsed: 27.081 sec - in org.apache.atlas.repository.audit.CassandraAuditRepositoryTest
Tests run: 1, Failures: 0, Errors: 0, Skipped: 0, Time elapsed: 50.029 sec - in org.apache.atlas.repository.store.graph.v1.AtlasEntityDefStoreV1Test
Tests run: 10, Failures: 0, Errors: 0, Skipped: 0, Time elapsed: 52.16 sec - in org.apache.atlas.repository.store.graph.v1.AtlasRelationshipDefStoreV1Test
Tests run: 1, Failures: 0, Errors: 0, Skipped: 0, Time elapsed: 55.978 sec - in org.apache.atlas.services.MetricsServiceTest
Tests run: 1, Failures: 0, Errors: 0, Skipped: 0, Time elapsed: 68.902 sec - in org.apache.atlas.repository.migration.RelationshipMappingTest
Tests run: 4, Failures: 0, Errors: 0, Skipped: 0, Time elapsed: 69.585 sec - in org.apache.atlas.repository.store.graph.v1.AtlasRelationshipStoreHardDeleteV1Test
Tests run: 5, Failures: 0, Errors: 0, Skipped: 0, Time elapsed: 70.784 sec - in org.apache.atlas.repository.store.graph.v1.InverseReferenceUpdateHardDeleteV1Test
Tests run: 5, Failures: 0, Errors: 0, Skipped: 0, Time elapsed: 72.118 sec - in org.apache.atlas.repository.store.graph.v1.InverseReferenceUpdateSoftDeleteV1Test
Tests run: 4, Failures: 0, Errors: 0, Skipped: 0, Time elapsed: 72.114 sec - in org.apache.atlas.repository.store.graph.v1.AtlasRelationshipStoreSoftDeleteV1Test
Tests run: 10, Failures: 0, Errors: 0, Skipped: 0, Time elapsed: 73.016 sec - in org.apache.atlas.repository.impexp.ExportServiceTest
Tests run: 12, Failures: 0, Errors: 0, Skipped: 0, Time elapsed: 74.574 sec - in org.apache.atlas.repository.userprofile.UserProfileServiceTest
Tests run: 14, Failures: 0, Errors: 0, Skipped: 0, Time elapsed: 81.565 sec - in org.apache.atlas.repository.store.graph.v1.AtlasEntityStoreV1Test
Tests run: 18, Failures: 0, Errors: 0, Skipped: 0, Time elapsed: 82.195 sec - in org.apache.atlas.repository.store.graph.AtlasTypeDefGraphStoreTest
Tests run: 35, Failures: 0, Errors: 0, Skipped: 0, Time elapsed: 77.008 sec - in org.apache.atlas.glossary.GlossaryServiceTest
Tests run: 1, Failures: 0, Errors: 0, Skipped: 0, Time elapsed: 89.159 sec - in org.apache.atlas.repository.migration.PathTest
Tests run: 10, Failures: 0, Errors: 0, Skipped: 0, Time elapsed: 90.029 sec - in org.apache.atlas.repository.impexp.ImportServiceTest
Tests run: 1, Failures: 0, Errors: 0, Skipped: 0, Time elapsed: 92.387 sec - in org.apache.atlas.repository.migration.HiveStocksTest
Tests run: 1, Failures: 1, Errors: 0, Skipped: 0, Time elapsed: 90.196 sec <<< FAILURE! - in org.apache.atlas.repository.migration.HiveParititionTest
fileImporterTest(org.apache.atlas.repository.migration.HiveParititionTest)  Time elapsed: 39.915 sec  <<< FAILURE!
java.lang.AssertionError: expected [136] but found [140]
	at org.testng.Assert.fail(Assert.java:94)
	at org.testng.Assert.failNotEquals(Assert.java:496)
	at org.testng.Assert.assertEquals(Assert.java:125)
	at org.testng.Assert.assertEquals(Assert.java:267)
	at org.testng.Assert.assertEquals(Assert.java:277)
	at org.apache.atlas.repository.migration.MigrationBaseAsserts.assertMigrationStatus(MigrationBaseAsserts.java:190)
	at org.apache.atlas.repository.migration.HiveParititionTest.fileImporterTest(HiveParititionTest.java:58)

Tests run: 246, Failures: 0, Errors: 0, Skipped: 0, Time elapsed: 149.833 sec - in org.apache.atlas.query.DSLQueriesTest

Results :

Failed tests: 
  HiveParititionTest.fileImporterTest:58->MigrationBaseAsserts.assertMigrationStatus:190 expected [136] but found [140]

Tests run: 522, Failures: 1, Errors: 0, Skipped: 0

[INFO] ------------------------------------------------------------------------
[INFO] Reactor Summary:
[INFO] 
[INFO] Apache Atlas Server Build Tools .................... SUCCESS [  1.851 s]
[INFO] apache-atlas ....................................... SUCCESS [  8.391 s]
[INFO] Apache Atlas Test Utility Tools .................... SUCCESS [  7.779 s]
[INFO] Open Connector Framework (OCF) ..................... SUCCESS [  1.954 s]
[INFO] Open Metadata Repository Services (OMRS) ........... SUCCESS [  5.969 s]
[INFO] Open Metadata and Governance (OMAG) Server APIs .... SUCCESS [  0.920 s]
[INFO] Apache Atlas Integration ........................... SUCCESS [ 40.272 s]
[INFO] Apache Atlas Common ................................ SUCCESS [  2.682 s]
[INFO] Apache Atlas Client ................................ SUCCESS [  0.262 s]
[INFO] atlas-client-common ................................ SUCCESS [  0.960 s]
[INFO] atlas-client-v1 .................................... SUCCESS [  2.703 s]
[INFO] Apache Atlas Server API ............................ SUCCESS [  0.846 s]
[INFO] Apache Atlas Notification .......................... SUCCESS [ 16.818 s]
[INFO] atlas-client-v2 .................................... SUCCESS [  0.634 s]
[INFO] Apache Atlas Graph Database Projects ............... SUCCESS [  0.103 s]
[INFO] Apache Atlas Graph Database API .................... SUCCESS [  0.698 s]
[INFO] Graph Database Common Code ......................... SUCCESS [  0.853 s]
[INFO] Apache Atlas JanusGraph DB Impl .................... SUCCESS [02:11 min]
[INFO] Apache Atlas Graph Database Implementation Dependencies SUCCESS [  2.143 s]
[INFO] Shaded version of Apache hbase client .............. SUCCESS [  8.482 s]
[INFO] Apache Atlas Titan 0.5.4 Graph DB Impl ............. SUCCESS [ 30.007 s]
[INFO] Shaded version of Apache hbase server .............. SUCCESS [ 21.764 s]
[INFO] Apache Atlas Authorization ......................... SUCCESS [  2.749 s]
[INFO] Apache Atlas Repository ............................ FAILURE [02:46 min]
[INFO] Apache Atlas UI .................................... SKIPPED
[INFO] Apache Atlas Web Application ....................... SKIPPED
[INFO] Apache Atlas Documentation ......................... SKIPPED
[INFO] Apache Atlas FileSystem Model ...................... SKIPPED
[INFO] Apache Atlas Plugin Classloader .................... SKIPPED
[INFO] Apache Atlas Hive Bridge Shim ...................... SKIPPED
[INFO] Apache Atlas Hive Bridge ........................... SKIPPED
[INFO] Apache Atlas Falcon Bridge Shim .................... SKIPPED
[INFO] Apache Atlas Falcon Bridge ......................... SKIPPED
[INFO] Apache Atlas Sqoop Bridge Shim ..................... SKIPPED
[INFO] Apache Atlas Sqoop Bridge .......................... SKIPPED
[INFO] Apache Atlas Storm Bridge Shim ..................... SKIPPED
[INFO] Apache Atlas Storm Bridge .......................... SKIPPED
[INFO] Apache Atlas Hbase Bridge Shim ..................... SKIPPED
[INFO] Apache Atlas Hbase Bridge .......................... SKIPPED
[INFO] Apache Atlas Migration Exporter .................... SKIPPED
[INFO] Apache Atlas Distribution .......................... SKIPPED
[INFO] ------------------------------------------------------------------------
[INFO] BUILD FAILURE
[INFO] ------------------------------------------------------------------------
[INFO] Total time: 07:38 min
[INFO] Finished at: 2018-04-13T17:26:10Z
[INFO] Final Memory: 159M/1848M
[INFO] ------------------------------------------------------------------------
[ERROR] Failed to execute goal org.apache.maven.plugins:maven-surefire-plugin:2.18.1:test (default-test) on project atlas-repository: There are test failures.
[ERROR] 
[ERROR] Please refer to <https://builds.apache.org/job/PreCommit-ATLAS-Build-Test/ws/repository/target/surefire-reports> for the individual test results.
[ERROR] -> [Help 1]
[ERROR] 
[ERROR] To see the full stack trace of the errors, re-run Maven with the -e switch.
[ERROR] Re-run Maven using the -X switch to enable full debug logging.
[ERROR] 
[ERROR] For more information about the errors and possible solutions, please read the following articles:
[ERROR] [Help 1] http://cwiki.apache.org/confluence/display/MAVEN/MojoFailureException
[ERROR] 
[ERROR] After correcting the problems, you can resume the build with the command
[ERROR]   mvn <goals> -rf :atlas-repository




{color:green}+1 overall{color}.  

    {color:green}+1 @author{color}.  The patch does not contain any @author tags.

Test results: https://builds.apache.org/job/PreCommit-ATLAS-Build-Test/266//testReport/
Console output: https://builds.apache.org/job/PreCommit-ATLAS-Build-Test/266//console

This message is automatically generated.


======================================================================
======================================================================
    Adding comment to Jira.
======================================================================
======================================================================




======================================================================
======================================================================
    Finished build.
======================================================================
======================================================================


+ EXIT_CODE=0
+ '[' -d <https://builds.apache.org/job/PreCommit-ATLAS-Build-Test/ws/../atlas_patchprocess_7219> ']'
+ '[' -d <https://builds.apache.org/job/PreCommit-ATLAS-Build-Test/ws/atlas_patchprocess_7219> ']'
+ mv <https://builds.apache.org/job/PreCommit-ATLAS-Build-Test/ws/atlas_patchprocess_7219> <https://builds.apache.org/job/PreCommit-ATLAS-Build-Test/ws/patchprocess>
+ rm -f <https://builds.apache.org/job/PreCommit-ATLAS-Build-Test/ws/../atlas_patchprocess_7219>
+ exit 0
[description-setter] Could not determine description.
Set build name.
New build name is '#266-master-'
Archiving artifacts
ERROR: No artifacts found that match the file pattern "distro/target/*.tar.gz, webapp/target/*.war, **/target/**/*application.log". Configuration error?
ERROR: ?distro/target/*.tar.gz? doesn?t match anything: ?distro? exists but not ?distro/target/*.tar.gz?
Build step 'Archive the artifacts' changed build result to FAILURE

Build failed in Jenkins: PreCommit-ATLAS-Build-Test #265-master-ATLAS-2555-Add-support-for-BigDecimal-BigInteger-5.patch

Posted by Apache Jenkins Server <je...@builds.apache.org>.
See <https://builds.apache.org/job/PreCommit-ATLAS-Build-Test/265/display/redirect?page=changes>

Changes:

[madhan] ATLAS-2557: updated groups lookup for logged in user with an option to

------------------------------------------
Started by user amestry
[EnvInject] - Loading node environment variables.
Building remotely on H0 (Hadoop) in workspace <https://builds.apache.org/job/PreCommit-ATLAS-Build-Test/ws/>
[WS-CLEANUP] Deleting project workspace...
[WS-CLEANUP] Done
Cloning the remote Git repository
Cloning repository http://git-wip-us.apache.org/repos/asf/atlas.git
 > git init <https://builds.apache.org/job/PreCommit-ATLAS-Build-Test/ws/> # timeout=10
Fetching upstream changes from http://git-wip-us.apache.org/repos/asf/atlas.git
 > git --version # timeout=10
 > git fetch --tags --progress http://git-wip-us.apache.org/repos/asf/atlas.git +refs/heads/*:refs/remotes/origin/*
 > git config remote.origin.url http://git-wip-us.apache.org/repos/asf/atlas.git # timeout=10
 > git config --add remote.origin.fetch +refs/heads/*:refs/remotes/origin/* # timeout=10
 > git config remote.origin.url http://git-wip-us.apache.org/repos/asf/atlas.git # timeout=10
Fetching upstream changes from http://git-wip-us.apache.org/repos/asf/atlas.git
 > git fetch --tags --progress http://git-wip-us.apache.org/repos/asf/atlas.git +refs/heads/*:refs/remotes/origin/*
 > git rev-parse origin/master^{commit} # timeout=10
Checking out Revision 7515915f6b52cdfd0f7e5e32a17f6f6cfae6b37d (origin/master)
 > git config core.sparsecheckout # timeout=10
 > git checkout -f 7515915f6b52cdfd0f7e5e32a17f6f6cfae6b37d
Commit message: "ATLAS-2557: updated groups lookup for logged in user with an option to include groups from Hadoop config"
 > git rev-list --no-walk b1907a332e3cd0eeab0520e1d93cf8605eae4f8c # timeout=10
[EnvInject] - Mask passwords that will be passed as build parameters.
Set build name.
New build name is '#265-master-ATLAS-2555-Add-support-for-BigDecimal-BigInteger-5.patch'
Copying file to LOCAL_PATCH
[PreCommit-ATLAS-Build-Test] $ /bin/bash /tmp/jenkins8003689597013146973.sh
+ export TOOLS_HOME=/home/jenkins/tools
+ TOOLS_HOME=/home/jenkins/tools
+ export ANT_HOME=/home/jenkins/tools/ant/latest
+ ANT_HOME=/home/jenkins/tools/ant/latest
+ export FORREST_HOME=/home/jenkins/tools/forrest/latest
+ FORREST_HOME=/home/jenkins/tools/forrest/latest
+ export JAVA5_HOME=/home/jenkins/tools/java/latest1.5
+ JAVA5_HOME=/home/jenkins/tools/java/latest1.5
+ export FINDBUGS_HOME=/home/jenkins/tools/findbugs/latest
+ FINDBUGS_HOME=/home/jenkins/tools/findbugs/latest
+ export CLOVER_HOME=/home/jenkins/tools/clover/latest
+ CLOVER_HOME=/home/jenkins/tools/clover/latest
+ export MAVEN_HOME=/home/jenkins/tools/maven/latest
+ MAVEN_HOME=/home/jenkins/tools/maven/latest
+ export PATH=/home/jenkins/tools/java/latest1.8/bin:/usr/local/sbin:/usr/local/bin:/usr/sbin:/usr/bin:/sbin:/bin:/usr/games:/usr/local/games:/home/jenkins/tools/java/latest1.8/bin:/home/jenkins/tools/ant/latest/bin:/home/jenkins/tools/maven/latest/bin
+ PATH=/home/jenkins/tools/java/latest1.8/bin:/usr/local/sbin:/usr/local/bin:/usr/sbin:/usr/bin:/sbin:/bin:/usr/games:/usr/local/games:/home/jenkins/tools/java/latest1.8/bin:/home/jenkins/tools/ant/latest/bin:/home/jenkins/tools/maven/latest/bin
+ export 'MAVEN_OPTS=-Xmx4096m -XX:MaxPermSize=1024m -Dfile.encoding=UTF-8 -noverify'
+ MAVEN_OPTS='-Xmx4096m -XX:MaxPermSize=1024m -Dfile.encoding=UTF-8 -noverify'
+ export 'ANT_OPTS=-Xmx4096m -XX:MaxPermSize=1024m -Dfile.encoding=UTF-8 -noverify'
+ ANT_OPTS='-Xmx4096m -XX:MaxPermSize=1024m -Dfile.encoding=UTF-8 -noverify'
+ env
BUILD_URL=https://builds.apache.org/job/PreCommit-ATLAS-Build-Test/265/
XDG_SESSION_ID=57
SKIP_UT=false
ISSUE_NUM=ATLAS-2555
HUDSON_SERVER_COOKIE=f4ebd1e6b0d976e8
SHELL=/bin/bash
FORREST_HOME=/home/jenkins/tools/forrest/latest
SSH_CLIENT=62.210.60.235 53050 22
TOOLS_HOME=/home/jenkins/tools
BUILD_TAG=jenkins-PreCommit-ATLAS-Build-Test-265
GIT_PREVIOUS_COMMIT=b1907a332e3cd0eeab0520e1d93cf8605eae4f8c
ROOT_BUILD_CAUSE=MANUALTRIGGER
ANT_HOME=/home/jenkins/tools/ant/latest
WORKSPACE=<https://builds.apache.org/job/PreCommit-ATLAS-Build-Test/ws/>
JOB_URL=https://builds.apache.org/job/PreCommit-ATLAS-Build-Test/
ANT_OPTS=-Xmx4096m -XX:MaxPermSize=1024m -Dfile.encoding=UTF-8 -noverify
BRANCH=master
RUN_CHANGES_DISPLAY_URL=https://builds.apache.org/job/PreCommit-ATLAS-Build-Test/265/display/redirect?page=changes
USER=jenkins
GIT_AUTHOR_NAME=jenkins
GIT_COMMITTER_NAME=jenkins
MAVEN_OPTS=-Xmx4096m -XX:MaxPermSize=1024m -Dfile.encoding=UTF-8 -noverify
NLSPATH=/usr/dt/lib/nls/msg/%L/%N.cat
GIT_COMMIT=7515915f6b52cdfd0f7e5e32a17f6f6cfae6b37d
JENKINS_HOME=/x1/jenkins/jenkins-home
MAVEN_HOME=/home/jenkins/tools/maven/latest
MAIL=/var/mail/jenkins
PATH=/home/jenkins/tools/java/latest1.8/bin:/usr/local/sbin:/usr/local/bin:/usr/sbin:/usr/bin:/sbin:/bin:/usr/games:/usr/local/games:/home/jenkins/tools/java/latest1.8/bin:/home/jenkins/tools/ant/latest/bin:/home/jenkins/tools/maven/latest/bin
RUN_DISPLAY_URL=https://builds.apache.org/job/PreCommit-ATLAS-Build-Test/265/display/redirect
BUILD_CAUSE_MANUALTRIGGER=true
GIT_COMMITTER_EMAIL=builds@apache.org
PWD=<https://builds.apache.org/job/PreCommit-ATLAS-Build-Test/ws/>
JAVA_HOME=/home/jenkins/tools/java/latest1.8
HUDSON_URL=https://builds.apache.org/
LANG=en_US
JOB_NAME=PreCommit-ATLAS-Build-Test
XFILESEARCHPATH=/usr/dt/app-defaults/%L/Dt
BUILD_DISPLAY_NAME=#265-master-ATLAS-2555-Add-support-for-BigDecimal-BigInteger-5.patch
BUILD_CAUSE=MANUALTRIGGER
BUILD_ID=265
JENKINS_URL=https://builds.apache.org/
WIN_LABEL=Windows
CLOVER_HOME=/home/jenkins/tools/clover/latest
JOB_BASE_NAME=PreCommit-ATLAS-Build-Test
GIT_PREVIOUS_SUCCESSFUL_COMMIT=b1907a332e3cd0eeab0520e1d93cf8605eae4f8c
HOME=/home/jenkins
SHLVL=2
LOCAL_PATCH=ATLAS-2555-Add-support-for-BigDecimal-BigInteger-5.patch
GIT_BRANCH=origin/master
BUILD_PASSWORD=[*******]
EXECUTOR_NUMBER=1
JENKINS_SERVER_COOKIE=f4ebd1e6b0d976e8
GIT_URL=http://git-wip-us.apache.org/repos/asf/atlas.git
NODE_LABELS=H0 Hadoop
LOGNAME=jenkins
REVIEWBOARD_ID=https://reviews.apache.org/r/66534/
SSH_CONNECTION=62.210.60.235 53050 67.195.81.144 22
HUDSON_HOME=/x1/jenkins/jenkins-home
NODE_NAME=H0
NIX_LABEL=ubuntu
SKIP_IT=false
BUILD_NUMBER=265
JOB_DISPLAY_URL=https://builds.apache.org/job/PreCommit-ATLAS-Build-Test/display/redirect
XDG_RUNTIME_DIR=/run/user/910
ROOT_BUILD_CAUSE_MANUALTRIGGER=true
HUDSON_COOKIE=d64b6c3d-12fd-479b-ba46-c05c07c92f9c
GIT_AUTHOR_EMAIL=builds@apache.org
JAVA5_HOME=/home/jenkins/tools/java/latest1.5
FINDBUGS_HOME=/home/jenkins/tools/findbugs/latest
_=/usr/bin/env
+ java -version
java version "1.8.0_152"
Java(TM) SE Runtime Environment (build 1.8.0_152-b16)
Java HotSpot(TM) 64-Bit Server VM (build 25.152-b16, mixed mode)
+ PP_DIR=atlas_patchprocess_5430
+ PATCHPROCESS=<https://builds.apache.org/job/PreCommit-ATLAS-Build-Test/ws/../atlas_patchprocess_5430>
+ mkdir -p <https://builds.apache.org/job/PreCommit-ATLAS-Build-Test/ws/../atlas_patchprocess_5430>
+ cd <https://builds.apache.org/job/PreCommit-ATLAS-Build-Test/ws/>
+ LOCAL_PATCH_FILE=<https://builds.apache.org/job/PreCommit-ATLAS-Build-Test/ws/LOCAL_PATCH>
+ '[' -f <https://builds.apache.org/job/PreCommit-ATLAS-Build-Test/ws/LOCAL_PATCH> ']'
+ echo 'Local Patch in <https://builds.apache.org/job/PreCommit-ATLAS-Build-Test/ws/LOCAL_PATCH> found.'
Local Patch in <https://builds.apache.org/job/PreCommit-ATLAS-Build-Test/ws/LOCAL_PATCH> found.
+ mv <https://builds.apache.org/job/PreCommit-ATLAS-Build-Test/ws/LOCAL_PATCH> <https://builds.apache.org/job/PreCommit-ATLAS-Build-Test/ws/../atlas_patchprocess_5430/patch>
+ /bin/bash <https://builds.apache.org/job/PreCommit-ATLAS-Build-Test/ws/dev-support/test-patch.sh> --jenkins --patch-dir=<https://builds.apache.org/job/PreCommit-ATLAS-Build-Test/ws/../atlas_patchprocess_5430> --basedir=<https://builds.apache.org/job/PreCommit-ATLAS-Build-Test/ws/> --support-dir=/home/jenkins/buildSupport --ps-cmd=/bin/ps --wget-cmd=/usr/bin/wget --svn-cmd=/usr/bin/svn --grep-cmd=/bin/grep --patch-cmd=/usr/bin/patch --jira-cmd=/home/jenkins/tools/jiracli/latest/jira --jira-password=[*******] --review-id=https://reviews.apache.org/r/66534/ --local-patch=<https://builds.apache.org/job/PreCommit-ATLAS-Build-Test/ws/LOCAL_PATCH> --skip-ut=false --skip-it=false --branch=master --findbugs-home=/home/jenkins/tools/findbugs/latest --forrest-home=/home/jenkins/tools/forrest/latest --eclipse--home=/home/jenkins/tools/eclipse/latest ATLAS-ATLAS-2555
Running in Jenkins mode


======================================================================
======================================================================
    Testing patch for ATLAS-ATLAS-2555.
======================================================================
======================================================================


HEAD is now at 7515915 ATLAS-2557: updated groups lookup for logged in user with an option to include groups from Hadoop config
Switched to a new branch 'master'
Branch master set up to track remote branch master from origin.
Current branch master is up to date.
Download Patch from Review Board: https://reviews.apache.org/r/https://reviews.apache.org/r/66534//diff/raw at Fri Apr 13 17:06:59 UTC 2018
Error: Patch dryrun couldn't detect changes the patch would make. Exiting.
PATCH APPLICATION FAILED




{color:red}-1 overall{color}.  

    {color:red}-1 patch{color}.  The patch command could not apply the patch.

Console output: https://builds.apache.org/job/PreCommit-ATLAS-Build-Test/265//console

This message is automatically generated.


======================================================================
======================================================================
    Adding comment to Jira.
======================================================================
======================================================================




======================================================================
======================================================================
    Finished build.
======================================================================
======================================================================


+ EXIT_CODE=1
+ '[' -d <https://builds.apache.org/job/PreCommit-ATLAS-Build-Test/ws/../atlas_patchprocess_5430> ']'
+ '[' -d <https://builds.apache.org/job/PreCommit-ATLAS-Build-Test/ws/atlas_patchprocess_5430> ']'
+ mv <https://builds.apache.org/job/PreCommit-ATLAS-Build-Test/ws/atlas_patchprocess_5430> <https://builds.apache.org/job/PreCommit-ATLAS-Build-Test/ws/patchprocess>
+ rm -f <https://builds.apache.org/job/PreCommit-ATLAS-Build-Test/ws/../atlas_patchprocess_5430>
+ exit 1
Build step 'Execute shell' marked build as failure
Set build name.
New build name is '#265-master-ATLAS-2555-Add-support-for-BigDecimal-BigInteger-5.patch'
Archiving artifacts